En échecSortie de la console
Ignore 66 484 Ko.
Log completTestTestTestTestTestTestTestTestTestTestTestTestTestTestTestTestTestTestTestTestTestTestTestTestTestTestTestTestTestTestTestTestTestTestTestTestTestTestTestTestTestTestTestTestTestTestTestTestTestTestTestTestTestTestTestTestTestTestTestTestTestTestTestTestTestTestTestTestTestTestTestTestTestTestTestTestTestTestTestTestTestTestTestTestTestTestTestTestTestTestTestTestTestTestTestTestTestTestTestTestTestTestTestTestTestTestTestTestTestTestTestTestTestTestTestTestTestTestTestTestTestTestTestTestTestTestTestTestTestTestTestTestTestTestTestTestTestTestTestTestTestTestTestTestTestTestTestTestTestTestTestTestTestTestTestTestTestTestTestTestTestTestTestTestTestTestTestTestTestTestTestTestTestTestTestTestTestTestTestTestTestTestTestTestTestTestTestTestTestTestTestTestTestTestTestTestTestTestTestTestTestTestTestTestTestTestTestTestTest
08:24:34 [2025-04-03T06:24:34.369Z] warning: unknown enum constant XmlAccessType.FIELD
08:24:34 [2025-04-03T06:24:34.369Z] warning: unknown enum constant XmlAccessType.FIELD
08:24:34 [2025-04-03T06:24:34.369Z] reason: class file for javax.xml.bind.annotation.XmlAccessType not found
08:24:34 [2025-04-03T06:24:34.369Z] warning: unknown enum constant XmlAccessType.FIELD
08:24:34 [2025-04-03T06:24:34.369Z] warning: unknown enum constant XmlAccessType.FIELD
08:24:34 [2025-04-03T06:24:34.369Z] reason: class file for javax.xml.bind.annotation.XmlAccessType not found
08:24:34 [2025-04-03T06:24:34.369Z] warning: unknown enum constant XmlAccessType.FIELD
08:24:34 [2025-04-03T06:24:34.369Z] warning: unknown enum constant XmlAccessType.FIELD
08:24:34 [2025-04-03T06:24:34.369Z] warning: unknown enum constant XmlAccessType.FIELD
08:24:34 [2025-04-03T06:24:34.369Z] /var/lib/jenkins/workspace/Silverpeas_Stable_AutoDeploy/Silverpeas-Components/infoLetter/infoLetter-war/src/main/java/org/silverpeas/components/infoletter/control/InfoLetterSessionController.java:[260,50] [deprecation] IdPK in org.silverpeas.core.persistence.jdbc.bean has been deprecated
08:24:34 [2025-04-03T06:24:34.369Z] [WARNING] /var/lib/jenkins/workspace/Silverpeas_Stable_AutoDeploy/Silverpeas-Components/infoLetter/infoLetter-war/src/main/java/org/silverpeas/components/infoletter/control/InfoLetterSessionController.java:[271,54] [deprecation] IdPK in org.silverpeas.core.persistence.jdbc.bean has been deprecated
08:24:34 [2025-04-03T06:24:34.369Z] [WARNING] /var/lib/jenkins/workspace/Silverpeas_Stable_AutoDeploy/Silverpeas-Components/infoLetter/infoLetter-war/src/main/java/org/silverpeas/components/infoletter/control/InfoLetterSessionController.java:[416,13] [deprecation] UtilTrappedException in org.silverpeas.core.exception has been deprecated
08:24:34 [2025-04-03T06:24:34.369Z] [WARNING] /var/lib/jenkins/workspace/Silverpeas_Stable_AutoDeploy/Silverpeas-Components/infoLetter/infoLetter-war/src/main/java/org/silverpeas/components/infoletter/control/InfoLetterSessionController.java:[416,13] [deprecation] UtilTrappedException in org.silverpeas.core.exception has been deprecated
08:24:34 [2025-04-03T06:24:34.369Z] [WARNING] /var/lib/jenkins/workspace/Silverpeas_Stable_AutoDeploy/Silverpeas-Components/infoLetter/infoLetter-war/src/main/java/org/silverpeas/components/infoletter/control/InfoLetterSessionController.java:[416,13] [deprecation] UtilTrappedException in org.silverpeas.core.exception has been deprecated
08:24:34 [2025-04-03T06:24:34.369Z] [WARNING] /var/lib/jenkins/workspace/Silverpeas_Stable_AutoDeploy/Silverpeas-Components/infoLetter/infoLetter-war/src/main/java/org/silverpeas/components/infoletter/control/InfoLetterSessionController.java:[423,14] [deprecation] SilverpeasException in org.silverpeas.core.exception has been deprecated
08:24:34 [2025-04-03T06:24:34.369Z] [WARNING] /var/lib/jenkins/workspace/Silverpeas_Stable_AutoDeploy/Silverpeas-Components/infoLetter/infoLetter-war/src/main/java/org/silverpeas/components/infoletter/control/InfoLetterSessionController.java:[433,13] [deprecation] UtilTrappedException in org.silverpeas.core.exception has been deprecated
08:24:34 [2025-04-03T06:24:34.369Z] [WARNING] /var/lib/jenkins/workspace/Silverpeas_Stable_AutoDeploy/Silverpeas-Components/infoLetter/infoLetter-war/src/main/java/org/silverpeas/components/infoletter/control/InfoLetterSessionController.java:[463,14] [deprecation] SilverpeasException in org.silverpeas.core.exception has been deprecated
08:24:34 [2025-04-03T06:24:34.369Z] [WARNING] /var/lib/jenkins/workspace/Silverpeas_Stable_AutoDeploy/Silverpeas-Components/infoLetter/infoLetter-war/src/main/java/org/silverpeas/components/infoletter/servlets/GoToNewsletter.java:[43,4] [deprecation] IdPK in org.silverpeas.core.persistence.jdbc.bean has been deprecated
08:24:34 [2025-04-03T06:24:34.369Z] [WARNING] /var/lib/jenkins/workspace/Silverpeas_Stable_AutoDeploy/Silverpeas-Components/infoLetter/infoLetter-war/src/main/java/org/silverpeas/components/infoletter/servlets/GoToNewsletter.java:[43,18] [deprecation] IdPK in org.silverpeas.core.persistence.jdbc.bean has been deprecated
08:24:34 [2025-04-03T06:24:34.369Z] [INFO]
08:24:34 [2025-04-03T06:24:34.369Z] [INFO] --- build-helper-maven-plugin:3.3.0:add-test-source (add-integration-test-sources) @ silverpeas-infoletter-war ---
08:24:34 [2025-04-03T06:24:34.369Z] [INFO] Test Source directory: /var/lib/jenkins/workspace/Silverpeas_Stable_AutoDeploy/Silverpeas-Components/infoLetter/infoLetter-war/src/integration-test/java added.
08:24:34 [2025-04-03T06:24:34.369Z] [INFO]
08:24:34 [2025-04-03T06:24:34.369Z] [INFO] --- build-helper-maven-plugin:3.3.0:add-test-resource (add-integration-test-sources) @ silverpeas-infoletter-war ---
08:24:34 [2025-04-03T06:24:34.369Z] [INFO]
08:24:34 [2025-04-03T06:24:34.369Z] [INFO] --- maven-resources-plugin:3.3.0:testResources (default-testResources) @ silverpeas-infoletter-war ---
08:24:34 [2025-04-03T06:24:34.369Z] [INFO] Not copying test resources
08:24:34 [2025-04-03T06:24:34.369Z] [INFO]
08:24:34 [2025-04-03T06:24:34.369Z] [INFO] --- maven-compiler-plugin:3.10.1:testCompile (default-testCompile) @ silverpeas-infoletter-war ---
08:24:34 [2025-04-03T06:24:34.369Z] [INFO] Not compiling test sources
08:24:34 [2025-04-03T06:24:34.369Z] [INFO]
08:24:34 [2025-04-03T06:24:34.369Z] [INFO] --- maven-surefire-plugin:2.22.2:test (default-test) @ silverpeas-infoletter-war ---
08:24:34 [2025-04-03T06:24:34.369Z] [INFO] No tests to run.
08:24:34 [2025-04-03T06:24:34.369Z] [INFO]
08:24:34 [2025-04-03T06:24:34.369Z] [INFO] --- maven-war-plugin:3.3.2:war (default-war) @ silverpeas-infoletter-war ---
08:24:34 [2025-04-03T06:24:34.369Z] [INFO] Packaging webapp
08:24:34 [2025-04-03T06:24:34.369Z] [INFO] Assembling webapp [silverpeas-infoletter-war] in [/var/lib/jenkins/workspace/Silverpeas_Stable_AutoDeploy/Silverpeas-Components/infoLetter/infoLetter-war/target/silverpeas-infoletter-war-6.4.3-build250403]
08:24:34 [2025-04-03T06:24:34.369Z] [INFO] Processing war project
08:24:34 [2025-04-03T06:24:34.370Z] [INFO] Copying webapp resources [/var/lib/jenkins/workspace/Silverpeas_Stable_AutoDeploy/Silverpeas-Components/infoLetter/infoLetter-war/src/main/webapp]
08:24:34 [2025-04-03T06:24:34.370Z] [INFO] Building war: /var/lib/jenkins/workspace/Silverpeas_Stable_AutoDeploy/Silverpeas-Components/infoLetter/infoLetter-war/target/silverpeas-infoletter-war-6.4.3-build250403.war
08:24:34 [2025-04-03T06:24:34.620Z] [INFO]
08:24:34 [2025-04-03T06:24:34.620Z] [INFO] --- maven-site-plugin:3.12.1:attach-descriptor (attach-descriptor) @ silverpeas-infoletter-war ---
08:24:34 [2025-04-03T06:24:34.620Z] [INFO] Skipping because packaging 'war' is not pom.
08:24:34 [2025-04-03T06:24:34.620Z] [INFO]
08:24:34 [2025-04-03T06:24:34.620Z] [INFO] --- maven-source-plugin:3.2.1:jar-no-fork (bundle-source) @ silverpeas-infoletter-war ---
08:24:34 [2025-04-03T06:24:34.620Z] [INFO] Building jar: /var/lib/jenkins/workspace/Silverpeas_Stable_AutoDeploy/Silverpeas-Components/infoLetter/infoLetter-war/target/silverpeas-infoletter-war-6.4.3-build250403-sources.jar
08:24:34 [2025-04-03T06:24:34.620Z] [INFO]
08:24:34 [2025-04-03T06:24:34.620Z] [INFO] --- maven-failsafe-plugin:2.22.2:integration-test (default) @ silverpeas-infoletter-war ---
08:24:34 [2025-04-03T06:24:34.620Z] [INFO] Tests are skipped.
08:24:34 [2025-04-03T06:24:34.620Z] [INFO]
08:24:34 [2025-04-03T06:24:34.620Z] [INFO] --- maven-javadoc-plugin:3.4.1:jar (attach-javadocs) @ silverpeas-infoletter-war ---
08:24:34 [2025-04-03T06:24:34.871Z] [INFO] No previous run data found, generating javadoc.
08:24:37 [2025-04-03T06:24:37.354Z] [INFO]
08:24:37 [2025-04-03T06:24:37.354Z] 2 warnings
08:24:37 [2025-04-03T06:24:37.354Z] [WARNING] Javadoc Warnings
08:24:37 [2025-04-03T06:24:37.354Z] [WARNING] warning: unknown enum constant XmlAccessType.FIELD
08:24:37 [2025-04-03T06:24:37.354Z] [WARNING] reason: class file for javax.xml.bind.annotation.XmlAccessType not found
08:24:37 [2025-04-03T06:24:37.354Z] [WARNING] warning: unknown enum constant XmlAccessType.FIELD
08:24:37 [2025-04-03T06:24:37.604Z] [INFO] Building jar: /var/lib/jenkins/workspace/Silverpeas_Stable_AutoDeploy/Silverpeas-Components/infoLetter/infoLetter-war/target/silverpeas-infoletter-war-6.4.3-build250403-javadoc.jar
08:24:37 [2025-04-03T06:24:37.604Z] [INFO]
08:24:37 [2025-04-03T06:24:37.604Z] [INFO] --- maven-source-plugin:3.2.1:jar-no-fork (attach-sources) @ silverpeas-infoletter-war ---
08:24:37 [2025-04-03T06:24:37.604Z] [INFO] Building jar: /var/lib/jenkins/workspace/Silverpeas_Stable_AutoDeploy/Silverpeas-Components/infoLetter/infoLetter-war/target/silverpeas-infoletter-war-6.4.3-build250403-sources.jar
08:24:37 [2025-04-03T06:24:37.604Z] [WARNING] artifact org.silverpeas.components.infoletter:silverpeas-infoletter-war:java-source:sources:6.4.3-build250403 already attached, replace previous instance
08:24:37 [2025-04-03T06:24:37.604Z] [INFO]
08:24:37 [2025-04-03T06:24:37.604Z] [INFO] --- maven-failsafe-plugin:2.22.2:verify (default) @ silverpeas-infoletter-war ---
08:24:37 [2025-04-03T06:24:37.604Z] [INFO] Tests are skipped.
08:24:37 [2025-04-03T06:24:37.604Z] [INFO]
08:24:37 [2025-04-03T06:24:37.604Z] [INFO] --- maven-install-plugin:3.0.1:install (default-install) @ silverpeas-infoletter-war ---
08:24:37 [2025-04-03T06:24:37.604Z] [INFO] Installing /var/lib/jenkins/workspace/Silverpeas_Stable_AutoDeploy/Silverpeas-Components/infoLetter/infoLetter-war/pom.xml to /home/silverbuild/.m2/repository/org/silverpeas/components/infoletter/silverpeas-infoletter-war/6.4.3-build250403/silverpeas-infoletter-war-6.4.3-build250403.pom
08:24:37 [2025-04-03T06:24:37.604Z] [INFO] Installing /var/lib/jenkins/workspace/Silverpeas_Stable_AutoDeploy/Silverpeas-Components/infoLetter/infoLetter-war/target/silverpeas-infoletter-war-6.4.3-build250403.war to /home/silverbuild/.m2/repository/org/silverpeas/components/infoletter/silverpeas-infoletter-war/6.4.3-build250403/silverpeas-infoletter-war-6.4.3-build250403.war
08:24:37 [2025-04-03T06:24:37.605Z] [INFO] Installing /var/lib/jenkins/workspace/Silverpeas_Stable_AutoDeploy/Silverpeas-Components/infoLetter/infoLetter-war/target/silverpeas-infoletter-war-6.4.3-build250403-sources.jar to /home/silverbuild/.m2/repository/org/silverpeas/components/infoletter/silverpeas-infoletter-war/6.4.3-build250403/silverpeas-infoletter-war-6.4.3-build250403-sources.jar
08:24:37 [2025-04-03T06:24:37.605Z] [INFO] Installing /var/lib/jenkins/workspace/Silverpeas_Stable_AutoDeploy/Silverpeas-Components/infoLetter/infoLetter-war/target/silverpeas-infoletter-war-6.4.3-build250403-javadoc.jar to /home/silverbuild/.m2/repository/org/silverpeas/components/infoletter/silverpeas-infoletter-war/6.4.3-build250403/silverpeas-infoletter-war-6.4.3-build250403-javadoc.jar
08:24:37 [2025-04-03T06:24:37.605Z] [INFO]
08:24:37 [2025-04-03T06:24:37.605Z] [INFO] -----------------< org.silverpeas.components:almanach >-----------------
08:24:37 [2025-04-03T06:24:37.605Z] [INFO] Building Silverpeas Almanach Component 6.4.3-build250403 [60/129]
08:24:37 [2025-04-03T06:24:37.605Z] [INFO] from almanach/pom.xml
08:24:37 [2025-04-03T06:24:37.605Z] [INFO] --------------------------------[ pom ]---------------------------------
08:24:37 [2025-04-03T06:24:37.605Z] [INFO]
08:24:37 [2025-04-03T06:24:37.605Z] [INFO] --- maven-clean-plugin:3.2.0:clean (default-clean) @ almanach ---
08:24:37 [2025-04-03T06:24:37.605Z] [INFO] Deleting /var/lib/jenkins/workspace/Silverpeas_Stable_AutoDeploy/Silverpeas-Components/almanach/target
08:24:37 [2025-04-03T06:24:37.605Z] [INFO]
08:24:37 [2025-04-03T06:24:37.605Z] [INFO] --- git-commit-id-plugin:4.9.10:revision (default) @ almanach ---
08:24:37 [2025-04-03T06:24:37.605Z] [INFO]
08:24:37 [2025-04-03T06:24:37.605Z] [INFO] --- silverpeas-ui-compressor-maven-plugin:1.7:jslint (default) @ almanach ---
08:24:37 [2025-04-03T06:24:37.605Z] [INFO] nb warnings: 0, nb errors: 0
08:24:37 [2025-04-03T06:24:37.605Z] [INFO]
08:24:37 [2025-04-03T06:24:37.605Z] [INFO] --- silverpeas-ui-compressor-maven-plugin:1.7:compress (default) @ almanach ---
08:24:37 [2025-04-03T06:24:37.605Z] [INFO] nb warnings: 0, nb errors: 0
08:24:37 [2025-04-03T06:24:37.605Z] [INFO]
08:24:37 [2025-04-03T06:24:37.605Z] [INFO] --- build-helper-maven-plugin:3.3.0:add-test-source (add-integration-test-sources) @ almanach ---
08:24:37 [2025-04-03T06:24:37.605Z] [INFO] Test Source directory: /var/lib/jenkins/workspace/Silverpeas_Stable_AutoDeploy/Silverpeas-Components/almanach/src/integration-test/java added.
08:24:37 [2025-04-03T06:24:37.605Z] [INFO]
08:24:37 [2025-04-03T06:24:37.605Z] [INFO] --- build-helper-maven-plugin:3.3.0:add-test-resource (add-integration-test-sources) @ almanach ---
08:24:37 [2025-04-03T06:24:37.605Z] [INFO]
08:24:37 [2025-04-03T06:24:37.605Z] [INFO] --- maven-site-plugin:3.12.1:attach-descriptor (attach-descriptor) @ almanach ---
08:24:37 [2025-04-03T06:24:37.605Z] [INFO] No site descriptor found: nothing to attach.
08:24:37 [2025-04-03T06:24:37.605Z] [INFO]
08:24:37 [2025-04-03T06:24:37.605Z] [INFO] --- maven-source-plugin:3.2.1:jar-no-fork (bundle-source) @ almanach ---
08:24:37 [2025-04-03T06:24:37.605Z] [INFO]
08:24:37 [2025-04-03T06:24:37.605Z] [INFO] --- maven-failsafe-plugin:2.22.2:integration-test (default) @ almanach ---
08:24:37 [2025-04-03T06:24:37.605Z] [INFO] Tests are skipped.
08:24:37 [2025-04-03T06:24:37.605Z] [INFO]
08:24:37 [2025-04-03T06:24:37.605Z] [INFO] --- maven-javadoc-plugin:3.4.1:jar (attach-javadocs) @ almanach ---
08:24:37 [2025-04-03T06:24:37.605Z] [INFO] Not executing Javadoc as the project is not a Java classpath-capable package
08:24:37 [2025-04-03T06:24:37.605Z] [INFO]
08:24:37 [2025-04-03T06:24:37.605Z] [INFO] --- maven-source-plugin:3.2.1:jar-no-fork (attach-sources) @ almanach ---
08:24:37 [2025-04-03T06:24:37.605Z] [INFO]
08:24:37 [2025-04-03T06:24:37.605Z] [INFO] --- maven-failsafe-plugin:2.22.2:verify (default) @ almanach ---
08:24:37 [2025-04-03T06:24:37.605Z] [INFO] Tests are skipped.
08:24:37 [2025-04-03T06:24:37.605Z] [INFO]
08:24:37 [2025-04-03T06:24:37.605Z] [INFO] --- maven-install-plugin:3.0.1:install (default-install) @ almanach ---
08:24:37 [2025-04-03T06:24:37.605Z] [INFO] Installing /var/lib/jenkins/workspace/Silverpeas_Stable_AutoDeploy/Silverpeas-Components/almanach/pom.xml to /home/silverbuild/.m2/repository/org/silverpeas/components/almanach/6.4.3-build250403/almanach-6.4.3-build250403.pom
08:24:37 [2025-04-03T06:24:37.605Z] [INFO]
08:24:37 [2025-04-03T06:24:37.605Z] [INFO] --< org.silverpeas.components.almanach:silverpeas-almanach-configuration >--
08:24:37 [2025-04-03T06:24:37.605Z] [INFO] Building Almanach Configuration 6.4.3-build250403 [61/129]
08:24:37 [2025-04-03T06:24:37.605Z] [INFO] from almanach/almanach-configuration/pom.xml
08:24:37 [2025-04-03T06:24:37.605Z] [INFO] --------------------------------[ jar ]---------------------------------
08:24:37 [2025-04-03T06:24:37.605Z] [INFO]
08:24:37 [2025-04-03T06:24:37.605Z] [INFO] --- maven-clean-plugin:3.2.0:clean (default-clean) @ silverpeas-almanach-configuration ---
08:24:37 [2025-04-03T06:24:37.605Z] [INFO] Deleting /var/lib/jenkins/workspace/Silverpeas_Stable_AutoDeploy/Silverpeas-Components/almanach/almanach-configuration/target
08:24:37 [2025-04-03T06:24:37.605Z] [INFO]
08:24:37 [2025-04-03T06:24:37.605Z] [INFO] --- git-commit-id-plugin:4.9.10:revision (default) @ silverpeas-almanach-configuration ---
08:24:38 [2025-04-03T06:24:38.948Z] [INFO]
08:24:38 [2025-04-03T06:24:38.948Z] [INFO] --- maven-resources-plugin:3.3.0:resources (default-resources) @ silverpeas-almanach-configuration ---
08:24:38 [2025-04-03T06:24:38.948Z] [INFO] Copying 25 resources
08:24:38 [2025-04-03T06:24:38.948Z] [INFO]
08:24:38 [2025-04-03T06:24:38.948Z] [INFO] --- silverpeas-ui-compressor-maven-plugin:1.7:jslint (default) @ silverpeas-almanach-configuration ---
08:24:38 [2025-04-03T06:24:38.948Z] [INFO] nb warnings: 0, nb errors: 0
08:24:38 [2025-04-03T06:24:38.948Z] [INFO]
08:24:38 [2025-04-03T06:24:38.948Z] [INFO] --- silverpeas-ui-compressor-maven-plugin:1.7:compress (default) @ silverpeas-almanach-configuration ---
08:24:38 [2025-04-03T06:24:38.948Z] [INFO] nb warnings: 0, nb errors: 0
08:24:38 [2025-04-03T06:24:38.948Z] [INFO]
08:24:38 [2025-04-03T06:24:38.948Z] [INFO] --- maven-compiler-plugin:3.10.1:compile (default-compile) @ silverpeas-almanach-configuration ---
08:24:38 [2025-04-03T06:24:38.948Z] [INFO] No sources to compile
08:24:38 [2025-04-03T06:24:38.948Z] [INFO]
08:24:38 [2025-04-03T06:24:38.948Z] [INFO] --- build-helper-maven-plugin:3.3.0:add-test-source (add-integration-test-sources) @ silverpeas-almanach-configuration ---
08:24:38 [2025-04-03T06:24:38.948Z] [INFO] Test Source directory: /var/lib/jenkins/workspace/Silverpeas_Stable_AutoDeploy/Silverpeas-Components/almanach/almanach-configuration/src/integration-test/java added.
08:24:38 [2025-04-03T06:24:38.948Z] [INFO]
08:24:38 [2025-04-03T06:24:38.948Z] [INFO] --- build-helper-maven-plugin:3.3.0:add-test-resource (add-integration-test-sources) @ silverpeas-almanach-configuration ---
08:24:38 [2025-04-03T06:24:38.948Z] [INFO]
08:24:38 [2025-04-03T06:24:38.948Z] [INFO] --- maven-resources-plugin:3.3.0:testResources (default-testResources) @ silverpeas-almanach-configuration ---
08:24:38 [2025-04-03T06:24:38.948Z] [INFO] Not copying test resources
08:24:38 [2025-04-03T06:24:38.948Z] [INFO]
08:24:38 [2025-04-03T06:24:38.948Z] [INFO] --- maven-compiler-plugin:3.10.1:testCompile (default-testCompile) @ silverpeas-almanach-configuration ---
08:24:38 [2025-04-03T06:24:38.948Z] [INFO] Not compiling test sources
08:24:38 [2025-04-03T06:24:38.948Z] [INFO]
08:24:38 [2025-04-03T06:24:38.948Z] [INFO] --- maven-surefire-plugin:2.22.2:test (default-test) @ silverpeas-almanach-configuration ---
08:24:38 [2025-04-03T06:24:38.948Z] [INFO] No tests to run.
08:24:38 [2025-04-03T06:24:38.948Z] [INFO]
08:24:38 [2025-04-03T06:24:38.948Z] [INFO] --- maven-jar-plugin:3.3.0:jar (default-jar) @ silverpeas-almanach-configuration ---
08:24:38 [2025-04-03T06:24:38.948Z] [INFO] Building jar: /var/lib/jenkins/workspace/Silverpeas_Stable_AutoDeploy/Silverpeas-Components/almanach/almanach-configuration/target/silverpeas-almanach-configuration-6.4.3-build250403.jar
08:24:38 [2025-04-03T06:24:38.948Z] [INFO]
08:24:38 [2025-04-03T06:24:38.948Z] [INFO] --- maven-site-plugin:3.12.1:attach-descriptor (attach-descriptor) @ silverpeas-almanach-configuration ---
08:24:38 [2025-04-03T06:24:38.948Z] [INFO] Skipping because packaging 'jar' is not pom.
08:24:38 [2025-04-03T06:24:38.948Z] [INFO]
08:24:38 [2025-04-03T06:24:38.948Z] [INFO] --- maven-source-plugin:3.2.1:jar-no-fork (bundle-source) @ silverpeas-almanach-configuration ---
08:24:38 [2025-04-03T06:24:38.948Z] [INFO] Building jar: /var/lib/jenkins/workspace/Silverpeas_Stable_AutoDeploy/Silverpeas-Components/almanach/almanach-configuration/target/silverpeas-almanach-configuration-6.4.3-build250403-sources.jar
08:24:38 [2025-04-03T06:24:38.948Z] [INFO]
08:24:38 [2025-04-03T06:24:38.948Z] [INFO] --- maven-failsafe-plugin:2.22.2:integration-test (default) @ silverpeas-almanach-configuration ---
08:24:38 [2025-04-03T06:24:38.948Z] [INFO] Tests are skipped.
08:24:38 [2025-04-03T06:24:38.948Z] [INFO]
08:24:38 [2025-04-03T06:24:38.948Z] [INFO] --- maven-javadoc-plugin:3.4.1:jar (attach-javadocs) @ silverpeas-almanach-configuration ---
08:24:38 [2025-04-03T06:24:38.948Z] [INFO]
08:24:38 [2025-04-03T06:24:38.948Z] [INFO] --- maven-source-plugin:3.2.1:jar-no-fork (attach-sources) @ silverpeas-almanach-configuration ---
08:24:38 [2025-04-03T06:24:38.949Z] [WARNING] artifact org.silverpeas.components.almanach:silverpeas-almanach-configuration:java-source:sources:6.4.3-build250403 already attached, replace previous instance
08:24:38 [2025-04-03T06:24:38.949Z] [INFO]
08:24:38 [2025-04-03T06:24:38.949Z] [INFO] --- maven-failsafe-plugin:2.22.2:verify (default) @ silverpeas-almanach-configuration ---
08:24:38 [2025-04-03T06:24:38.949Z] [INFO] Tests are skipped.
08:24:38 [2025-04-03T06:24:38.949Z] [INFO]
08:24:38 [2025-04-03T06:24:38.949Z] [INFO] --- maven-install-plugin:3.0.1:install (default-install) @ silverpeas-almanach-configuration ---
08:24:38 [2025-04-03T06:24:38.949Z] [INFO] Installing /var/lib/jenkins/workspace/Silverpeas_Stable_AutoDeploy/Silverpeas-Components/almanach/almanach-configuration/pom.xml to /home/silverbuild/.m2/repository/org/silverpeas/components/almanach/silverpeas-almanach-configuration/6.4.3-build250403/silverpeas-almanach-configuration-6.4.3-build250403.pom
08:24:38 [2025-04-03T06:24:38.949Z] [INFO] Installing /var/lib/jenkins/workspace/Silverpeas_Stable_AutoDeploy/Silverpeas-Components/almanach/almanach-configuration/target/silverpeas-almanach-configuration-6.4.3-build250403.jar to /home/silverbuild/.m2/repository/org/silverpeas/components/almanach/silverpeas-almanach-configuration/6.4.3-build250403/silverpeas-almanach-configuration-6.4.3-build250403.jar
08:24:38 [2025-04-03T06:24:38.949Z] [INFO] Installing /var/lib/jenkins/workspace/Silverpeas_Stable_AutoDeploy/Silverpeas-Components/almanach/almanach-configuration/target/silverpeas-almanach-configuration-6.4.3-build250403-sources.jar to /home/silverbuild/.m2/repository/org/silverpeas/components/almanach/silverpeas-almanach-configuration/6.4.3-build250403/silverpeas-almanach-configuration-6.4.3-build250403-sources.jar
08:24:38 [2025-04-03T06:24:38.949Z] [INFO]
08:24:38 [2025-04-03T06:24:38.949Z] [INFO] -------< org.silverpeas.components.almanach:silverpeas-almanach >-------
08:24:38 [2025-04-03T06:24:38.949Z] [INFO] Building Almanach Library 6.4.3-build250403 [62/129]
08:24:38 [2025-04-03T06:24:38.949Z] [INFO] from almanach/almanach-library/pom.xml
08:24:38 [2025-04-03T06:24:38.949Z] [INFO] --------------------------------[ jar ]---------------------------------
08:24:38 [2025-04-03T06:24:38.949Z] [INFO]
08:24:38 [2025-04-03T06:24:38.949Z] [INFO] --- maven-clean-plugin:3.2.0:clean (default-clean) @ silverpeas-almanach ---
08:24:38 [2025-04-03T06:24:38.949Z] [INFO] Deleting /var/lib/jenkins/workspace/Silverpeas_Stable_AutoDeploy/Silverpeas-Components/almanach/almanach-library/target
08:24:38 [2025-04-03T06:24:38.949Z] [INFO]
08:24:38 [2025-04-03T06:24:38.949Z] [INFO] --- git-commit-id-plugin:4.9.10:revision (default) @ silverpeas-almanach ---
08:24:40 [2025-04-03T06:24:40.292Z] [INFO]
08:24:40 [2025-04-03T06:24:40.292Z] [INFO] --- maven-resources-plugin:3.3.0:resources (default-resources) @ silverpeas-almanach ---
08:24:40 [2025-04-03T06:24:40.292Z] [INFO] Copying 1 resource
08:24:40 [2025-04-03T06:24:40.292Z] [INFO]
08:24:40 [2025-04-03T06:24:40.292Z] [INFO] --- silverpeas-ui-compressor-maven-plugin:1.7:jslint (default) @ silverpeas-almanach ---
08:24:40 [2025-04-03T06:24:40.292Z] [INFO] nb warnings: 0, nb errors: 0
08:24:40 [2025-04-03T06:24:40.292Z] [INFO]
08:24:40 [2025-04-03T06:24:40.292Z] [INFO] --- silverpeas-ui-compressor-maven-plugin:1.7:compress (default) @ silverpeas-almanach ---
08:24:40 [2025-04-03T06:24:40.292Z] [INFO] nb warnings: 0, nb errors: 0
08:24:40 [2025-04-03T06:24:40.292Z] [INFO]
08:24:40 [2025-04-03T06:24:40.292Z] [INFO] --- maven-compiler-plugin:3.10.1:compile (default-compile) @ silverpeas-almanach ---
08:24:40 [2025-04-03T06:24:40.292Z] [INFO] Changes detected - recompiling the module!
08:24:40 [2025-04-03T06:24:40.292Z] [INFO] Compiling 10 source files to /var/lib/jenkins/workspace/Silverpeas_Stable_AutoDeploy/Silverpeas-Components/almanach/almanach-library/target/classes
08:24:40 [2025-04-03T06:24:40.543Z] [INFO]
08:24:40 [2025-04-03T06:24:40.543Z] [INFO] --- build-helper-maven-plugin:3.3.0:add-test-source (add-integration-test-sources) @ silverpeas-almanach ---
08:24:40 [2025-04-03T06:24:40.543Z] [INFO] Test Source directory: /var/lib/jenkins/workspace/Silverpeas_Stable_AutoDeploy/Silverpeas-Components/almanach/almanach-library/src/integration-test/java added.
08:24:40 [2025-04-03T06:24:40.543Z] [INFO]
08:24:40 [2025-04-03T06:24:40.543Z] [INFO] --- build-helper-maven-plugin:3.3.0:add-test-resource (add-integration-test-sources) @ silverpeas-almanach ---
08:24:40 [2025-04-03T06:24:40.543Z] [INFO]
08:24:40 [2025-04-03T06:24:40.543Z] [INFO] --- maven-resources-plugin:3.3.0:testResources (default-testResources) @ silverpeas-almanach ---
08:24:40 [2025-04-03T06:24:40.543Z] [INFO] Not copying test resources
08:24:40 [2025-04-03T06:24:40.543Z] [INFO]
08:24:40 [2025-04-03T06:24:40.543Z] [INFO] --- maven-compiler-plugin:3.10.1:testCompile (default-testCompile) @ silverpeas-almanach ---
08:24:40 [2025-04-03T06:24:40.543Z] [INFO] Not compiling test sources
08:24:40 [2025-04-03T06:24:40.543Z] [INFO]
08:24:40 [2025-04-03T06:24:40.543Z] [INFO] --- maven-surefire-plugin:2.22.2:test (default-test) @ silverpeas-almanach ---
08:24:40 [2025-04-03T06:24:40.543Z] [INFO] No tests to run.
08:24:40 [2025-04-03T06:24:40.543Z] [INFO]
08:24:40 [2025-04-03T06:24:40.543Z] [INFO] --- maven-jar-plugin:3.3.0:jar (default-jar) @ silverpeas-almanach ---
08:24:40 [2025-04-03T06:24:40.543Z] [INFO] Building jar: /var/lib/jenkins/workspace/Silverpeas_Stable_AutoDeploy/Silverpeas-Components/almanach/almanach-library/target/silverpeas-almanach-6.4.3-build250403.jar
08:24:40 [2025-04-03T06:24:40.543Z] [INFO]
08:24:40 [2025-04-03T06:24:40.543Z] [INFO] --- maven-site-plugin:3.12.1:attach-descriptor (attach-descriptor) @ silverpeas-almanach ---
08:24:40 [2025-04-03T06:24:40.543Z] [INFO] Skipping because packaging 'jar' is not pom.
08:24:40 [2025-04-03T06:24:40.543Z] [INFO]
08:24:40 [2025-04-03T06:24:40.543Z] [INFO] --- maven-source-plugin:3.2.1:jar-no-fork (bundle-source) @ silverpeas-almanach ---
08:24:40 [2025-04-03T06:24:40.543Z] [INFO] Building jar: /var/lib/jenkins/workspace/Silverpeas_Stable_AutoDeploy/Silverpeas-Components/almanach/almanach-library/target/silverpeas-almanach-6.4.3-build250403-sources.jar
08:24:40 [2025-04-03T06:24:40.543Z] [INFO]
08:24:40 [2025-04-03T06:24:40.543Z] [INFO] --- maven-failsafe-plugin:2.22.2:integration-test (default) @ silverpeas-almanach ---
08:24:40 [2025-04-03T06:24:40.543Z] [INFO] Tests are skipped.
08:24:40 [2025-04-03T06:24:40.543Z] [INFO]
08:24:40 [2025-04-03T06:24:40.543Z] [INFO] --- maven-javadoc-plugin:3.4.1:jar (attach-javadocs) @ silverpeas-almanach ---
08:24:40 [2025-04-03T06:24:40.793Z] [INFO] No previous run data found, generating javadoc.
08:24:44 [2025-04-03T06:24:44.021Z] [INFO] Building jar: /var/lib/jenkins/workspace/Silverpeas_Stable_AutoDeploy/Silverpeas-Components/almanach/almanach-library/target/silverpeas-almanach-6.4.3-build250403-javadoc.jar
08:24:44 [2025-04-03T06:24:44.021Z] [INFO]
08:24:44 [2025-04-03T06:24:44.021Z] [INFO] --- maven-source-plugin:3.2.1:jar-no-fork (attach-sources) @ silverpeas-almanach ---
08:24:44 [2025-04-03T06:24:44.021Z] [INFO] Building jar: /var/lib/jenkins/workspace/Silverpeas_Stable_AutoDeploy/Silverpeas-Components/almanach/almanach-library/target/silverpeas-almanach-6.4.3-build250403-sources.jar
08:24:44 [2025-04-03T06:24:44.021Z] [WARNING] artifact org.silverpeas.components.almanach:silverpeas-almanach:java-source:sources:6.4.3-build250403 already attached, replace previous instance
08:24:44 [2025-04-03T06:24:44.021Z] [INFO]
08:24:44 [2025-04-03T06:24:44.021Z] [INFO] --- maven-failsafe-plugin:2.22.2:verify (default) @ silverpeas-almanach ---
08:24:44 [2025-04-03T06:24:44.021Z] [INFO] Tests are skipped.
08:24:44 [2025-04-03T06:24:44.021Z] [INFO]
08:24:44 [2025-04-03T06:24:44.021Z] [INFO] --- maven-install-plugin:3.0.1:install (default-install) @ silverpeas-almanach ---
08:24:44 [2025-04-03T06:24:44.021Z] [INFO] Installing /var/lib/jenkins/workspace/Silverpeas_Stable_AutoDeploy/Silverpeas-Components/almanach/almanach-library/pom.xml to /home/silverbuild/.m2/repository/org/silverpeas/components/almanach/silverpeas-almanach/6.4.3-build250403/silverpeas-almanach-6.4.3-build250403.pom
08:24:44 [2025-04-03T06:24:44.021Z] [INFO] Installing /var/lib/jenkins/workspace/Silverpeas_Stable_AutoDeploy/Silverpeas-Components/almanach/almanach-library/target/silverpeas-almanach-6.4.3-build250403.jar to /home/silverbuild/.m2/repository/org/silverpeas/components/almanach/silverpeas-almanach/6.4.3-build250403/silverpeas-almanach-6.4.3-build250403.jar
08:24:44 [2025-04-03T06:24:44.021Z] [INFO] Installing /var/lib/jenkins/workspace/Silverpeas_Stable_AutoDeploy/Silverpeas-Components/almanach/almanach-library/target/silverpeas-almanach-6.4.3-build250403-sources.jar to /home/silverbuild/.m2/repository/org/silverpeas/components/almanach/silverpeas-almanach/6.4.3-build250403/silverpeas-almanach-6.4.3-build250403-sources.jar
08:24:44 [2025-04-03T06:24:44.021Z] [INFO] Installing /var/lib/jenkins/workspace/Silverpeas_Stable_AutoDeploy/Silverpeas-Components/almanach/almanach-library/target/silverpeas-almanach-6.4.3-build250403-javadoc.jar to /home/silverbuild/.m2/repository/org/silverpeas/components/almanach/silverpeas-almanach/6.4.3-build250403/silverpeas-almanach-6.4.3-build250403-javadoc.jar
08:24:44 [2025-04-03T06:24:44.021Z] [INFO]
08:24:44 [2025-04-03T06:24:44.021Z] [INFO] -----< org.silverpeas.components.almanach:silverpeas-almanach-war >-----
08:24:44 [2025-04-03T06:24:44.021Z] [INFO] Building Almanach Web Application 6.4.3-build250403 [63/129]
08:24:44 [2025-04-03T06:24:44.021Z] [INFO] from almanach/almanach-war/pom.xml
08:24:44 [2025-04-03T06:24:44.021Z] [INFO] --------------------------------[ war ]---------------------------------
08:24:44 [2025-04-03T06:24:44.021Z] [INFO]
08:24:44 [2025-04-03T06:24:44.022Z] [INFO] --- maven-clean-plugin:3.2.0:clean (default-clean) @ silverpeas-almanach-war ---
08:24:44 [2025-04-03T06:24:44.022Z] [INFO] Deleting /var/lib/jenkins/workspace/Silverpeas_Stable_AutoDeploy/Silverpeas-Components/almanach/almanach-war/target
08:24:44 [2025-04-03T06:24:44.022Z] [INFO]
08:24:44 [2025-04-03T06:24:44.022Z] [INFO] --- git-commit-id-plugin:4.9.10:revision (default) @ silverpeas-almanach-war ---
08:24:44 [2025-04-03T06:24:44.933Z] [INFO]
08:24:44 [2025-04-03T06:24:44.933Z] [INFO] --- maven-resources-plugin:3.3.0:resources (default-resources) @ silverpeas-almanach-war ---
08:24:44 [2025-04-03T06:24:44.933Z] [INFO] skip non existing resourceDirectory /var/lib/jenkins/workspace/Silverpeas_Stable_AutoDeploy/Silverpeas-Components/almanach/almanach-war/src/main/resources
08:24:44 [2025-04-03T06:24:44.933Z] [INFO]
08:24:44 [2025-04-03T06:24:44.933Z] [INFO] --- silverpeas-ui-compressor-maven-plugin:1.7:jslint (default) @ silverpeas-almanach-war ---
08:24:44 [2025-04-03T06:24:44.933Z] [INFO] check file :/var/lib/jenkins/workspace/Silverpeas_Stable_AutoDeploy/Silverpeas-Components/almanach/almanach-war/src/main/webapp/almanach/jsp/javaScript/angularjs/services/almanachcalendar.js
08:24:44 [2025-04-03T06:24:44.933Z] [INFO] check file :/var/lib/jenkins/workspace/Silverpeas_Stable_AutoDeploy/Silverpeas-Components/almanach/almanach-war/src/main/webapp/almanach/jsp/javaScript/angularjs/almanachcalendar.js
08:24:44 [2025-04-03T06:24:44.933Z] [INFO] nb warnings: 0, nb errors: 0
08:24:44 [2025-04-03T06:24:44.933Z] [INFO]
08:24:44 [2025-04-03T06:24:44.933Z] [INFO] --- silverpeas-ui-compressor-maven-plugin:1.7:compress (default) @ silverpeas-almanach-war ---
08:24:44 [2025-04-03T06:24:44.933Z] [INFO] almanach.css (1143b) -> almanach-min.css (0b)[0%]
08:24:44 [2025-04-03T06:24:44.933Z] [INFO] almanachcalendar.js (1572b) -> almanachcalendar-min.js (195b)[12%]
08:24:44 [2025-04-03T06:24:44.933Z] [INFO] almanachcalendar.js (3370b) -> almanachcalendar-min.js (1289b)[38%]
08:24:44 [2025-04-03T06:24:44.933Z] [INFO] total input (6085b) -> output (1484b)[24%]
08:24:44 [2025-04-03T06:24:44.933Z] [INFO] nb warnings: 0, nb errors: 0
08:24:44 [2025-04-03T06:24:44.933Z] [INFO]
08:24:44 [2025-04-03T06:24:44.933Z] [INFO] --- maven-compiler-plugin:3.10.1:compile (default-compile) @ silverpeas-almanach-war ---
08:24:44 [2025-04-03T06:24:44.933Z] [INFO] Changes detected - recompiling the module!
08:24:44 [2025-04-03T06:24:44.933Z] [INFO] Compiling 11 source files to /var/lib/jenkins/workspace/Silverpeas_Stable_AutoDeploy/Silverpeas-Components/almanach/almanach-war/target/classes
08:24:45 [2025-04-03T06:24:45.483Z] [INFO]
08:24:45 [2025-04-03T06:24:45.483Z] [INFO] --- build-helper-maven-plugin:3.3.0:add-test-source (add-integration-test-sources) @ silverpeas-almanach-war ---
08:24:45 [2025-04-03T06:24:45.483Z] [INFO] Test Source directory: /var/lib/jenkins/workspace/Silverpeas_Stable_AutoDeploy/Silverpeas-Components/almanach/almanach-war/src/integration-test/java added.
08:24:45 [2025-04-03T06:24:45.483Z] [INFO]
08:24:45 [2025-04-03T06:24:45.483Z] [INFO] --- build-helper-maven-plugin:3.3.0:add-test-resource (add-integration-test-sources) @ silverpeas-almanach-war ---
08:24:45 [2025-04-03T06:24:45.483Z] [INFO]
08:24:45 [2025-04-03T06:24:45.483Z] [INFO] --- maven-resources-plugin:3.3.0:testResources (default-testResources) @ silverpeas-almanach-war ---
08:24:45 [2025-04-03T06:24:45.483Z] [INFO] Not copying test resources
08:24:45 [2025-04-03T06:24:45.483Z] [INFO]
08:24:45 [2025-04-03T06:24:45.483Z] [INFO] --- maven-compiler-plugin:3.10.1:testCompile (default-testCompile) @ silverpeas-almanach-war ---
08:24:45 [2025-04-03T06:24:45.483Z] [INFO] Not compiling test sources
08:24:45 [2025-04-03T06:24:45.483Z] [INFO]
08:24:45 [2025-04-03T06:24:45.483Z] [INFO] --- maven-surefire-plugin:2.22.2:test (default-test) @ silverpeas-almanach-war ---
08:24:45 [2025-04-03T06:24:45.483Z] [INFO] No tests to run.
08:24:45 [2025-04-03T06:24:45.483Z] [INFO]
08:24:45 [2025-04-03T06:24:45.483Z] [INFO] --- maven-war-plugin:3.3.2:war (default-war) @ silverpeas-almanach-war ---
08:24:45 [2025-04-03T06:24:45.483Z] [INFO] Packaging webapp
08:24:45 [2025-04-03T06:24:45.483Z] [INFO] Assembling webapp [silverpeas-almanach-war] in [/var/lib/jenkins/workspace/Silverpeas_Stable_AutoDeploy/Silverpeas-Components/almanach/almanach-war/target/silverpeas-almanach-war-6.4.3-build250403]
08:24:45 [2025-04-03T06:24:45.483Z] [INFO] Processing war project
08:24:45 [2025-04-03T06:24:45.483Z] [INFO] Copying webapp resources [/var/lib/jenkins/workspace/Silverpeas_Stable_AutoDeploy/Silverpeas-Components/almanach/almanach-war/src/main/webapp]
08:24:45 [2025-04-03T06:24:45.483Z] [INFO] Building war: /var/lib/jenkins/workspace/Silverpeas_Stable_AutoDeploy/Silverpeas-Components/almanach/almanach-war/target/silverpeas-almanach-war-6.4.3-build250403.war
08:24:45 [2025-04-03T06:24:45.734Z] [INFO]
08:24:45 [2025-04-03T06:24:45.734Z] [INFO] --- maven-site-plugin:3.12.1:attach-descriptor (attach-descriptor) @ silverpeas-almanach-war ---
08:24:45 [2025-04-03T06:24:45.734Z] [INFO] Skipping because packaging 'war' is not pom.
08:24:45 [2025-04-03T06:24:45.734Z] [INFO]
08:24:45 [2025-04-03T06:24:45.734Z] [INFO] --- maven-source-plugin:3.2.1:jar-no-fork (bundle-source) @ silverpeas-almanach-war ---
08:24:45 [2025-04-03T06:24:45.734Z] [INFO] Building jar: /var/lib/jenkins/workspace/Silverpeas_Stable_AutoDeploy/Silverpeas-Components/almanach/almanach-war/target/silverpeas-almanach-war-6.4.3-build250403-sources.jar
08:24:45 [2025-04-03T06:24:45.734Z] [INFO]
08:24:45 [2025-04-03T06:24:45.734Z] [INFO] --- maven-failsafe-plugin:2.22.2:integration-test (default) @ silverpeas-almanach-war ---
08:24:45 [2025-04-03T06:24:45.734Z] [INFO] Tests are skipped.
08:24:45 [2025-04-03T06:24:45.734Z] [INFO]
08:24:45 [2025-04-03T06:24:45.734Z] [INFO] --- maven-javadoc-plugin:3.4.1:jar (attach-javadocs) @ silverpeas-almanach-war ---
08:24:45 [2025-04-03T06:24:45.984Z] [INFO] No previous run data found, generating javadoc.
08:24:49 [2025-04-03T06:24:49.212Z] [INFO] Building jar: /var/lib/jenkins/workspace/Silverpeas_Stable_AutoDeploy/Silverpeas-Components/almanach/almanach-war/target/silverpeas-almanach-war-6.4.3-build250403-javadoc.jar
08:24:49 [2025-04-03T06:24:49.212Z] [INFO]
08:24:49 [2025-04-03T06:24:49.212Z] [INFO] --- maven-source-plugin:3.2.1:jar-no-fork (attach-sources) @ silverpeas-almanach-war ---
08:24:49 [2025-04-03T06:24:49.212Z] [INFO] Building jar: /var/lib/jenkins/workspace/Silverpeas_Stable_AutoDeploy/Silverpeas-Components/almanach/almanach-war/target/silverpeas-almanach-war-6.4.3-build250403-sources.jar
08:24:49 [2025-04-03T06:24:49.212Z] [WARNING] artifact org.silverpeas.components.almanach:silverpeas-almanach-war:java-source:sources:6.4.3-build250403 already attached, replace previous instance
08:24:49 [2025-04-03T06:24:49.212Z] [INFO]
08:24:49 [2025-04-03T06:24:49.212Z] [INFO] --- maven-failsafe-plugin:2.22.2:verify (default) @ silverpeas-almanach-war ---
08:24:49 [2025-04-03T06:24:49.212Z] [INFO] Tests are skipped.
08:24:49 [2025-04-03T06:24:49.212Z] [INFO]
08:24:49 [2025-04-03T06:24:49.212Z] [INFO] --- maven-install-plugin:3.0.1:install (default-install) @ silverpeas-almanach-war ---
08:24:49 [2025-04-03T06:24:49.212Z] [INFO] Installing /var/lib/jenkins/workspace/Silverpeas_Stable_AutoDeploy/Silverpeas-Components/almanach/almanach-war/pom.xml to /home/silverbuild/.m2/repository/org/silverpeas/components/almanach/silverpeas-almanach-war/6.4.3-build250403/silverpeas-almanach-war-6.4.3-build250403.pom
08:24:49 [2025-04-03T06:24:49.212Z] [INFO] Installing /var/lib/jenkins/workspace/Silverpeas_Stable_AutoDeploy/Silverpeas-Components/almanach/almanach-war/target/silverpeas-almanach-war-6.4.3-build250403.war to /home/silverbuild/.m2/repository/org/silverpeas/components/almanach/silverpeas-almanach-war/6.4.3-build250403/silverpeas-almanach-war-6.4.3-build250403.war
08:24:49 [2025-04-03T06:24:49.212Z] [INFO] Installing /var/lib/jenkins/workspace/Silverpeas_Stable_AutoDeploy/Silverpeas-Components/almanach/almanach-war/target/silverpeas-almanach-war-6.4.3-build250403-sources.jar to /home/silverbuild/.m2/repository/org/silverpeas/components/almanach/silverpeas-almanach-war/6.4.3-build250403/silverpeas-almanach-war-6.4.3-build250403-sources.jar
08:24:49 [2025-04-03T06:24:49.212Z] [INFO] Installing /var/lib/jenkins/workspace/Silverpeas_Stable_AutoDeploy/Silverpeas-Components/almanach/almanach-war/target/silverpeas-almanach-war-6.4.3-build250403-javadoc.jar to /home/silverbuild/.m2/repository/org/silverpeas/components/almanach/silverpeas-almanach-war/6.4.3-build250403/silverpeas-almanach-war-6.4.3-build250403-javadoc.jar
08:24:49 [2025-04-03T06:24:49.212Z] [INFO]
08:24:49 [2025-04-03T06:24:49.212Z] [INFO] ---------------< org.silverpeas.components:yellowpages >----------------
08:24:49 [2025-04-03T06:24:49.212Z] [INFO] Building Silverpeas YellowPages Component 6.4.3-build250403 [64/129]
08:24:49 [2025-04-03T06:24:49.212Z] [INFO] from yellowpages/pom.xml
08:24:49 [2025-04-03T06:24:49.212Z] [INFO] --------------------------------[ pom ]---------------------------------
08:24:49 [2025-04-03T06:24:49.212Z] [INFO]
08:24:49 [2025-04-03T06:24:49.212Z] [INFO] --- maven-clean-plugin:3.2.0:clean (default-clean) @ yellowpages ---
08:24:49 [2025-04-03T06:24:49.212Z] [INFO] Deleting /var/lib/jenkins/workspace/Silverpeas_Stable_AutoDeploy/Silverpeas-Components/yellowpages/target
08:24:49 [2025-04-03T06:24:49.212Z] [INFO]
08:24:49 [2025-04-03T06:24:49.212Z] [INFO] --- git-commit-id-plugin:4.9.10:revision (default) @ yellowpages ---
08:24:49 [2025-04-03T06:24:49.212Z] [INFO]
08:24:49 [2025-04-03T06:24:49.212Z] [INFO] --- silverpeas-ui-compressor-maven-plugin:1.7:jslint (default) @ yellowpages ---
08:24:49 [2025-04-03T06:24:49.212Z] [INFO] nb warnings: 0, nb errors: 0
08:24:49 [2025-04-03T06:24:49.212Z] [INFO]
08:24:49 [2025-04-03T06:24:49.212Z] [INFO] --- silverpeas-ui-compressor-maven-plugin:1.7:compress (default) @ yellowpages ---
08:24:49 [2025-04-03T06:24:49.212Z] [INFO] nb warnings: 0, nb errors: 0
08:24:49 [2025-04-03T06:24:49.212Z] [INFO]
08:24:49 [2025-04-03T06:24:49.212Z] [INFO] --- build-helper-maven-plugin:3.3.0:add-test-source (add-integration-test-sources) @ yellowpages ---
08:24:49 [2025-04-03T06:24:49.212Z] [INFO] Test Source directory: /var/lib/jenkins/workspace/Silverpeas_Stable_AutoDeploy/Silverpeas-Components/yellowpages/src/integration-test/java added.
08:24:49 [2025-04-03T06:24:49.212Z] [INFO]
08:24:49 [2025-04-03T06:24:49.212Z] [INFO] --- build-helper-maven-plugin:3.3.0:add-test-resource (add-integration-test-sources) @ yellowpages ---
08:24:49 [2025-04-03T06:24:49.212Z] [INFO]
08:24:49 [2025-04-03T06:24:49.212Z] [INFO] --- maven-site-plugin:3.12.1:attach-descriptor (attach-descriptor) @ yellowpages ---
08:24:49 [2025-04-03T06:24:49.212Z] [INFO] No site descriptor found: nothing to attach.
08:24:49 [2025-04-03T06:24:49.212Z] [INFO]
08:24:49 [2025-04-03T06:24:49.212Z] [INFO] --- maven-source-plugin:3.2.1:jar-no-fork (bundle-source) @ yellowpages ---
08:24:49 [2025-04-03T06:24:49.212Z] [INFO]
08:24:49 [2025-04-03T06:24:49.212Z] [INFO] --- maven-failsafe-plugin:2.22.2:integration-test (default) @ yellowpages ---
08:24:49 [2025-04-03T06:24:49.212Z] [INFO] Tests are skipped.
08:24:49 [2025-04-03T06:24:49.212Z] [INFO]
08:24:49 [2025-04-03T06:24:49.212Z] [INFO] --- maven-javadoc-plugin:3.4.1:jar (attach-javadocs) @ yellowpages ---
08:24:49 [2025-04-03T06:24:49.212Z] [INFO] Not executing Javadoc as the project is not a Java classpath-capable package
08:24:49 [2025-04-03T06:24:49.212Z] [INFO]
08:24:49 [2025-04-03T06:24:49.212Z] [INFO] --- maven-source-plugin:3.2.1:jar-no-fork (attach-sources) @ yellowpages ---
08:24:49 [2025-04-03T06:24:49.212Z] [INFO]
08:24:49 [2025-04-03T06:24:49.212Z] [INFO] --- maven-failsafe-plugin:2.22.2:verify (default) @ yellowpages ---
08:24:49 [2025-04-03T06:24:49.212Z] [INFO] Tests are skipped.
08:24:49 [2025-04-03T06:24:49.212Z] [INFO]
08:24:49 [2025-04-03T06:24:49.212Z] [INFO] --- maven-install-plugin:3.0.1:install (default-install) @ yellowpages ---
08:24:49 [2025-04-03T06:24:49.212Z] [INFO] Installing /var/lib/jenkins/workspace/Silverpeas_Stable_AutoDeploy/Silverpeas-Components/yellowpages/pom.xml to /home/silverbuild/.m2/repository/org/silverpeas/components/yellowpages/6.4.3-build250403/yellowpages-6.4.3-build250403.pom
08:24:49 [2025-04-03T06:24:49.212Z] [INFO]
08:24:49 [2025-04-03T06:24:49.212Z] [INFO] --< org.silverpeas.components.yellowpages:silverpeas-yellowpages-configuration >--
08:24:49 [2025-04-03T06:24:49.212Z] [INFO] Building YellowPages Configuration 6.4.3-build250403 [65/129]
08:24:49 [2025-04-03T06:24:49.212Z] [INFO] from yellowpages/yellowpages-configuration/pom.xml
08:24:49 [2025-04-03T06:24:49.212Z] [INFO] --------------------------------[ jar ]---------------------------------
08:24:49 [2025-04-03T06:24:49.212Z] [INFO]
08:24:49 [2025-04-03T06:24:49.212Z] [INFO] --- maven-clean-plugin:3.2.0:clean (default-clean) @ silverpeas-yellowpages-configuration ---
08:24:49 [2025-04-03T06:24:49.212Z] [INFO] Deleting /var/lib/jenkins/workspace/Silverpeas_Stable_AutoDeploy/Silverpeas-Components/yellowpages/yellowpages-configuration/target
08:24:49 [2025-04-03T06:24:49.212Z] [INFO]
08:24:49 [2025-04-03T06:24:49.212Z] [INFO] --- git-commit-id-plugin:4.9.10:revision (default) @ silverpeas-yellowpages-configuration ---
08:24:50 [2025-04-03T06:24:50.123Z] [INFO]
08:24:50 [2025-04-03T06:24:50.123Z] [INFO] --- maven-resources-plugin:3.3.0:resources (default-resources) @ silverpeas-yellowpages-configuration ---
08:24:50 [2025-04-03T06:24:50.123Z] [INFO] Copying 21 resources
08:24:50 [2025-04-03T06:24:50.123Z] [INFO]
08:24:50 [2025-04-03T06:24:50.123Z] [INFO] --- silverpeas-ui-compressor-maven-plugin:1.7:jslint (default) @ silverpeas-yellowpages-configuration ---
08:24:50 [2025-04-03T06:24:50.123Z] [INFO] nb warnings: 0, nb errors: 0
08:24:50 [2025-04-03T06:24:50.123Z] [INFO]
08:24:50 [2025-04-03T06:24:50.123Z] [INFO] --- silverpeas-ui-compressor-maven-plugin:1.7:compress (default) @ silverpeas-yellowpages-configuration ---
08:24:50 [2025-04-03T06:24:50.123Z] [INFO] nb warnings: 0, nb errors: 0
08:24:50 [2025-04-03T06:24:50.123Z] [INFO]
08:24:50 [2025-04-03T06:24:50.123Z] [INFO] --- maven-compiler-plugin:3.10.1:compile (default-compile) @ silverpeas-yellowpages-configuration ---
08:24:50 [2025-04-03T06:24:50.123Z] [INFO] No sources to compile
08:24:50 [2025-04-03T06:24:50.123Z] [INFO]
08:24:50 [2025-04-03T06:24:50.123Z] [INFO] --- build-helper-maven-plugin:3.3.0:add-test-source (add-integration-test-sources) @ silverpeas-yellowpages-configuration ---
08:24:50 [2025-04-03T06:24:50.123Z] [INFO] Test Source directory: /var/lib/jenkins/workspace/Silverpeas_Stable_AutoDeploy/Silverpeas-Components/yellowpages/yellowpages-configuration/src/integration-test/java added.
08:24:50 [2025-04-03T06:24:50.123Z] [INFO]
08:24:50 [2025-04-03T06:24:50.123Z] [INFO] --- build-helper-maven-plugin:3.3.0:add-test-resource (add-integration-test-sources) @ silverpeas-yellowpages-configuration ---
08:24:50 [2025-04-03T06:24:50.123Z] [INFO]
08:24:50 [2025-04-03T06:24:50.123Z] [INFO] --- maven-resources-plugin:3.3.0:testResources (default-testResources) @ silverpeas-yellowpages-configuration ---
08:24:50 [2025-04-03T06:24:50.123Z] [INFO] Not copying test resources
08:24:50 [2025-04-03T06:24:50.123Z] [INFO]
08:24:50 [2025-04-03T06:24:50.123Z] [INFO] --- maven-compiler-plugin:3.10.1:testCompile (default-testCompile) @ silverpeas-yellowpages-configuration ---
08:24:50 [2025-04-03T06:24:50.123Z] [INFO] Not compiling test sources
08:24:50 [2025-04-03T06:24:50.123Z] [INFO]
08:24:50 [2025-04-03T06:24:50.123Z] [INFO] --- maven-surefire-plugin:2.22.2:test (default-test) @ silverpeas-yellowpages-configuration ---
08:24:50 [2025-04-03T06:24:50.123Z] [INFO] No tests to run.
08:24:50 [2025-04-03T06:24:50.123Z] [INFO]
08:24:50 [2025-04-03T06:24:50.123Z] [INFO] --- maven-jar-plugin:3.3.0:jar (default-jar) @ silverpeas-yellowpages-configuration ---
08:24:50 [2025-04-03T06:24:50.123Z] [INFO] Building jar: /var/lib/jenkins/workspace/Silverpeas_Stable_AutoDeploy/Silverpeas-Components/yellowpages/yellowpages-configuration/target/silverpeas-yellowpages-configuration-6.4.3-build250403.jar
08:24:50 [2025-04-03T06:24:50.123Z] [INFO]
08:24:50 [2025-04-03T06:24:50.123Z] [INFO] --- maven-site-plugin:3.12.1:attach-descriptor (attach-descriptor) @ silverpeas-yellowpages-configuration ---
08:24:50 [2025-04-03T06:24:50.124Z] [INFO] Skipping because packaging 'jar' is not pom.
08:24:50 [2025-04-03T06:24:50.124Z] [INFO]
08:24:50 [2025-04-03T06:24:50.124Z] [INFO] --- maven-source-plugin:3.2.1:jar-no-fork (bundle-source) @ silverpeas-yellowpages-configuration ---
08:24:50 [2025-04-03T06:24:50.124Z] [INFO] Building jar: /var/lib/jenkins/workspace/Silverpeas_Stable_AutoDeploy/Silverpeas-Components/yellowpages/yellowpages-configuration/target/silverpeas-yellowpages-configuration-6.4.3-build250403-sources.jar
08:24:50 [2025-04-03T06:24:50.124Z] [INFO]
08:24:50 [2025-04-03T06:24:50.124Z] [INFO] --- maven-failsafe-plugin:2.22.2:integration-test (default) @ silverpeas-yellowpages-configuration ---
08:24:50 [2025-04-03T06:24:50.124Z] [INFO] Tests are skipped.
08:24:50 [2025-04-03T06:24:50.124Z] [INFO]
08:24:50 [2025-04-03T06:24:50.124Z] [INFO] --- maven-javadoc-plugin:3.4.1:jar (attach-javadocs) @ silverpeas-yellowpages-configuration ---
08:24:50 [2025-04-03T06:24:50.124Z] [INFO]
08:24:50 [2025-04-03T06:24:50.124Z] [INFO] --- maven-source-plugin:3.2.1:jar-no-fork (attach-sources) @ silverpeas-yellowpages-configuration ---
08:24:50 [2025-04-03T06:24:50.124Z] [WARNING] artifact org.silverpeas.components.yellowpages:silverpeas-yellowpages-configuration:java-source:sources:6.4.3-build250403 already attached, replace previous instance
08:24:50 [2025-04-03T06:24:50.124Z] [INFO]
08:24:50 [2025-04-03T06:24:50.124Z] [INFO] --- maven-failsafe-plugin:2.22.2:verify (default) @ silverpeas-yellowpages-configuration ---
08:24:50 [2025-04-03T06:24:50.124Z] [INFO] Tests are skipped.
08:24:50 [2025-04-03T06:24:50.124Z] [INFO]
08:24:50 [2025-04-03T06:24:50.124Z] [INFO] --- maven-install-plugin:3.0.1:install (default-install) @ silverpeas-yellowpages-configuration ---
08:24:50 [2025-04-03T06:24:50.124Z] [INFO] Installing /var/lib/jenkins/workspace/Silverpeas_Stable_AutoDeploy/Silverpeas-Components/yellowpages/yellowpages-configuration/pom.xml to /home/silverbuild/.m2/repository/org/silverpeas/components/yellowpages/silverpeas-yellowpages-configuration/6.4.3-build250403/silverpeas-yellowpages-configuration-6.4.3-build250403.pom
08:24:50 [2025-04-03T06:24:50.124Z] [INFO] Installing /var/lib/jenkins/workspace/Silverpeas_Stable_AutoDeploy/Silverpeas-Components/yellowpages/yellowpages-configuration/target/silverpeas-yellowpages-configuration-6.4.3-build250403.jar to /home/silverbuild/.m2/repository/org/silverpeas/components/yellowpages/silverpeas-yellowpages-configuration/6.4.3-build250403/silverpeas-yellowpages-configuration-6.4.3-build250403.jar
08:24:50 [2025-04-03T06:24:50.124Z] [INFO] Installing /var/lib/jenkins/workspace/Silverpeas_Stable_AutoDeploy/Silverpeas-Components/yellowpages/yellowpages-configuration/target/silverpeas-yellowpages-configuration-6.4.3-build250403-sources.jar to /home/silverbuild/.m2/repository/org/silverpeas/components/yellowpages/silverpeas-yellowpages-configuration/6.4.3-build250403/silverpeas-yellowpages-configuration-6.4.3-build250403-sources.jar
08:24:50 [2025-04-03T06:24:50.124Z] [INFO]
08:24:50 [2025-04-03T06:24:50.124Z] [INFO] ----< org.silverpeas.components.yellowpages:silverpeas-yellowpages >----
08:24:50 [2025-04-03T06:24:50.124Z] [INFO] Building YellowPages Library 6.4.3-build250403 [66/129]
08:24:50 [2025-04-03T06:24:50.124Z] [INFO] from yellowpages/yellowpages-library/pom.xml
08:24:50 [2025-04-03T06:24:50.124Z] [INFO] --------------------------------[ jar ]---------------------------------
08:24:50 [2025-04-03T06:24:50.124Z] [INFO]
08:24:50 [2025-04-03T06:24:50.124Z] [INFO] --- maven-clean-plugin:3.2.0:clean (default-clean) @ silverpeas-yellowpages ---
08:24:50 [2025-04-03T06:24:50.124Z] [INFO] Deleting /var/lib/jenkins/workspace/Silverpeas_Stable_AutoDeploy/Silverpeas-Components/yellowpages/yellowpages-library/target
08:24:50 [2025-04-03T06:24:50.124Z] [INFO]
08:24:50 [2025-04-03T06:24:50.124Z] [INFO] --- git-commit-id-plugin:4.9.10:revision (default) @ silverpeas-yellowpages ---
08:24:51 [2025-04-03T06:24:51.467Z] [INFO]
08:24:51 [2025-04-03T06:24:51.467Z] [INFO] --- maven-resources-plugin:3.3.0:resources (default-resources) @ silverpeas-yellowpages ---
08:24:51 [2025-04-03T06:24:51.467Z] [INFO] Copying 1 resource
08:24:51 [2025-04-03T06:24:51.467Z] [INFO]
08:24:51 [2025-04-03T06:24:51.467Z] [INFO] --- silverpeas-ui-compressor-maven-plugin:1.7:jslint (default) @ silverpeas-yellowpages ---
08:24:51 [2025-04-03T06:24:51.467Z] [INFO] nb warnings: 0, nb errors: 0
08:24:51 [2025-04-03T06:24:51.467Z] [INFO]
08:24:51 [2025-04-03T06:24:51.467Z] [INFO] --- silverpeas-ui-compressor-maven-plugin:1.7:compress (default) @ silverpeas-yellowpages ---
08:24:51 [2025-04-03T06:24:51.467Z] [INFO] nb warnings: 0, nb errors: 0
08:24:51 [2025-04-03T06:24:51.467Z] [INFO]
08:24:51 [2025-04-03T06:24:51.467Z] [INFO] --- maven-compiler-plugin:3.10.1:compile (default-compile) @ silverpeas-yellowpages ---
08:24:51 [2025-04-03T06:24:51.467Z] [INFO] Changes detected - recompiling the module!
08:24:51 [2025-04-03T06:24:51.467Z] [INFO] Compiling 13 source files to /var/lib/jenkins/workspace/Silverpeas_Stable_AutoDeploy/Silverpeas-Components/yellowpages/yellowpages-library/target/classes
08:24:51 [2025-04-03T06:24:51.717Z] [WARNING] unknown enum constant XmlAccessType.NONE
08:24:51 [2025-04-03T06:24:51.717Z] [WARNING] reason: class file for javax.xml.bind.annotation.XmlAccessType not found
08:24:51 [2025-04-03T06:24:51.717Z] warning: unknown enum constant XmlAccessType.NONE
08:24:51 [2025-04-03T06:24:51.717Z] reason: class file for javax.xml.bind.annotation.XmlAccessType not found
08:24:51 [2025-04-03T06:24:51.717Z] warning: unknown enum constant XmlAccessType.NONE
08:24:51 [2025-04-03T06:24:51.717Z] reason: class file for javax.xml.bind.annotation.XmlAccessType not found
08:24:51 [2025-04-03T06:24:51.717Z] /var/lib/jenkins/workspace/Silverpeas_Stable_AutoDeploy/Silverpeas-Components/yellowpages/yellowpages-library/src/main/java/org/silverpeas/components/yellowpages/dao/GroupDAO.java:[56,27] [deprecation] UtilException in org.silverpeas.core.exception has been deprecated
08:24:51 [2025-04-03T06:24:51.717Z] [WARNING] /var/lib/jenkins/workspace/Silverpeas_Stable_AutoDeploy/Silverpeas-Components/yellowpages/yellowpages-library/src/main/java/org/silverpeas/components/yellowpages/dao/GroupDAO.java:[56,27] [deprecation] UtilException in org.silverpeas.core.exception has been deprecated
08:24:51 [2025-04-03T06:24:51.717Z] [WARNING] /var/lib/jenkins/workspace/Silverpeas_Stable_AutoDeploy/Silverpeas-Components/yellowpages/yellowpages-library/src/main/java/org/silverpeas/components/yellowpages/dao/GroupDAO.java:[56,27] [deprecation] UtilException in org.silverpeas.core.exception has been deprecated
08:24:51 [2025-04-03T06:24:51.717Z] [WARNING] unknown enum constant XmlAccessType.NONE
08:24:51 [2025-04-03T06:24:51.717Z] [WARNING] unknown enum constant XmlAccessType.FIELD
08:24:51 [2025-04-03T06:24:51.717Z] [WARNING] /var/lib/jenkins/workspace/Silverpeas_Stable_AutoDeploy/Silverpeas-Components/yellowpages/yellowpages-library/src/main/java/org/silverpeas/components/yellowpages/YellowpagesException.java:[28,42] [deprecation] SilverpeasException in org.silverpeas.core.exception has been deprecated
08:24:51 [2025-04-03T06:24:51.717Z] [WARNING] /var/lib/jenkins/workspace/Silverpeas_Stable_AutoDeploy/Silverpeas-Components/yellowpages/yellowpages-library/src/main/java/org/silverpeas/components/yellowpages/YellowpagesException.java:[28,42] [deprecation] SilverpeasException in org.silverpeas.core.exception has been deprecated
08:24:51 [2025-04-03T06:24:51.717Z] [WARNING] /var/lib/jenkins/workspace/Silverpeas_Stable_AutoDeploy/Silverpeas-Components/yellowpages/yellowpages-library/src/main/java/org/silverpeas/components/yellowpages/YellowpagesException.java:[28,42] [deprecation] SilverpeasException in org.silverpeas.core.exception has been deprecated
08:24:51 [2025-04-03T06:24:51.717Z] [INFO]
08:24:51 [2025-04-03T06:24:51.717Z] [INFO] --- build-helper-maven-plugin:3.3.0:add-test-source (add-integration-test-sources) @ silverpeas-yellowpages ---
08:24:51 [2025-04-03T06:24:51.717Z] [INFO] Test Source directory: /var/lib/jenkins/workspace/Silverpeas_Stable_AutoDeploy/Silverpeas-Components/yellowpages/yellowpages-library/src/integration-test/java added.
08:24:51 [2025-04-03T06:24:51.717Z] [INFO]
08:24:51 [2025-04-03T06:24:51.717Z] [INFO] --- build-helper-maven-plugin:3.3.0:add-test-resource (add-integration-test-sources) @ silverpeas-yellowpages ---
08:24:51 [2025-04-03T06:24:51.717Z] [INFO]
08:24:51 [2025-04-03T06:24:51.717Z] [INFO] --- maven-resources-plugin:3.3.0:testResources (default-testResources) @ silverpeas-yellowpages ---
08:24:51 [2025-04-03T06:24:51.717Z] [INFO] Not copying test resources
08:24:51 [2025-04-03T06:24:51.717Z] [INFO]
08:24:51 [2025-04-03T06:24:51.717Z] [INFO] --- maven-compiler-plugin:3.10.1:testCompile (default-testCompile) @ silverpeas-yellowpages ---
08:24:51 [2025-04-03T06:24:51.717Z] [INFO] Not compiling test sources
08:24:51 [2025-04-03T06:24:51.717Z] [INFO]
08:24:51 [2025-04-03T06:24:51.717Z] [INFO] --- maven-surefire-plugin:2.22.2:test (default-test) @ silverpeas-yellowpages ---
08:24:51 [2025-04-03T06:24:51.717Z] [INFO] No tests to run.
08:24:51 [2025-04-03T06:24:51.717Z] [INFO]
08:24:51 [2025-04-03T06:24:51.717Z] [INFO] --- maven-jar-plugin:3.3.0:jar (default-jar) @ silverpeas-yellowpages ---
08:24:51 [2025-04-03T06:24:51.717Z] [INFO] Building jar: /var/lib/jenkins/workspace/Silverpeas_Stable_AutoDeploy/Silverpeas-Components/yellowpages/yellowpages-library/target/silverpeas-yellowpages-6.4.3-build250403.jar
08:24:51 [2025-04-03T06:24:51.717Z] [INFO]
08:24:51 [2025-04-03T06:24:51.717Z] [INFO] --- maven-site-plugin:3.12.1:attach-descriptor (attach-descriptor) @ silverpeas-yellowpages ---
08:24:51 [2025-04-03T06:24:51.717Z] [INFO] Skipping because packaging 'jar' is not pom.
08:24:51 [2025-04-03T06:24:51.717Z] [INFO]
08:24:51 [2025-04-03T06:24:51.717Z] [INFO] --- maven-source-plugin:3.2.1:jar-no-fork (bundle-source) @ silverpeas-yellowpages ---
08:24:51 [2025-04-03T06:24:51.717Z] [INFO] Building jar: /var/lib/jenkins/workspace/Silverpeas_Stable_AutoDeploy/Silverpeas-Components/yellowpages/yellowpages-library/target/silverpeas-yellowpages-6.4.3-build250403-sources.jar
08:24:51 [2025-04-03T06:24:51.717Z] [INFO]
08:24:51 [2025-04-03T06:24:51.717Z] [INFO] --- maven-failsafe-plugin:2.22.2:integration-test (default) @ silverpeas-yellowpages ---
08:24:51 [2025-04-03T06:24:51.717Z] [INFO] Tests are skipped.
08:24:51 [2025-04-03T06:24:51.717Z] [INFO]
08:24:51 [2025-04-03T06:24:51.717Z] [INFO] --- maven-javadoc-plugin:3.4.1:jar (attach-javadocs) @ silverpeas-yellowpages ---
08:24:51 [2025-04-03T06:24:51.968Z] [INFO] No previous run data found, generating javadoc.
08:24:55 [2025-04-03T06:24:55.197Z] [INFO]
08:24:55 [2025-04-03T06:24:55.197Z] 1 warning
08:24:55 [2025-04-03T06:24:55.197Z] [WARNING] Javadoc Warnings
08:24:55 [2025-04-03T06:24:55.197Z] [WARNING] warning: unknown enum constant XmlAccessType.NONE
08:24:55 [2025-04-03T06:24:55.197Z] [WARNING] reason: class file for javax.xml.bind.annotation.XmlAccessType not found
08:24:55 [2025-04-03T06:24:55.197Z] [INFO] Building jar: /var/lib/jenkins/workspace/Silverpeas_Stable_AutoDeploy/Silverpeas-Components/yellowpages/yellowpages-library/target/silverpeas-yellowpages-6.4.3-build250403-javadoc.jar
08:24:55 [2025-04-03T06:24:55.197Z] [INFO]
08:24:55 [2025-04-03T06:24:55.197Z] [INFO] --- maven-source-plugin:3.2.1:jar-no-fork (attach-sources) @ silverpeas-yellowpages ---
08:24:55 [2025-04-03T06:24:55.197Z] [INFO] Building jar: /var/lib/jenkins/workspace/Silverpeas_Stable_AutoDeploy/Silverpeas-Components/yellowpages/yellowpages-library/target/silverpeas-yellowpages-6.4.3-build250403-sources.jar
08:24:55 [2025-04-03T06:24:55.197Z] [WARNING] artifact org.silverpeas.components.yellowpages:silverpeas-yellowpages:java-source:sources:6.4.3-build250403 already attached, replace previous instance
08:24:55 [2025-04-03T06:24:55.197Z] [INFO]
08:24:55 [2025-04-03T06:24:55.197Z] [INFO] --- maven-failsafe-plugin:2.22.2:verify (default) @ silverpeas-yellowpages ---
08:24:55 [2025-04-03T06:24:55.197Z] [INFO] Tests are skipped.
08:24:55 [2025-04-03T06:24:55.197Z] [INFO]
08:24:55 [2025-04-03T06:24:55.197Z] [INFO] --- maven-install-plugin:3.0.1:install (default-install) @ silverpeas-yellowpages ---
08:24:55 [2025-04-03T06:24:55.197Z] [INFO] Installing /var/lib/jenkins/workspace/Silverpeas_Stable_AutoDeploy/Silverpeas-Components/yellowpages/yellowpages-library/pom.xml to /home/silverbuild/.m2/repository/org/silverpeas/components/yellowpages/silverpeas-yellowpages/6.4.3-build250403/silverpeas-yellowpages-6.4.3-build250403.pom
08:24:55 [2025-04-03T06:24:55.197Z] [INFO] Installing /var/lib/jenkins/workspace/Silverpeas_Stable_AutoDeploy/Silverpeas-Components/yellowpages/yellowpages-library/target/silverpeas-yellowpages-6.4.3-build250403.jar to /home/silverbuild/.m2/repository/org/silverpeas/components/yellowpages/silverpeas-yellowpages/6.4.3-build250403/silverpeas-yellowpages-6.4.3-build250403.jar
08:24:55 [2025-04-03T06:24:55.197Z] [INFO] Installing /var/lib/jenkins/workspace/Silverpeas_Stable_AutoDeploy/Silverpeas-Components/yellowpages/yellowpages-library/target/silverpeas-yellowpages-6.4.3-build250403-sources.jar to /home/silverbuild/.m2/repository/org/silverpeas/components/yellowpages/silverpeas-yellowpages/6.4.3-build250403/silverpeas-yellowpages-6.4.3-build250403-sources.jar
08:24:55 [2025-04-03T06:24:55.197Z] [INFO] Installing /var/lib/jenkins/workspace/Silverpeas_Stable_AutoDeploy/Silverpeas-Components/yellowpages/yellowpages-library/target/silverpeas-yellowpages-6.4.3-build250403-javadoc.jar to /home/silverbuild/.m2/repository/org/silverpeas/components/yellowpages/silverpeas-yellowpages/6.4.3-build250403/silverpeas-yellowpages-6.4.3-build250403-javadoc.jar
08:24:55 [2025-04-03T06:24:55.197Z] [INFO]
08:24:55 [2025-04-03T06:24:55.197Z] [INFO] --< org.silverpeas.components.yellowpages:silverpeas-yellowpages-war >--
08:24:55 [2025-04-03T06:24:55.197Z] [INFO] Building YellowPages Web Application 6.4.3-build250403 [67/129]
08:24:55 [2025-04-03T06:24:55.197Z] [INFO] from yellowpages/yellowpages-war/pom.xml
08:24:55 [2025-04-03T06:24:55.197Z] [INFO] --------------------------------[ war ]---------------------------------
08:24:55 [2025-04-03T06:24:55.197Z] [INFO]
08:24:55 [2025-04-03T06:24:55.197Z] [INFO] --- maven-clean-plugin:3.2.0:clean (default-clean) @ silverpeas-yellowpages-war ---
08:24:55 [2025-04-03T06:24:55.197Z] [INFO] Deleting /var/lib/jenkins/workspace/Silverpeas_Stable_AutoDeploy/Silverpeas-Components/yellowpages/yellowpages-war/target
08:24:55 [2025-04-03T06:24:55.197Z] [INFO]
08:24:55 [2025-04-03T06:24:55.197Z] [INFO] --- git-commit-id-plugin:4.9.10:revision (default) @ silverpeas-yellowpages-war ---
08:24:56 [2025-04-03T06:24:56.108Z] [INFO]
08:24:56 [2025-04-03T06:24:56.108Z] [INFO] --- maven-resources-plugin:3.3.0:resources (default-resources) @ silverpeas-yellowpages-war ---
08:24:56 [2025-04-03T06:24:56.108Z] [INFO] skip non existing resourceDirectory /var/lib/jenkins/workspace/Silverpeas_Stable_AutoDeploy/Silverpeas-Components/yellowpages/yellowpages-war/src/main/resources
08:24:56 [2025-04-03T06:24:56.108Z] [INFO]
08:24:56 [2025-04-03T06:24:56.108Z] [INFO] --- silverpeas-ui-compressor-maven-plugin:1.7:jslint (default) @ silverpeas-yellowpages-war ---
08:24:56 [2025-04-03T06:24:56.108Z] [INFO] nb warnings: 0, nb errors: 0
08:24:56 [2025-04-03T06:24:56.108Z] [INFO]
08:24:56 [2025-04-03T06:24:56.108Z] [INFO] --- silverpeas-ui-compressor-maven-plugin:1.7:compress (default) @ silverpeas-yellowpages-war ---
08:24:56 [2025-04-03T06:24:56.108Z] [INFO] yellowpages.css (1234b) -> yellowpages-min.css (74b)[5%]
08:24:56 [2025-04-03T06:24:56.108Z] [INFO] printContact.css (219b) -> printContact-min.css (151b)[68%]
08:24:56 [2025-04-03T06:24:56.108Z] [INFO] total input (1453b) -> output (225b)[15%]
08:24:56 [2025-04-03T06:24:56.108Z] [INFO] nb warnings: 0, nb errors: 0
08:24:56 [2025-04-03T06:24:56.108Z] [INFO]
08:24:56 [2025-04-03T06:24:56.108Z] [INFO] --- maven-compiler-plugin:3.10.1:compile (default-compile) @ silverpeas-yellowpages-war ---
08:24:56 [2025-04-03T06:24:56.359Z] [INFO] Changes detected - recompiling the module!
08:24:56 [2025-04-03T06:24:56.359Z] [INFO] Compiling 6 source files to /var/lib/jenkins/workspace/Silverpeas_Stable_AutoDeploy/Silverpeas-Components/yellowpages/yellowpages-war/target/classes
08:24:56 [2025-04-03T06:24:56.609Z] [WARNING] unknown enum constant XmlAccessType.NONE
08:24:56 [2025-04-03T06:24:56.609Z] [WARNING] reason: class file for javax.xml.bind.annotation.XmlAccessType not found
08:24:56 [2025-04-03T06:24:56.609Z] warning: unknown enum constant XmlAccessType.NONE
08:24:56 [2025-04-03T06:24:56.609Z] warning: unknown enum constant XmlAccessType.NONE
08:24:56 [2025-04-03T06:24:56.609Z] reason: class file for javax.xml.bind.annotation.XmlAccessType not found
08:24:56 [2025-04-03T06:24:56.609Z] warning: unknown enum constant XmlAccessType.NONE
08:24:56 [2025-04-03T06:24:56.609Z] warning: unknown enum constant XmlAccessType.NONE
08:24:56 [2025-04-03T06:24:56.609Z] reason: class file for javax.xml.bind.annotation.XmlAccessType not found
08:24:56 [2025-04-03T06:24:56.609Z] warning: unknown enum constant XmlAccessType.NONE
08:24:56 [2025-04-03T06:24:56.609Z] warning: unknown enum constant XmlAccessType.NONE
08:24:56 [2025-04-03T06:24:56.609Z] /var/lib/jenkins/workspace/Silverpeas_Stable_AutoDeploy/Silverpeas-Components/yellowpages/yellowpages-war/src/main/java/org/silverpeas/components/yellowpages/control/YellowpagesSessionController.java:[994,15] [deprecation] UtilTrappedException in org.silverpeas.core.exception has been deprecated
08:24:56 [2025-04-03T06:24:56.609Z] [INFO]
08:24:56 [2025-04-03T06:24:56.609Z] [INFO] --- build-helper-maven-plugin:3.3.0:add-test-source (add-integration-test-sources) @ silverpeas-yellowpages-war ---
08:24:56 [2025-04-03T06:24:56.609Z] [INFO] Test Source directory: /var/lib/jenkins/workspace/Silverpeas_Stable_AutoDeploy/Silverpeas-Components/yellowpages/yellowpages-war/src/integration-test/java added.
08:24:56 [2025-04-03T06:24:56.609Z] [INFO]
08:24:56 [2025-04-03T06:24:56.609Z] [INFO] --- build-helper-maven-plugin:3.3.0:add-test-resource (add-integration-test-sources) @ silverpeas-yellowpages-war ---
08:24:56 [2025-04-03T06:24:56.609Z] [INFO]
08:24:56 [2025-04-03T06:24:56.609Z] [INFO] --- maven-resources-plugin:3.3.0:testResources (default-testResources) @ silverpeas-yellowpages-war ---
08:24:56 [2025-04-03T06:24:56.609Z] [INFO] Not copying test resources
08:24:56 [2025-04-03T06:24:56.609Z] [INFO]
08:24:56 [2025-04-03T06:24:56.609Z] [INFO] --- maven-compiler-plugin:3.10.1:testCompile (default-testCompile) @ silverpeas-yellowpages-war ---
08:24:56 [2025-04-03T06:24:56.609Z] [INFO] Not compiling test sources
08:24:56 [2025-04-03T06:24:56.609Z] [INFO]
08:24:56 [2025-04-03T06:24:56.610Z] [INFO] --- maven-surefire-plugin:2.22.2:test (default-test) @ silverpeas-yellowpages-war ---
08:24:56 [2025-04-03T06:24:56.610Z] [INFO] No tests to run.
08:24:56 [2025-04-03T06:24:56.610Z] [INFO]
08:24:56 [2025-04-03T06:24:56.610Z] [INFO] --- maven-war-plugin:3.3.2:war (default-war) @ silverpeas-yellowpages-war ---
08:24:56 [2025-04-03T06:24:56.610Z] [INFO] Packaging webapp
08:24:56 [2025-04-03T06:24:56.610Z] [INFO] Assembling webapp [silverpeas-yellowpages-war] in [/var/lib/jenkins/workspace/Silverpeas_Stable_AutoDeploy/Silverpeas-Components/yellowpages/yellowpages-war/target/silverpeas-yellowpages-war-6.4.3-build250403]
08:24:56 [2025-04-03T06:24:56.610Z] [INFO] Processing war project
08:24:56 [2025-04-03T06:24:56.610Z] [INFO] Copying webapp resources [/var/lib/jenkins/workspace/Silverpeas_Stable_AutoDeploy/Silverpeas-Components/yellowpages/yellowpages-war/src/main/webapp]
08:24:56 [2025-04-03T06:24:56.860Z] [INFO] Building war: /var/lib/jenkins/workspace/Silverpeas_Stable_AutoDeploy/Silverpeas-Components/yellowpages/yellowpages-war/target/silverpeas-yellowpages-war-6.4.3-build250403.war
08:24:57 [2025-04-03T06:24:57.110Z] [INFO]
08:24:57 [2025-04-03T06:24:57.110Z] [INFO] --- maven-site-plugin:3.12.1:attach-descriptor (attach-descriptor) @ silverpeas-yellowpages-war ---
08:24:57 [2025-04-03T06:24:57.110Z] [INFO] Skipping because packaging 'war' is not pom.
08:24:57 [2025-04-03T06:24:57.110Z] [INFO]
08:24:57 [2025-04-03T06:24:57.110Z] [INFO] --- maven-source-plugin:3.2.1:jar-no-fork (bundle-source) @ silverpeas-yellowpages-war ---
08:24:57 [2025-04-03T06:24:57.110Z] [INFO] Building jar: /var/lib/jenkins/workspace/Silverpeas_Stable_AutoDeploy/Silverpeas-Components/yellowpages/yellowpages-war/target/silverpeas-yellowpages-war-6.4.3-build250403-sources.jar
08:24:57 [2025-04-03T06:24:57.110Z] [INFO]
08:24:57 [2025-04-03T06:24:57.110Z] [INFO] --- maven-failsafe-plugin:2.22.2:integration-test (default) @ silverpeas-yellowpages-war ---
08:24:57 [2025-04-03T06:24:57.110Z] [INFO] Tests are skipped.
08:24:57 [2025-04-03T06:24:57.110Z] [INFO]
08:24:57 [2025-04-03T06:24:57.110Z] [INFO] --- maven-javadoc-plugin:3.4.1:jar (attach-javadocs) @ silverpeas-yellowpages-war ---
08:24:57 [2025-04-03T06:24:57.110Z] [INFO] No previous run data found, generating javadoc.
08:25:00 [2025-04-03T06:25:00.339Z] [INFO]
08:25:00 [2025-04-03T06:25:00.339Z] 3 warnings
08:25:00 [2025-04-03T06:25:00.339Z] [WARNING] Javadoc Warnings
08:25:00 [2025-04-03T06:25:00.339Z] [WARNING] warning: unknown enum constant XmlAccessType.NONE
08:25:00 [2025-04-03T06:25:00.339Z] [WARNING] reason: class file for javax.xml.bind.annotation.XmlAccessType not found
08:25:00 [2025-04-03T06:25:00.339Z] [WARNING] warning: unknown enum constant XmlAccessType.NONE
08:25:00 [2025-04-03T06:25:00.339Z] [WARNING] /var/lib/jenkins/workspace/Silverpeas_Stable_AutoDeploy/Silverpeas-Components/yellowpages/yellowpages-war/src/main/java/org/silverpeas/components/yellowpages/control/YellowpagesSessionController.java:942: warning - @param argument "modelId" is not a parameter name.
08:25:00 [2025-04-03T06:25:00.339Z] [INFO] Building jar: /var/lib/jenkins/workspace/Silverpeas_Stable_AutoDeploy/Silverpeas-Components/yellowpages/yellowpages-war/target/silverpeas-yellowpages-war-6.4.3-build250403-javadoc.jar
08:25:00 [2025-04-03T06:25:00.339Z] [INFO]
08:25:00 [2025-04-03T06:25:00.339Z] [INFO] --- maven-source-plugin:3.2.1:jar-no-fork (attach-sources) @ silverpeas-yellowpages-war ---
08:25:00 [2025-04-03T06:25:00.339Z] [INFO] Building jar: /var/lib/jenkins/workspace/Silverpeas_Stable_AutoDeploy/Silverpeas-Components/yellowpages/yellowpages-war/target/silverpeas-yellowpages-war-6.4.3-build250403-sources.jar
08:25:00 [2025-04-03T06:25:00.339Z] [WARNING] artifact org.silverpeas.components.yellowpages:silverpeas-yellowpages-war:java-source:sources:6.4.3-build250403 already attached, replace previous instance
08:25:00 [2025-04-03T06:25:00.339Z] [INFO]
08:25:00 [2025-04-03T06:25:00.339Z] [INFO] --- maven-failsafe-plugin:2.22.2:verify (default) @ silverpeas-yellowpages-war ---
08:25:00 [2025-04-03T06:25:00.339Z] [INFO] Tests are skipped.
08:25:00 [2025-04-03T06:25:00.339Z] [INFO]
08:25:00 [2025-04-03T06:25:00.339Z] [INFO] --- maven-install-plugin:3.0.1:install (default-install) @ silverpeas-yellowpages-war ---
08:25:00 [2025-04-03T06:25:00.339Z] [INFO] Installing /var/lib/jenkins/workspace/Silverpeas_Stable_AutoDeploy/Silverpeas-Components/yellowpages/yellowpages-war/pom.xml to /home/silverbuild/.m2/repository/org/silverpeas/components/yellowpages/silverpeas-yellowpages-war/6.4.3-build250403/silverpeas-yellowpages-war-6.4.3-build250403.pom
08:25:00 [2025-04-03T06:25:00.339Z] [INFO] Installing /var/lib/jenkins/workspace/Silverpeas_Stable_AutoDeploy/Silverpeas-Components/yellowpages/yellowpages-war/target/silverpeas-yellowpages-war-6.4.3-build250403.war to /home/silverbuild/.m2/repository/org/silverpeas/components/yellowpages/silverpeas-yellowpages-war/6.4.3-build250403/silverpeas-yellowpages-war-6.4.3-build250403.war
08:25:00 [2025-04-03T06:25:00.339Z] [INFO] Installing /var/lib/jenkins/workspace/Silverpeas_Stable_AutoDeploy/Silverpeas-Components/yellowpages/yellowpages-war/target/silverpeas-yellowpages-war-6.4.3-build250403-sources.jar to /home/silverbuild/.m2/repository/org/silverpeas/components/yellowpages/silverpeas-yellowpages-war/6.4.3-build250403/silverpeas-yellowpages-war-6.4.3-build250403-sources.jar
08:25:00 [2025-04-03T06:25:00.339Z] [INFO] Installing /var/lib/jenkins/workspace/Silverpeas_Stable_AutoDeploy/Silverpeas-Components/yellowpages/yellowpages-war/target/silverpeas-yellowpages-war-6.4.3-build250403-javadoc.jar to /home/silverbuild/.m2/repository/org/silverpeas/components/yellowpages/silverpeas-yellowpages-war/6.4.3-build250403/silverpeas-yellowpages-war-6.4.3-build250403-javadoc.jar
08:25:00 [2025-04-03T06:25:00.339Z] [INFO]
08:25:00 [2025-04-03T06:25:00.339Z] [INFO] --------------< org.silverpeas.components:silvercrawler >---------------
08:25:00 [2025-04-03T06:25:00.339Z] [INFO] Building Silverpeas SilverCrawler Component 6.4.3-build250403 [68/129]
08:25:00 [2025-04-03T06:25:00.339Z] [INFO] from silverCrawler/pom.xml
08:25:00 [2025-04-03T06:25:00.339Z] [INFO] --------------------------------[ pom ]---------------------------------
08:25:00 [2025-04-03T06:25:00.339Z] [INFO]
08:25:00 [2025-04-03T06:25:00.339Z] [INFO] --- maven-clean-plugin:3.2.0:clean (default-clean) @ silvercrawler ---
08:25:00 [2025-04-03T06:25:00.339Z] [INFO] Deleting /var/lib/jenkins/workspace/Silverpeas_Stable_AutoDeploy/Silverpeas-Components/silverCrawler/target
08:25:00 [2025-04-03T06:25:00.339Z] [INFO]
08:25:00 [2025-04-03T06:25:00.339Z] [INFO] --- git-commit-id-plugin:4.9.10:revision (default) @ silvercrawler ---
08:25:00 [2025-04-03T06:25:00.339Z] [INFO]
08:25:00 [2025-04-03T06:25:00.339Z] [INFO] --- silverpeas-ui-compressor-maven-plugin:1.7:jslint (default) @ silvercrawler ---
08:25:00 [2025-04-03T06:25:00.339Z] [INFO] nb warnings: 0, nb errors: 0
08:25:00 [2025-04-03T06:25:00.339Z] [INFO]
08:25:00 [2025-04-03T06:25:00.339Z] [INFO] --- silverpeas-ui-compressor-maven-plugin:1.7:compress (default) @ silvercrawler ---
08:25:00 [2025-04-03T06:25:00.339Z] [INFO] nb warnings: 0, nb errors: 0
08:25:00 [2025-04-03T06:25:00.339Z] [INFO]
08:25:00 [2025-04-03T06:25:00.339Z] [INFO] --- build-helper-maven-plugin:3.3.0:add-test-source (add-integration-test-sources) @ silvercrawler ---
08:25:00 [2025-04-03T06:25:00.339Z] [INFO] Test Source directory: /var/lib/jenkins/workspace/Silverpeas_Stable_AutoDeploy/Silverpeas-Components/silverCrawler/src/integration-test/java added.
08:25:00 [2025-04-03T06:25:00.339Z] [INFO]
08:25:00 [2025-04-03T06:25:00.339Z] [INFO] --- build-helper-maven-plugin:3.3.0:add-test-resource (add-integration-test-sources) @ silvercrawler ---
08:25:00 [2025-04-03T06:25:00.339Z] [INFO]
08:25:00 [2025-04-03T06:25:00.339Z] [INFO] --- maven-site-plugin:3.12.1:attach-descriptor (attach-descriptor) @ silvercrawler ---
08:25:00 [2025-04-03T06:25:00.339Z] [INFO] No site descriptor found: nothing to attach.
08:25:00 [2025-04-03T06:25:00.339Z] [INFO]
08:25:00 [2025-04-03T06:25:00.339Z] [INFO] --- maven-source-plugin:3.2.1:jar-no-fork (bundle-source) @ silvercrawler ---
08:25:00 [2025-04-03T06:25:00.339Z] [INFO]
08:25:00 [2025-04-03T06:25:00.339Z] [INFO] --- maven-failsafe-plugin:2.22.2:integration-test (default) @ silvercrawler ---
08:25:00 [2025-04-03T06:25:00.339Z] [INFO] Tests are skipped.
08:25:00 [2025-04-03T06:25:00.339Z] [INFO]
08:25:00 [2025-04-03T06:25:00.339Z] [INFO] --- maven-javadoc-plugin:3.4.1:jar (attach-javadocs) @ silvercrawler ---
08:25:00 [2025-04-03T06:25:00.339Z] [INFO] Not executing Javadoc as the project is not a Java classpath-capable package
08:25:00 [2025-04-03T06:25:00.339Z] [INFO]
08:25:00 [2025-04-03T06:25:00.339Z] [INFO] --- maven-source-plugin:3.2.1:jar-no-fork (attach-sources) @ silvercrawler ---
08:25:00 [2025-04-03T06:25:00.339Z] [INFO]
08:25:00 [2025-04-03T06:25:00.339Z] [INFO] --- maven-failsafe-plugin:2.22.2:verify (default) @ silvercrawler ---
08:25:00 [2025-04-03T06:25:00.339Z] [INFO] Tests are skipped.
08:25:00 [2025-04-03T06:25:00.339Z] [INFO]
08:25:00 [2025-04-03T06:25:00.339Z] [INFO] --- maven-install-plugin:3.0.1:install (default-install) @ silvercrawler ---
08:25:00 [2025-04-03T06:25:00.339Z] [INFO] Installing /var/lib/jenkins/workspace/Silverpeas_Stable_AutoDeploy/Silverpeas-Components/silverCrawler/pom.xml to /home/silverbuild/.m2/repository/org/silverpeas/components/silvercrawler/6.4.3-build250403/silvercrawler-6.4.3-build250403.pom
08:25:00 [2025-04-03T06:25:00.339Z] [INFO]
08:25:00 [2025-04-03T06:25:00.339Z] [INFO] --< org.silverpeas.components.silvercrawler:silverpeas-silvercrawler-configuration >--
08:25:00 [2025-04-03T06:25:00.339Z] [INFO] Building SilverCrawler Configuration 6.4.3-build250403 [69/129]
08:25:00 [2025-04-03T06:25:00.339Z] [INFO] from silverCrawler/silverCrawler-configuration/pom.xml
08:25:00 [2025-04-03T06:25:00.339Z] [INFO] --------------------------------[ jar ]---------------------------------
08:25:00 [2025-04-03T06:25:00.339Z] [INFO]
08:25:00 [2025-04-03T06:25:00.339Z] [INFO] --- maven-clean-plugin:3.2.0:clean (default-clean) @ silverpeas-silvercrawler-configuration ---
08:25:00 [2025-04-03T06:25:00.339Z] [INFO] Deleting /var/lib/jenkins/workspace/Silverpeas_Stable_AutoDeploy/Silverpeas-Components/silverCrawler/silverCrawler-configuration/target
08:25:00 [2025-04-03T06:25:00.339Z] [INFO]
08:25:00 [2025-04-03T06:25:00.339Z] [INFO] --- git-commit-id-plugin:4.9.10:revision (default) @ silverpeas-silvercrawler-configuration ---
08:25:01 [2025-04-03T06:25:01.683Z] [INFO]
08:25:01 [2025-04-03T06:25:01.683Z] [INFO] --- maven-resources-plugin:3.3.0:resources (default-resources) @ silverpeas-silvercrawler-configuration ---
08:25:01 [2025-04-03T06:25:01.683Z] [INFO] Copying 13 resources
08:25:01 [2025-04-03T06:25:01.683Z] [INFO]
08:25:01 [2025-04-03T06:25:01.683Z] [INFO] --- silverpeas-ui-compressor-maven-plugin:1.7:jslint (default) @ silverpeas-silvercrawler-configuration ---
08:25:01 [2025-04-03T06:25:01.683Z] [INFO] nb warnings: 0, nb errors: 0
08:25:01 [2025-04-03T06:25:01.683Z] [INFO]
08:25:01 [2025-04-03T06:25:01.683Z] [INFO] --- silverpeas-ui-compressor-maven-plugin:1.7:compress (default) @ silverpeas-silvercrawler-configuration ---
08:25:01 [2025-04-03T06:25:01.683Z] [INFO] nb warnings: 0, nb errors: 0
08:25:01 [2025-04-03T06:25:01.683Z] [INFO]
08:25:01 [2025-04-03T06:25:01.683Z] [INFO] --- maven-compiler-plugin:3.10.1:compile (default-compile) @ silverpeas-silvercrawler-configuration ---
08:25:01 [2025-04-03T06:25:01.683Z] [INFO] No sources to compile
08:25:01 [2025-04-03T06:25:01.683Z] [INFO]
08:25:01 [2025-04-03T06:25:01.683Z] [INFO] --- build-helper-maven-plugin:3.3.0:add-test-source (add-integration-test-sources) @ silverpeas-silvercrawler-configuration ---
08:25:01 [2025-04-03T06:25:01.683Z] [INFO] Test Source directory: /var/lib/jenkins/workspace/Silverpeas_Stable_AutoDeploy/Silverpeas-Components/silverCrawler/silverCrawler-configuration/src/integration-test/java added.
08:25:01 [2025-04-03T06:25:01.683Z] [INFO]
08:25:01 [2025-04-03T06:25:01.683Z] [INFO] --- build-helper-maven-plugin:3.3.0:add-test-resource (add-integration-test-sources) @ silverpeas-silvercrawler-configuration ---
08:25:01 [2025-04-03T06:25:01.683Z] [INFO]
08:25:01 [2025-04-03T06:25:01.683Z] [INFO] --- maven-resources-plugin:3.3.0:testResources (default-testResources) @ silverpeas-silvercrawler-configuration ---
08:25:01 [2025-04-03T06:25:01.683Z] [INFO] Not copying test resources
08:25:01 [2025-04-03T06:25:01.683Z] [INFO]
08:25:01 [2025-04-03T06:25:01.683Z] [INFO] --- maven-compiler-plugin:3.10.1:testCompile (default-testCompile) @ silverpeas-silvercrawler-configuration ---
08:25:01 [2025-04-03T06:25:01.683Z] [INFO] Not compiling test sources
08:25:01 [2025-04-03T06:25:01.683Z] [INFO]
08:25:01 [2025-04-03T06:25:01.683Z] [INFO] --- maven-surefire-plugin:2.22.2:test (default-test) @ silverpeas-silvercrawler-configuration ---
08:25:01 [2025-04-03T06:25:01.683Z] [INFO] No tests to run.
08:25:01 [2025-04-03T06:25:01.683Z] [INFO]
08:25:01 [2025-04-03T06:25:01.683Z] [INFO] --- maven-jar-plugin:3.3.0:jar (default-jar) @ silverpeas-silvercrawler-configuration ---
08:25:01 [2025-04-03T06:25:01.683Z] [INFO] Building jar: /var/lib/jenkins/workspace/Silverpeas_Stable_AutoDeploy/Silverpeas-Components/silverCrawler/silverCrawler-configuration/target/silverpeas-silvercrawler-configuration-6.4.3-build250403.jar
08:25:01 [2025-04-03T06:25:01.683Z] [INFO]
08:25:01 [2025-04-03T06:25:01.683Z] [INFO] --- maven-site-plugin:3.12.1:attach-descriptor (attach-descriptor) @ silverpeas-silvercrawler-configuration ---
08:25:01 [2025-04-03T06:25:01.683Z] [INFO] Skipping because packaging 'jar' is not pom.
08:25:01 [2025-04-03T06:25:01.683Z] [INFO]
08:25:01 [2025-04-03T06:25:01.683Z] [INFO] --- maven-source-plugin:3.2.1:jar-no-fork (bundle-source) @ silverpeas-silvercrawler-configuration ---
08:25:01 [2025-04-03T06:25:01.683Z] [INFO] Building jar: /var/lib/jenkins/workspace/Silverpeas_Stable_AutoDeploy/Silverpeas-Components/silverCrawler/silverCrawler-configuration/target/silverpeas-silvercrawler-configuration-6.4.3-build250403-sources.jar
08:25:01 [2025-04-03T06:25:01.683Z] [INFO]
08:25:01 [2025-04-03T06:25:01.683Z] [INFO] --- maven-failsafe-plugin:2.22.2:integration-test (default) @ silverpeas-silvercrawler-configuration ---
08:25:01 [2025-04-03T06:25:01.683Z] [INFO] Tests are skipped.
08:25:01 [2025-04-03T06:25:01.683Z] [INFO]
08:25:01 [2025-04-03T06:25:01.683Z] [INFO] --- maven-javadoc-plugin:3.4.1:jar (attach-javadocs) @ silverpeas-silvercrawler-configuration ---
08:25:01 [2025-04-03T06:25:01.683Z] [INFO]
08:25:01 [2025-04-03T06:25:01.683Z] [INFO] --- maven-source-plugin:3.2.1:jar-no-fork (attach-sources) @ silverpeas-silvercrawler-configuration ---
08:25:01 [2025-04-03T06:25:01.683Z] [WARNING] artifact org.silverpeas.components.silvercrawler:silverpeas-silvercrawler-configuration:java-source:sources:6.4.3-build250403 already attached, replace previous instance
08:25:01 [2025-04-03T06:25:01.683Z] [INFO]
08:25:01 [2025-04-03T06:25:01.683Z] [INFO] --- maven-failsafe-plugin:2.22.2:verify (default) @ silverpeas-silvercrawler-configuration ---
08:25:01 [2025-04-03T06:25:01.683Z] [INFO] Tests are skipped.
08:25:01 [2025-04-03T06:25:01.683Z] [INFO]
08:25:01 [2025-04-03T06:25:01.683Z] [INFO] --- maven-install-plugin:3.0.1:install (default-install) @ silverpeas-silvercrawler-configuration ---
08:25:01 [2025-04-03T06:25:01.683Z] [INFO] Installing /var/lib/jenkins/workspace/Silverpeas_Stable_AutoDeploy/Silverpeas-Components/silverCrawler/silverCrawler-configuration/pom.xml to /home/silverbuild/.m2/repository/org/silverpeas/components/silvercrawler/silverpeas-silvercrawler-configuration/6.4.3-build250403/silverpeas-silvercrawler-configuration-6.4.3-build250403.pom
08:25:01 [2025-04-03T06:25:01.683Z] [INFO] Installing /var/lib/jenkins/workspace/Silverpeas_Stable_AutoDeploy/Silverpeas-Components/silverCrawler/silverCrawler-configuration/target/silverpeas-silvercrawler-configuration-6.4.3-build250403.jar to /home/silverbuild/.m2/repository/org/silverpeas/components/silvercrawler/silverpeas-silvercrawler-configuration/6.4.3-build250403/silverpeas-silvercrawler-configuration-6.4.3-build250403.jar
08:25:01 [2025-04-03T06:25:01.683Z] [INFO] Installing /var/lib/jenkins/workspace/Silverpeas_Stable_AutoDeploy/Silverpeas-Components/silverCrawler/silverCrawler-configuration/target/silverpeas-silvercrawler-configuration-6.4.3-build250403-sources.jar to /home/silverbuild/.m2/repository/org/silverpeas/components/silvercrawler/silverpeas-silvercrawler-configuration/6.4.3-build250403/silverpeas-silvercrawler-configuration-6.4.3-build250403-sources.jar
08:25:01 [2025-04-03T06:25:01.683Z] [INFO]
08:25:01 [2025-04-03T06:25:01.683Z] [INFO] --< org.silverpeas.components.silvercrawler:silverpeas-silvercrawler >--
08:25:01 [2025-04-03T06:25:01.683Z] [INFO] Building SilverCrawler Library 6.4.3-build250403 [70/129]
08:25:01 [2025-04-03T06:25:01.683Z] [INFO] from silverCrawler/silverCrawler-library/pom.xml
08:25:01 [2025-04-03T06:25:01.683Z] [INFO] --------------------------------[ jar ]---------------------------------
08:25:01 [2025-04-03T06:25:01.683Z] [INFO]
08:25:01 [2025-04-03T06:25:01.683Z] [INFO] --- maven-clean-plugin:3.2.0:clean (default-clean) @ silverpeas-silvercrawler ---
08:25:01 [2025-04-03T06:25:01.683Z] [INFO] Deleting /var/lib/jenkins/workspace/Silverpeas_Stable_AutoDeploy/Silverpeas-Components/silverCrawler/silverCrawler-library/target
08:25:01 [2025-04-03T06:25:01.683Z] [INFO]
08:25:01 [2025-04-03T06:25:01.683Z] [INFO] --- git-commit-id-plugin:4.9.10:revision (default) @ silverpeas-silvercrawler ---
08:25:03 [2025-04-03T06:25:03.027Z] [INFO]
08:25:03 [2025-04-03T06:25:03.027Z] [INFO] --- maven-resources-plugin:3.3.0:resources (default-resources) @ silverpeas-silvercrawler ---
08:25:03 [2025-04-03T06:25:03.027Z] [INFO] Copying 1 resource
08:25:03 [2025-04-03T06:25:03.027Z] [INFO]
08:25:03 [2025-04-03T06:25:03.027Z] [INFO] --- silverpeas-ui-compressor-maven-plugin:1.7:jslint (default) @ silverpeas-silvercrawler ---
08:25:03 [2025-04-03T06:25:03.027Z] [INFO] nb warnings: 0, nb errors: 0
08:25:03 [2025-04-03T06:25:03.027Z] [INFO]
08:25:03 [2025-04-03T06:25:03.027Z] [INFO] --- silverpeas-ui-compressor-maven-plugin:1.7:compress (default) @ silverpeas-silvercrawler ---
08:25:03 [2025-04-03T06:25:03.027Z] [INFO] nb warnings: 0, nb errors: 0
08:25:03 [2025-04-03T06:25:03.027Z] [INFO]
08:25:03 [2025-04-03T06:25:03.027Z] [INFO] --- maven-compiler-plugin:3.10.1:compile (default-compile) @ silverpeas-silvercrawler ---
08:25:03 [2025-04-03T06:25:03.027Z] [INFO] Changes detected - recompiling the module!
08:25:03 [2025-04-03T06:25:03.027Z] [INFO] Compiling 16 source files to /var/lib/jenkins/workspace/Silverpeas_Stable_AutoDeploy/Silverpeas-Components/silverCrawler/silverCrawler-library/target/classes
08:25:03 [2025-04-03T06:25:03.277Z] [INFO]
08:25:03 [2025-04-03T06:25:03.277Z] [INFO] --- build-helper-maven-plugin:3.3.0:add-test-source (add-integration-test-sources) @ silverpeas-silvercrawler ---
08:25:03 [2025-04-03T06:25:03.277Z] [INFO] Test Source directory: /var/lib/jenkins/workspace/Silverpeas_Stable_AutoDeploy/Silverpeas-Components/silverCrawler/silverCrawler-library/src/integration-test/java added.
08:25:03 [2025-04-03T06:25:03.277Z] [INFO]
08:25:03 [2025-04-03T06:25:03.277Z] [INFO] --- build-helper-maven-plugin:3.3.0:add-test-resource (add-integration-test-sources) @ silverpeas-silvercrawler ---
08:25:03 [2025-04-03T06:25:03.277Z] [INFO]
08:25:03 [2025-04-03T06:25:03.277Z] [INFO] --- maven-resources-plugin:3.3.0:testResources (default-testResources) @ silverpeas-silvercrawler ---
08:25:03 [2025-04-03T06:25:03.277Z] [INFO] Not copying test resources
08:25:03 [2025-04-03T06:25:03.277Z] [INFO]
08:25:03 [2025-04-03T06:25:03.277Z] [INFO] --- maven-compiler-plugin:3.10.1:testCompile (default-testCompile) @ silverpeas-silvercrawler ---
08:25:03 [2025-04-03T06:25:03.277Z] [INFO] Not compiling test sources
08:25:03 [2025-04-03T06:25:03.277Z] [INFO]
08:25:03 [2025-04-03T06:25:03.277Z] [INFO] --- maven-surefire-plugin:2.22.2:test (default-test) @ silverpeas-silvercrawler ---
08:25:03 [2025-04-03T06:25:03.277Z] [INFO] No tests to run.
08:25:03 [2025-04-03T06:25:03.277Z] [INFO]
08:25:03 [2025-04-03T06:25:03.277Z] [INFO] --- maven-jar-plugin:3.3.0:jar (default-jar) @ silverpeas-silvercrawler ---
08:25:03 [2025-04-03T06:25:03.277Z] [INFO] Building jar: /var/lib/jenkins/workspace/Silverpeas_Stable_AutoDeploy/Silverpeas-Components/silverCrawler/silverCrawler-library/target/silverpeas-silvercrawler-6.4.3-build250403.jar
08:25:03 [2025-04-03T06:25:03.277Z] [INFO]
08:25:03 [2025-04-03T06:25:03.277Z] [INFO] --- maven-site-plugin:3.12.1:attach-descriptor (attach-descriptor) @ silverpeas-silvercrawler ---
08:25:03 [2025-04-03T06:25:03.277Z] [INFO] Skipping because packaging 'jar' is not pom.
08:25:03 [2025-04-03T06:25:03.277Z] [INFO]
08:25:03 [2025-04-03T06:25:03.277Z] [INFO] --- maven-source-plugin:3.2.1:jar-no-fork (bundle-source) @ silverpeas-silvercrawler ---
08:25:03 [2025-04-03T06:25:03.277Z] [INFO] Building jar: /var/lib/jenkins/workspace/Silverpeas_Stable_AutoDeploy/Silverpeas-Components/silverCrawler/silverCrawler-library/target/silverpeas-silvercrawler-6.4.3-build250403-sources.jar
08:25:03 [2025-04-03T06:25:03.277Z] [INFO]
08:25:03 [2025-04-03T06:25:03.277Z] [INFO] --- maven-failsafe-plugin:2.22.2:integration-test (default) @ silverpeas-silvercrawler ---
08:25:03 [2025-04-03T06:25:03.277Z] [INFO] Tests are skipped.
08:25:03 [2025-04-03T06:25:03.277Z] [INFO]
08:25:03 [2025-04-03T06:25:03.277Z] [INFO] --- maven-javadoc-plugin:3.4.1:jar (attach-javadocs) @ silverpeas-silvercrawler ---
08:25:03 [2025-04-03T06:25:03.528Z] [INFO] No previous run data found, generating javadoc.
08:25:06 [2025-04-03T06:25:06.756Z] [INFO] Building jar: /var/lib/jenkins/workspace/Silverpeas_Stable_AutoDeploy/Silverpeas-Components/silverCrawler/silverCrawler-library/target/silverpeas-silvercrawler-6.4.3-build250403-javadoc.jar
08:25:06 [2025-04-03T06:25:06.756Z] [INFO]
08:25:06 [2025-04-03T06:25:06.756Z] [INFO] --- maven-source-plugin:3.2.1:jar-no-fork (attach-sources) @ silverpeas-silvercrawler ---
08:25:06 [2025-04-03T06:25:06.756Z] [INFO] Building jar: /var/lib/jenkins/workspace/Silverpeas_Stable_AutoDeploy/Silverpeas-Components/silverCrawler/silverCrawler-library/target/silverpeas-silvercrawler-6.4.3-build250403-sources.jar
08:25:06 [2025-04-03T06:25:06.756Z] [WARNING] artifact org.silverpeas.components.silvercrawler:silverpeas-silvercrawler:java-source:sources:6.4.3-build250403 already attached, replace previous instance
08:25:06 [2025-04-03T06:25:06.756Z] [INFO]
08:25:06 [2025-04-03T06:25:06.756Z] [INFO] --- maven-failsafe-plugin:2.22.2:verify (default) @ silverpeas-silvercrawler ---
08:25:06 [2025-04-03T06:25:06.756Z] [INFO] Tests are skipped.
08:25:06 [2025-04-03T06:25:06.756Z] [INFO]
08:25:06 [2025-04-03T06:25:06.756Z] [INFO] --- maven-install-plugin:3.0.1:install (default-install) @ silverpeas-silvercrawler ---
08:25:06 [2025-04-03T06:25:06.756Z] [INFO] Installing /var/lib/jenkins/workspace/Silverpeas_Stable_AutoDeploy/Silverpeas-Components/silverCrawler/silverCrawler-library/pom.xml to /home/silverbuild/.m2/repository/org/silverpeas/components/silvercrawler/silverpeas-silvercrawler/6.4.3-build250403/silverpeas-silvercrawler-6.4.3-build250403.pom
08:25:06 [2025-04-03T06:25:06.756Z] [INFO] Installing /var/lib/jenkins/workspace/Silverpeas_Stable_AutoDeploy/Silverpeas-Components/silverCrawler/silverCrawler-library/target/silverpeas-silvercrawler-6.4.3-build250403.jar to /home/silverbuild/.m2/repository/org/silverpeas/components/silvercrawler/silverpeas-silvercrawler/6.4.3-build250403/silverpeas-silvercrawler-6.4.3-build250403.jar
08:25:06 [2025-04-03T06:25:06.757Z] [INFO] Installing /var/lib/jenkins/workspace/Silverpeas_Stable_AutoDeploy/Silverpeas-Components/silverCrawler/silverCrawler-library/target/silverpeas-silvercrawler-6.4.3-build250403-sources.jar to /home/silverbuild/.m2/repository/org/silverpeas/components/silvercrawler/silverpeas-silvercrawler/6.4.3-build250403/silverpeas-silvercrawler-6.4.3-build250403-sources.jar
08:25:06 [2025-04-03T06:25:06.757Z] [INFO] Installing /var/lib/jenkins/workspace/Silverpeas_Stable_AutoDeploy/Silverpeas-Components/silverCrawler/silverCrawler-library/target/silverpeas-silvercrawler-6.4.3-build250403-javadoc.jar to /home/silverbuild/.m2/repository/org/silverpeas/components/silvercrawler/silverpeas-silvercrawler/6.4.3-build250403/silverpeas-silvercrawler-6.4.3-build250403-javadoc.jar
08:25:06 [2025-04-03T06:25:06.757Z] [INFO]
08:25:06 [2025-04-03T06:25:06.757Z] [INFO] --< org.silverpeas.components.silvercrawler:silverpeas-silvercrawler-war >--
08:25:06 [2025-04-03T06:25:06.757Z] [INFO] Building SilverCrawler Web Application 6.4.3-build250403 [71/129]
08:25:06 [2025-04-03T06:25:06.757Z] [INFO] from silverCrawler/silverCrawler-war/pom.xml
08:25:06 [2025-04-03T06:25:06.757Z] [INFO] --------------------------------[ war ]---------------------------------
08:25:06 [2025-04-03T06:25:06.757Z] [INFO]
08:25:06 [2025-04-03T06:25:06.757Z] [INFO] --- maven-clean-plugin:3.2.0:clean (default-clean) @ silverpeas-silvercrawler-war ---
08:25:06 [2025-04-03T06:25:06.757Z] [INFO] Deleting /var/lib/jenkins/workspace/Silverpeas_Stable_AutoDeploy/Silverpeas-Components/silverCrawler/silverCrawler-war/target
08:25:06 [2025-04-03T06:25:06.757Z] [INFO]
08:25:06 [2025-04-03T06:25:06.757Z] [INFO] --- git-commit-id-plugin:4.9.10:revision (default) @ silverpeas-silvercrawler-war ---
08:25:07 [2025-04-03T06:25:07.668Z] [INFO]
08:25:07 [2025-04-03T06:25:07.668Z] [INFO] --- maven-resources-plugin:3.3.0:resources (default-resources) @ silverpeas-silvercrawler-war ---
08:25:07 [2025-04-03T06:25:07.668Z] [INFO] skip non existing resourceDirectory /var/lib/jenkins/workspace/Silverpeas_Stable_AutoDeploy/Silverpeas-Components/silverCrawler/silverCrawler-war/src/main/resources
08:25:07 [2025-04-03T06:25:07.668Z] [INFO]
08:25:07 [2025-04-03T06:25:07.668Z] [INFO] --- silverpeas-ui-compressor-maven-plugin:1.7:jslint (default) @ silverpeas-silvercrawler-war ---
08:25:07 [2025-04-03T06:25:07.668Z] [INFO] nb warnings: 0, nb errors: 0
08:25:07 [2025-04-03T06:25:07.668Z] [INFO]
08:25:07 [2025-04-03T06:25:07.668Z] [INFO] --- silverpeas-ui-compressor-maven-plugin:1.7:compress (default) @ silverpeas-silvercrawler-war ---
08:25:07 [2025-04-03T06:25:07.668Z] [INFO] silverCrawler.css (1566b) -> silverCrawler-min.css (1243b)[79%]
08:25:07 [2025-04-03T06:25:07.668Z] [INFO] total input (1566b) -> output (1243b)[79%]
08:25:07 [2025-04-03T06:25:07.668Z] [INFO] nb warnings: 0, nb errors: 0
08:25:07 [2025-04-03T06:25:07.668Z] [INFO]
08:25:07 [2025-04-03T06:25:07.668Z] [INFO] --- maven-compiler-plugin:3.10.1:compile (default-compile) @ silverpeas-silvercrawler-war ---
08:25:07 [2025-04-03T06:25:07.668Z] [INFO] Changes detected - recompiling the module!
08:25:07 [2025-04-03T06:25:07.668Z] [INFO] Compiling 47 source files to /var/lib/jenkins/workspace/Silverpeas_Stable_AutoDeploy/Silverpeas-Components/silverCrawler/silverCrawler-war/target/classes
08:25:07 [2025-04-03T06:25:07.919Z] [INFO] -------------------------------------------------------------
08:25:07 [2025-04-03T06:25:07.919Z] [WARNING] COMPILATION WARNING :
08:25:07 [2025-04-03T06:25:07.919Z] [INFO] -------------------------------------------------------------
08:25:07 [2025-04-03T06:25:07.919Z] [WARNING] unknown enum constant XmlAccessType.NONE
08:25:07 [2025-04-03T06:25:07.919Z] [WARNING] unknown enum constant XmlAccessType.NONE
08:25:07 [2025-04-03T06:25:07.919Z] [INFO] 2 warnings
08:25:07 [2025-04-03T06:25:07.919Z] [INFO] -------------------------------------------------------------
08:25:07 [2025-04-03T06:25:07.919Z] [INFO] -------------------------------------------------------------
08:25:07 [2025-04-03T06:25:07.919Z] [ERROR] COMPILATION ERROR :
08:25:07 [2025-04-03T06:25:07.919Z] [INFO] -------------------------------------------------------------
08:25:07 [2025-04-03T06:25:07.919Z] [ERROR] reason: class file for javax.xml.bind.annotation.XmlAccessType not found
08:25:07 [2025-04-03T06:25:07.919Z] warning: unknown enum constant XmlAccessType.FIELD
08:25:07 [2025-04-03T06:25:07.919Z] warning: unknown enum constant XmlAccessType.NONE
08:25:07 [2025-04-03T06:25:07.919Z] reason: class file for javax.xml.bind.annotation.XmlAccessType not found
08:25:07 [2025-04-03T06:25:07.919Z] warning: unknown enum constant XmlAccessType.FIELD
08:25:07 [2025-04-03T06:25:07.919Z] warning: unknown enum constant XmlAccessType.NONE
08:25:07 [2025-04-03T06:25:07.919Z] reason: class file for javax.xml.bind.annotation.XmlAccessType not found
08:25:07 [2025-04-03T06:25:07.919Z] warning: unknown enum constant XmlAccessType.FIELD
08:25:07 [2025-04-03T06:25:07.919Z] /var/lib/jenkins/workspace/Silverpeas_Stable_AutoDeploy/Silverpeas-Components/silverCrawler/silverCrawler-war/src/main/java/org/silverpeas/components/silvercrawler/servlets/handlers/SubDirectoryFromResultHandler.java:[42,29] error: cannot find symbol
08:25:07 [2025-04-03T06:25:07.919Z] symbol: method verifyTaintedData(String)
08:25:07 [2025-04-03T06:25:07.919Z] location: class FileUtil
08:25:07 [2025-04-03T06:25:07.919Z] [ERROR] /var/lib/jenkins/workspace/Silverpeas_Stable_AutoDeploy/Silverpeas-Components/silverCrawler/silverCrawler-war/src/main/java/org/silverpeas/components/silvercrawler/control/SilverCrawlerSessionController.java:[147,59] error: cannot find symbol
08:25:07 [2025-04-03T06:25:07.919Z] symbol: method verifyTaintedData(String)
08:25:07 [2025-04-03T06:25:07.919Z] location: class FileUtil
08:25:07 [2025-04-03T06:25:07.919Z] [ERROR] /var/lib/jenkins/workspace/Silverpeas_Stable_AutoDeploy/Silverpeas-Components/silverCrawler/silverCrawler-war/src/main/java/org/silverpeas/components/silvercrawler/control/SilverCrawlerSessionController.java:[270,56] error: cannot find symbol
08:25:07 [2025-04-03T06:25:07.919Z] symbol: method verifyTaintedData(String)
08:25:07 [2025-04-03T06:25:07.919Z] location: class FileUtil
08:25:07 [2025-04-03T06:25:07.919Z] [ERROR] /var/lib/jenkins/workspace/Silverpeas_Stable_AutoDeploy/Silverpeas-Components/silverCrawler/silverCrawler-war/src/main/java/org/silverpeas/components/silvercrawler/control/SilverCrawlerSessionController.java:[275,57] error: cannot find symbol
08:25:07 [2025-04-03T06:25:07.919Z] symbol: method verifyTaintedData(String)
08:25:07 [2025-04-03T06:25:07.919Z] location: class FileUtil
08:25:07 [2025-04-03T06:25:07.919Z] [ERROR] /var/lib/jenkins/workspace/Silverpeas_Stable_AutoDeploy/Silverpeas-Components/silverCrawler/silverCrawler-war/src/main/java/org/silverpeas/components/silvercrawler/control/SilverCrawlerSessionController.java:[294,24] error: cannot find symbol
08:25:07 [2025-04-03T06:25:07.919Z] symbol: method verifyTaintedData(String)
08:25:07 [2025-04-03T06:25:07.919Z] location: class FileUtil
08:25:07 [2025-04-03T06:25:07.919Z] [ERROR] /var/lib/jenkins/workspace/Silverpeas_Stable_AutoDeploy/Silverpeas-Components/silverCrawler/silverCrawler-war/src/main/java/org/silverpeas/components/silvercrawler/control/SilverCrawlerSessionController.java:[300,24] error: cannot find symbol
08:25:07 [2025-04-03T06:25:07.919Z] symbol: method verifyTaintedData(String)
08:25:07 [2025-04-03T06:25:07.919Z] location: class FileUtil
08:25:07 [2025-04-03T06:25:07.919Z] [ERROR] /var/lib/jenkins/workspace/Silverpeas_Stable_AutoDeploy/Silverpeas-Components/silverCrawler/silverCrawler-war/src/main/java/org/silverpeas/components/silvercrawler/control/SilverCrawlerSessionController.java:[513,42] error: cannot find symbol
08:25:07 [2025-04-03T06:25:07.919Z] symbol: method verifyTaintedData(String)
08:25:07 [2025-04-03T06:25:07.919Z] location: class FileUtil
08:25:07 [2025-04-03T06:25:07.919Z] [ERROR] /var/lib/jenkins/workspace/Silverpeas_Stable_AutoDeploy/Silverpeas-Components/silverCrawler/silverCrawler-war/src/main/java/org/silverpeas/components/silvercrawler/control/SilverCrawlerSessionController.java:[584,42] error: cannot find symbol
08:25:07 [2025-04-03T06:25:07.919Z] symbol: method verifyTaintedData(String)
08:25:07 [2025-04-03T06:25:07.919Z] location: class FileUtil
08:25:07 [2025-04-03T06:25:07.919Z] [ERROR] /var/lib/jenkins/workspace/Silverpeas_Stable_AutoDeploy/Silverpeas-Components/silverCrawler/silverCrawler-war/src/main/java/org/silverpeas/components/silvercrawler/servlets/handlers/RenameFolderFormHandler.java:[44,32] error: cannot find symbol
08:25:07 [2025-04-03T06:25:07.919Z] symbol: method verifyTaintedData(String)
08:25:07 [2025-04-03T06:25:07.919Z] location: class FileUtil
08:25:07 [2025-04-03T06:25:07.919Z] [ERROR] /var/lib/jenkins/workspace/Silverpeas_Stable_AutoDeploy/Silverpeas-Components/silverCrawler/silverCrawler-war/src/main/java/org/silverpeas/components/silvercrawler/servlets/handlers/SubDirectoryHandler.java:[43,29] error: cannot find symbol
08:25:07 [2025-04-03T06:25:07.919Z] symbol: method verifyTaintedData(String)
08:25:07 [2025-04-03T06:25:07.919Z] location: class FileUtil
08:25:07 [2025-04-03T06:25:07.919Z] [ERROR] /var/lib/jenkins/workspace/Silverpeas_Stable_AutoDeploy/Silverpeas-Components/silverCrawler/silverCrawler-war/src/main/java/org/silverpeas/components/silvercrawler/servlets/handlers/IndexPathHandler.java:[43,32] error: cannot find symbol
08:25:07 [2025-04-03T06:25:07.919Z] symbol: method verifyTaintedData(String)
08:25:07 [2025-04-03T06:25:07.919Z] location: class FileUtil
08:25:07 [2025-04-03T06:25:07.919Z] [ERROR] /var/lib/jenkins/workspace/Silverpeas_Stable_AutoDeploy/Silverpeas-Components/silverCrawler/silverCrawler-war/src/main/java/org/silverpeas/components/silvercrawler/servlets/handlers/CreateFolderHandler.java:[43,29] error: cannot find symbol
08:25:07 [2025-04-03T06:25:07.919Z] symbol: method verifyTaintedData(String)
08:25:07 [2025-04-03T06:25:07.919Z] location: class FileUtil
08:25:07 [2025-04-03T06:25:07.919Z] [ERROR] /var/lib/jenkins/workspace/Silverpeas_Stable_AutoDeploy/Silverpeas-Components/silverCrawler/silverCrawler-war/src/main/java/org/silverpeas/components/silvercrawler/servlets/handlers/SearchHandler.java:[45,34] error: cannot find symbol
08:25:07 [2025-04-03T06:25:07.919Z] symbol: method verifyTaintedData(String)
08:25:07 [2025-04-03T06:25:07.919Z] location: class FileUtil
08:25:07 [2025-04-03T06:25:07.919Z] [ERROR] /var/lib/jenkins/workspace/Silverpeas_Stable_AutoDeploy/Silverpeas-Components/silverCrawler/silverCrawler-war/src/main/java/org/silverpeas/components/silvercrawler/servlets/handlers/RenameFolderHandler.java:[43,32] error: cannot find symbol
08:25:07 [2025-04-03T06:25:07.919Z] symbol: method verifyTaintedData(String)
08:25:07 [2025-04-03T06:25:07.919Z] location: class FileUtil
08:25:07 [2025-04-03T06:25:07.919Z] [ERROR] /var/lib/jenkins/workspace/Silverpeas_Stable_AutoDeploy/Silverpeas-Components/silverCrawler/silverCrawler-war/src/main/java/org/silverpeas/components/silvercrawler/servlets/handlers/RenameFolderHandler.java:[44,29] error: cannot find symbol
08:25:07 [2025-04-03T06:25:07.919Z] symbol: method verifyTaintedData(String)
08:25:07 [2025-04-03T06:25:07.919Z] location: class FileUtil
08:25:07 [2025-04-03T06:25:07.919Z] [ERROR] /var/lib/jenkins/workspace/Silverpeas_Stable_AutoDeploy/Silverpeas-Components/silverCrawler/silverCrawler-war/src/main/java/org/silverpeas/components/silvercrawler/servlets/handlers/DownloadFolderHandler.java:[42,32] error: cannot find symbol
08:25:07 [2025-04-03T06:25:07.919Z] symbol: method verifyTaintedData(String)
08:25:07 [2025-04-03T06:25:07.919Z] location: class FileUtil
08:25:07 [2025-04-03T06:25:07.919Z] [ERROR] /var/lib/jenkins/workspace/Silverpeas_Stable_AutoDeploy/Silverpeas-Components/silverCrawler/silverCrawler-war/src/main/java/org/silverpeas/components/silvercrawler/servlets/handlers/ViewDownloadHistoryHandler.java:[43,26] error: cannot find symbol
08:25:07 [2025-04-03T06:25:07.919Z] symbol: method verifyTaintedData(String)
08:25:07 [2025-04-03T06:25:07.919Z] location: class FileUtil
08:25:07 [2025-04-03T06:25:07.919Z] [ERROR] /var/lib/jenkins/workspace/Silverpeas_Stable_AutoDeploy/Silverpeas-Components/silverCrawler/silverCrawler-war/src/main/java/org/silverpeas/components/silvercrawler/servlets/handlers/GoToDirectoryHandler.java:[43,29] error: cannot find symbol
08:25:07 [2025-04-03T06:25:07.919Z] symbol: method verifyTaintedData(String)
08:25:07 [2025-04-03T06:25:07.919Z] location: class FileUtil
08:25:07 [2025-04-03T06:25:07.919Z] [ERROR] /var/lib/jenkins/workspace/Silverpeas_Stable_AutoDeploy/Silverpeas-Components/silverCrawler/silverCrawler-war/src/main/java/org/silverpeas/components/silvercrawler/servlets/handlers/RemoveFileHandler.java:[43,30] error: cannot find symbol
08:25:07 [2025-04-03T06:25:07.919Z] symbol: method verifyTaintedData(String)
08:25:07 [2025-04-03T06:25:07.919Z] location: class FileUtil
08:25:07 [2025-04-03T06:25:07.919Z] [ERROR] /var/lib/jenkins/workspace/Silverpeas_Stable_AutoDeploy/Silverpeas-Components/silverCrawler/silverCrawler-war/src/main/java/org/silverpeas/components/silvercrawler/servlets/SilverCrawlerFileServer.java:[82,32] error: cannot find symbol
08:25:07 [2025-04-03T06:25:07.919Z] symbol: method verifyTaintedData(String)
08:25:07 [2025-04-03T06:25:07.919Z] location: class FileUtil
08:25:07 [2025-04-03T06:25:07.919Z] [ERROR] /var/lib/jenkins/workspace/Silverpeas_Stable_AutoDeploy/Silverpeas-Components/silverCrawler/silverCrawler-war/src/main/java/org/silverpeas/components/silvercrawler/servlets/SilverCrawlerFileServer.java:[85,26] error: cannot find symbol
08:25:07 [2025-04-03T06:25:07.919Z] symbol: method verifyTaintedData(String)
08:25:07 [2025-04-03T06:25:07.919Z] location: class FileUtil
08:25:07 [2025-04-03T06:25:07.920Z] [ERROR] /var/lib/jenkins/workspace/Silverpeas_Stable_AutoDeploy/Silverpeas-Components/silverCrawler/silverCrawler-war/src/main/java/org/silverpeas/components/silvercrawler/servlets/handlers/ViewDownloadHistoryFromResultHandler.java:[43,30] error: cannot find symbol
08:25:07 [2025-04-03T06:25:07.920Z] symbol: method verifyTaintedData(String)
08:25:07 [2025-04-03T06:25:07.920Z] location: class FileUtil
08:25:07 [2025-04-03T06:25:07.920Z] [ERROR] /var/lib/jenkins/workspace/Silverpeas_Stable_AutoDeploy/Silverpeas-Components/silverCrawler/silverCrawler-war/src/main/java/org/silverpeas/components/silvercrawler/servlets/handlers/ViewHistoryByUserHandler.java:[45,32] error: cannot find symbol
08:25:07 [2025-04-03T06:25:07.920Z] symbol: method verifyTaintedData(String)
08:25:07 [2025-04-03T06:25:07.920Z] location: class FileUtil
08:25:07 [2025-04-03T06:25:07.920Z] [ERROR] /var/lib/jenkins/workspace/Silverpeas_Stable_AutoDeploy/Silverpeas-Components/silverCrawler/silverCrawler-war/src/main/java/org/silverpeas/components/silvercrawler/servlets/handlers/RemoveFolderHandler.java:[43,32] error: cannot find symbol
08:25:07 [2025-04-03T06:25:07.920Z] symbol: method verifyTaintedData(String)
08:25:07 [2025-04-03T06:25:07.920Z] location: class FileUtil
08:25:07 [2025-04-03T06:25:07.920Z] [ERROR] /var/lib/jenkins/workspace/Silverpeas_Stable_AutoDeploy/Silverpeas-Components/silverCrawler/silverCrawler-war/src/main/java/org/silverpeas/components/silvercrawler/servlets/handlers/RenameFileFormHandler.java:[44,30] error: cannot find symbol
08:25:07 [2025-04-03T06:25:07.920Z] symbol: method verifyTaintedData(String)
08:25:07 [2025-04-03T06:25:07.920Z] location: class FileUtil
08:25:07 [2025-04-03T06:25:07.920Z] [ERROR] /var/lib/jenkins/workspace/Silverpeas_Stable_AutoDeploy/Silverpeas-Components/silverCrawler/silverCrawler-war/src/main/java/org/silverpeas/components/silvercrawler/servlets/handlers/RenameFileHandler.java:[43,30] error: cannot find symbol
08:25:07 [2025-04-03T06:25:07.920Z] symbol: method verifyTaintedData(String)
08:25:07 [2025-04-03T06:25:07.920Z] location: class FileUtil
08:25:07 [2025-04-03T06:25:07.920Z] [ERROR] /var/lib/jenkins/workspace/Silverpeas_Stable_AutoDeploy/Silverpeas-Components/silverCrawler/silverCrawler-war/src/main/java/org/silverpeas/components/silvercrawler/servlets/handlers/RenameFileHandler.java:[44,29] error: cannot find symbol
08:25:07 [2025-04-03T06:25:07.920Z] symbol: method verifyTaintedData(String)
08:25:07 [2025-04-03T06:25:07.920Z] location: class FileUtil
08:25:07 [2025-04-03T06:25:07.920Z] [INFO] 27 errors
08:25:07 [2025-04-03T06:25:07.920Z] [INFO] -------------------------------------------------------------
08:25:07 [2025-04-03T06:25:07.920Z] [INFO] ------------------------------------------------------------------------
08:25:07 [2025-04-03T06:25:07.920Z] [INFO] Reactor Summary for Silverpeas Components 6.4.3-build250403:
08:25:07 [2025-04-03T06:25:07.920Z] [INFO]
08:25:07 [2025-04-03T06:25:07.920Z] [INFO] Silverpeas Components .............................. SUCCESS [ 5.066 s]
08:25:07 [2025-04-03T06:25:07.920Z] [INFO] Silverpeas Hyperlink Component ..................... SUCCESS [ 0.155 s]
08:25:07 [2025-04-03T06:25:07.920Z] [INFO] Hyperlink Configuration ............................ SUCCESS [ 3.262 s]
08:25:07 [2025-04-03T06:25:07.920Z] [INFO] Hyperlink Library .................................. SUCCESS [ 5.255 s]
08:25:07 [2025-04-03T06:25:07.920Z] [INFO] Hyperlink Web Application .......................... SUCCESS [ 5.511 s]
08:25:07 [2025-04-03T06:25:07.920Z] [INFO] Silverpeas DataWarning Component ................... SUCCESS [ 0.138 s]
08:25:07 [2025-04-03T06:25:07.920Z] [INFO] DataWarning Configuration .......................... SUCCESS [ 1.506 s]
08:25:07 [2025-04-03T06:25:07.920Z] [INFO] DataWarning Library ................................ SUCCESS [ 5.152 s]
08:25:07 [2025-04-03T06:25:07.920Z] [INFO] DataWarning Web Application ........................ SUCCESS [ 4.977 s]
08:25:07 [2025-04-03T06:25:07.920Z] [INFO] Silverpeas Quickinfo Component ..................... SUCCESS [ 0.092 s]
08:25:07 [2025-04-03T06:25:07.920Z] [INFO] Quickinfo Configuration ............................ SUCCESS [ 1.481 s]
08:25:07 [2025-04-03T06:25:07.920Z] [INFO] Silverpeas DelegatedNews Component ................. SUCCESS [ 0.074 s]
08:25:07 [2025-04-03T06:25:07.920Z] [INFO] DelegatedNews Library .............................. SUCCESS [ 5.365 s]
08:25:07 [2025-04-03T06:25:07.920Z] [INFO] Quickinfo Library .................................. SUCCESS [ 5.662 s]
08:25:07 [2025-04-03T06:25:07.920Z] [INFO] Quickinfo Web Application .......................... SUCCESS [ 6.141 s]
08:25:07 [2025-04-03T06:25:07.920Z] [INFO] Silverpeas Quizz Component ......................... SUCCESS [ 0.086 s]
08:25:07 [2025-04-03T06:25:07.920Z] [INFO] Quizz Configuration ................................ SUCCESS [ 1.297 s]
08:25:07 [2025-04-03T06:25:07.920Z] [INFO] Quizz Library ...................................... SUCCESS [ 5.132 s]
08:25:07 [2025-04-03T06:25:07.920Z] [INFO] Quizz Web Application .............................. SUCCESS [ 5.414 s]
08:25:07 [2025-04-03T06:25:07.920Z] [INFO] Silverpeas JdbcConnector Component ................. SUCCESS [ 0.078 s]
08:25:07 [2025-04-03T06:25:07.920Z] [INFO] JdbcConnector Configuration ........................ SUCCESS [ 1.361 s]
08:25:07 [2025-04-03T06:25:07.920Z] [INFO] JdbcConnector Library .............................. SUCCESS [ 4.648 s]
08:25:07 [2025-04-03T06:25:07.920Z] [INFO] JdbcConnector Web Application ...................... SUCCESS [ 4.936 s]
08:25:07 [2025-04-03T06:25:07.920Z] [INFO] Silverpeas RssAggregator Component ................. SUCCESS [ 0.083 s]
08:25:07 [2025-04-03T06:25:07.920Z] [INFO] RssAggregator Configuration ........................ SUCCESS [ 1.481 s]
08:25:07 [2025-04-03T06:25:07.920Z] [INFO] RssAggregator Library .............................. SUCCESS [ 4.418 s]
08:25:07 [2025-04-03T06:25:07.920Z] [INFO] RssAggregator Web Application ...................... SUCCESS [ 4.747 s]
08:25:07 [2025-04-03T06:25:07.920Z] [INFO] Silverpeas MyDB Component .......................... SUCCESS [ 0.082 s]
08:25:07 [2025-04-03T06:25:07.920Z] [INFO] MyDB Configuration ................................. SUCCESS [ 1.377 s]
08:25:07 [2025-04-03T06:25:07.920Z] [INFO] MyDB Library ....................................... SUCCESS [ 4.800 s]
08:25:07 [2025-04-03T06:25:07.920Z] [INFO] MyDB Web Application ............................... SUCCESS [ 5.087 s]
08:25:07 [2025-04-03T06:25:07.920Z] [INFO] Silverpeas ProjectManager Component ................ SUCCESS [ 0.066 s]
08:25:07 [2025-04-03T06:25:07.920Z] [INFO] ProjectManager Configuration ....................... SUCCESS [ 1.286 s]
08:25:07 [2025-04-03T06:25:07.920Z] [INFO] ProjectManager Library ............................. SUCCESS [ 4.880 s]
08:25:07 [2025-04-03T06:25:07.920Z] [INFO] ProjectManager Web Application ..................... SUCCESS [ 5.528 s]
08:25:07 [2025-04-03T06:25:07.920Z] [INFO] Silverpeas WebSites Component ...................... SUCCESS [ 0.071 s]
08:25:07 [2025-04-03T06:25:07.920Z] [INFO] WebSites Configuration ............................. SUCCESS [ 1.392 s]
08:25:07 [2025-04-03T06:25:07.920Z] [INFO] WebSites Library ................................... SUCCESS [ 4.826 s]
08:25:07 [2025-04-03T06:25:07.920Z] [INFO] WebSites Web Application ........................... SUCCESS [ 5.521 s]
08:25:07 [2025-04-03T06:25:07.920Z] [INFO] Silverpeas WhitePages Component .................... SUCCESS [ 0.100 s]
08:25:07 [2025-04-03T06:25:07.920Z] [INFO] WhitePages Configuration ........................... SUCCESS [ 1.463 s]
08:25:07 [2025-04-03T06:25:07.920Z] [INFO] WhitePages Library ................................. SUCCESS [ 5.001 s]
08:25:07 [2025-04-03T06:25:07.920Z] [INFO] WhitePages Web Application ......................... SUCCESS [ 5.252 s]
08:25:07 [2025-04-03T06:25:07.920Z] [INFO] Silverpeas QuestionReply Component ................. SUCCESS [ 0.075 s]
08:25:07 [2025-04-03T06:25:07.920Z] [INFO] QuestionReply Configuration ........................ SUCCESS [ 1.386 s]
08:25:07 [2025-04-03T06:25:07.920Z] [INFO] QuestionReply Library .............................. SUCCESS [ 4.975 s]
08:25:07 [2025-04-03T06:25:07.920Z] [INFO] QuestionReply Web Application ...................... SUCCESS [ 5.425 s]
08:25:07 [2025-04-03T06:25:07.920Z] [INFO] Silverpeas WebPages Component ...................... SUCCESS [ 0.071 s]
08:25:07 [2025-04-03T06:25:07.920Z] [INFO] WebPages Configuration ............................. SUCCESS [ 1.285 s]
08:25:07 [2025-04-03T06:25:07.920Z] [INFO] WebPages Library ................................... SUCCESS [ 4.385 s]
08:25:07 [2025-04-03T06:25:07.920Z] [INFO] WebPages Web Application ........................... SUCCESS [ 5.085 s]
08:25:07 [2025-04-03T06:25:07.920Z] [INFO] Silverpeas Mailinglist Component ................... SUCCESS [ 0.074 s]
08:25:07 [2025-04-03T06:25:07.920Z] [INFO] Mailinglist Configuration .......................... SUCCESS [ 1.330 s]
08:25:07 [2025-04-03T06:25:07.920Z] [INFO] Mailinglist Library ................................ SUCCESS [ 5.545 s]
08:25:07 [2025-04-03T06:25:07.920Z] [INFO] Mailinglist Web Application ........................ SUCCESS [ 5.156 s]
08:25:07 [2025-04-03T06:25:07.920Z] [INFO] Silverpeas InfoLetter Component .................... SUCCESS [ 0.061 s]
08:25:07 [2025-04-03T06:25:07.920Z] [INFO] InfoLetter Configuration ........................... SUCCESS [ 1.315 s]
08:25:07 [2025-04-03T06:25:07.920Z] [INFO] InfoLetter Library ................................. SUCCESS [ 5.015 s]
08:25:07 [2025-04-03T06:25:07.920Z] [INFO] InfoLetter Web Application ......................... SUCCESS [ 5.271 s]
08:25:07 [2025-04-03T06:25:07.920Z] [INFO] Silverpeas Almanach Component ...................... SUCCESS [ 0.076 s]
08:25:07 [2025-04-03T06:25:07.920Z] [INFO] Almanach Configuration ............................. SUCCESS [ 1.344 s]
08:25:07 [2025-04-03T06:25:07.920Z] [INFO] Almanach Library ................................... SUCCESS [ 4.474 s]
08:25:07 [2025-04-03T06:25:07.920Z] [INFO] Almanach Web Application ........................... SUCCESS [ 5.284 s]
08:25:07 [2025-04-03T06:25:07.920Z] [INFO] Silverpeas YellowPages Component ................... SUCCESS [ 0.070 s]
08:25:07 [2025-04-03T06:25:07.920Z] [INFO] YellowPages Configuration .......................... SUCCESS [ 1.271 s]
08:25:07 [2025-04-03T06:25:07.920Z] [INFO] YellowPages Library ................................ SUCCESS [ 4.779 s]
08:25:07 [2025-04-03T06:25:07.920Z] [INFO] YellowPages Web Application ........................ SUCCESS [ 5.391 s]
08:25:07 [2025-04-03T06:25:07.920Z] [INFO] Silverpeas SilverCrawler Component ................. SUCCESS [ 0.083 s]
08:25:07 [2025-04-03T06:25:07.920Z] [INFO] SilverCrawler Configuration ........................ SUCCESS [ 1.352 s]
08:25:07 [2025-04-03T06:25:07.920Z] [INFO] SilverCrawler Library .............................. SUCCESS [ 4.520 s]
08:25:07 [2025-04-03T06:25:07.920Z] [INFO] SilverCrawler Web Application ...................... FAILURE [ 1.779 s]
08:25:07 [2025-04-03T06:25:07.920Z] [INFO] Silverpeas ResourcesManager Component .............. SKIPPED
08:25:07 [2025-04-03T06:25:07.921Z] [INFO] ResourcesManager Configuration ..................... SKIPPED
08:25:07 [2025-04-03T06:25:07.921Z] [INFO] ResourcesManager Library ........................... SKIPPED
08:25:07 [2025-04-03T06:25:07.921Z] [INFO] Silverpeas Gallery Component ....................... SKIPPED
08:25:07 [2025-04-03T06:25:07.921Z] [INFO] Gallery Library .................................... SKIPPED
08:25:07 [2025-04-03T06:25:07.921Z] [INFO] ResourcesManager Web Application .................. SKIPPED
08:25:07 [2025-04-03T06:25:07.921Z] [INFO] Silverpeas ProcessManager Component ................ SKIPPED
08:25:07 [2025-04-03T06:25:07.921Z] [INFO] ProcessManager Configuration ....................... SKIPPED
08:25:07 [2025-04-03T06:25:07.921Z] [INFO] ProcessManager Library ............................. SKIPPED
08:25:07 [2025-04-03T06:25:07.921Z] [INFO] ProcessManager Web Application ..................... SKIPPED
08:25:07 [2025-04-03T06:25:07.921Z] [INFO] Silverpeas Forums Component ........................ SKIPPED
08:25:07 [2025-04-03T06:25:07.921Z] [INFO] Forums Configuration ............................... SKIPPED
08:25:07 [2025-04-03T06:25:07.921Z] [INFO] Forums Library ..................................... SKIPPED
08:25:07 [2025-04-03T06:25:07.921Z] [INFO] Forums Web Application ............................. SKIPPED
08:25:07 [2025-04-03T06:25:07.921Z] [INFO] Silverpeas Blog Component .......................... SKIPPED
08:25:07 [2025-04-03T06:25:07.921Z] [INFO] Blog Configuration ................................. SKIPPED
08:25:07 [2025-04-03T06:25:07.921Z] [INFO] Blog Library ....................................... SKIPPED
08:25:07 [2025-04-03T06:25:07.921Z] [INFO] Blog Web Application ............................... SKIPPED
08:25:07 [2025-04-03T06:25:07.921Z] [INFO] Silverpeas Survey Component ........................ SKIPPED
08:25:07 [2025-04-03T06:25:07.921Z] [INFO] Survey Configuration ............................... SKIPPED
08:25:07 [2025-04-03T06:25:07.921Z] [INFO] Survey Library ..................................... SKIPPED
08:25:07 [2025-04-03T06:25:07.921Z] [INFO] Survey Web Application ............................. SKIPPED
08:25:07 [2025-04-03T06:25:07.921Z] [INFO] Gallery Configuration .............................. SKIPPED
08:25:07 [2025-04-03T06:25:07.921Z] [INFO] Gallery Web Application ............................ SKIPPED
08:25:07 [2025-04-03T06:25:07.921Z] [INFO] DelegatedNews Configuration ........................ SKIPPED
08:25:07 [2025-04-03T06:25:07.921Z] [INFO] DelegatedNews Web Application ...................... SKIPPED
08:25:07 [2025-04-03T06:25:07.921Z] [INFO] Silverpeas Kmelia Component ........................ SKIPPED
08:25:07 [2025-04-03T06:25:07.921Z] [INFO] Kmelia Configuration ............................... SKIPPED
08:25:07 [2025-04-03T06:25:07.921Z] [INFO] Kmelia Library ..................................... SKIPPED
08:25:07 [2025-04-03T06:25:07.921Z] [INFO] Kmelia Web Application ............................. SKIPPED
08:25:07 [2025-04-03T06:25:07.921Z] [INFO] Silverpeas Organizationchart Component ............. SKIPPED
08:25:07 [2025-04-03T06:25:07.921Z] [INFO] Organizationchart Configuration .................... SKIPPED
08:25:07 [2025-04-03T06:25:07.921Z] [INFO] Organizationchart Library .......................... SKIPPED
08:25:07 [2025-04-03T06:25:07.921Z] [INFO] Organizationchart Web Application .................. SKIPPED
08:25:07 [2025-04-03T06:25:07.921Z] [INFO] Silverpeas Classifieds Component ................... SKIPPED
08:25:07 [2025-04-03T06:25:07.921Z] [INFO] Classifieds Configuration .......................... SKIPPED
08:25:07 [2025-04-03T06:25:07.921Z] [INFO] Classifieds Library ................................ SKIPPED
08:25:07 [2025-04-03T06:25:07.921Z] [INFO] Classifieds Web Application ........................ SKIPPED
08:25:07 [2025-04-03T06:25:07.921Z] [INFO] Silverpeas FormsOnline Component ................... SKIPPED
08:25:07 [2025-04-03T06:25:07.921Z] [INFO] FormsOnline Configuration .......................... SKIPPED
08:25:07 [2025-04-03T06:25:07.921Z] [INFO] FormsOnline Library ................................ SKIPPED
08:25:07 [2025-04-03T06:25:07.921Z] [INFO] FormsOnline Web Application ........................ SKIPPED
08:25:07 [2025-04-03T06:25:07.921Z] [INFO] Silverpeas ScheduleEvent Component ................. SKIPPED
08:25:07 [2025-04-03T06:25:07.921Z] [INFO] ScheduleEvent Configuration ........................ SKIPPED
08:25:07 [2025-04-03T06:25:07.921Z] [INFO] ScheduleEvent Library .............................. SKIPPED
08:25:07 [2025-04-03T06:25:07.921Z] [INFO] ScheduleEvent Web Application ...................... SKIPPED
08:25:07 [2025-04-03T06:25:07.921Z] [INFO] Silverpeas SuggestionBox Component ................. SKIPPED
08:25:07 [2025-04-03T06:25:07.921Z] [INFO] SuggestionBox Configuration ........................ SKIPPED
08:25:07 [2025-04-03T06:25:07.921Z] [INFO] SuggestionBox Library .............................. SKIPPED
08:25:07 [2025-04-03T06:25:07.921Z] [INFO] SuggestionBox Web Application ...................... SKIPPED
08:25:07 [2025-04-03T06:25:07.921Z] [INFO] Silverpeas SpaceMembers Component .................. SKIPPED
08:25:07 [2025-04-03T06:25:07.921Z] [INFO] SpaceMembers Configuration ......................... SKIPPED
08:25:07 [2025-04-03T06:25:07.921Z] [INFO] SpaceMembers Library ............................... SKIPPED
08:25:07 [2025-04-03T06:25:07.921Z] [INFO] SpaceMembers Web Application ....................... SKIPPED
08:25:07 [2025-04-03T06:25:07.921Z] [INFO] Silverpeas community Component ..................... SKIPPED
08:25:07 [2025-04-03T06:25:07.921Z] [INFO] community Configuration ............................ SKIPPED
08:25:07 [2025-04-03T06:25:07.921Z] [INFO] Community Business Library ......................... SKIPPED
08:25:07 [2025-04-03T06:25:07.921Z] [INFO] community Webapp ................................... SKIPPED
08:25:07 [2025-04-03T06:25:07.921Z] [INFO] ------------------------------------------------------------------------
08:25:07 [2025-04-03T06:25:07.921Z] [INFO] BUILD FAILURE
08:25:07 [2025-04-03T06:25:07.921Z] [INFO] ------------------------------------------------------------------------
08:25:07 [2025-04-03T06:25:07.921Z] [INFO] Total time: 03:27 min
08:25:07 [2025-04-03T06:25:07.921Z] [INFO] Finished at: 2025-04-03T08:25:07+02:00
08:25:07 [2025-04-03T06:25:07.921Z] [INFO] ------------------------------------------------------------------------
08:25:07 [2025-04-03T06:25:07.921Z] [ERROR] Failed to execute goal org.apache.maven.plugins:maven-compiler-plugin:3.10.1:compile (default-compile) on project silverpeas-silvercrawler-war: Compilation failure: Compilation failure:
08:25:07 [2025-04-03T06:25:07.921Z] [ERROR] reason: class file for javax.xml.bind.annotation.XmlAccessType not found
08:25:07 [2025-04-03T06:25:07.921Z] [ERROR] warning: unknown enum constant XmlAccessType.FIELD
08:25:07 [2025-04-03T06:25:07.921Z] [ERROR] warning: unknown enum constant XmlAccessType.NONE
08:25:07 [2025-04-03T06:25:07.921Z] [ERROR] reason: class file for javax.xml.bind.annotation.XmlAccessType not found
08:25:07 [2025-04-03T06:25:07.921Z] [ERROR] warning: unknown enum constant XmlAccessType.FIELD
08:25:07 [2025-04-03T06:25:07.921Z] [ERROR] warning: unknown enum constant XmlAccessType.NONE
08:25:07 [2025-04-03T06:25:07.921Z] [ERROR] reason: class file for javax.xml.bind.annotation.XmlAccessType not found
08:25:07 [2025-04-03T06:25:07.921Z] [ERROR] warning: unknown enum constant XmlAccessType.FIELD
08:25:07 [2025-04-03T06:25:07.921Z] [ERROR] /var/lib/jenkins/workspace/Silverpeas_Stable_AutoDeploy/Silverpeas-Components/silverCrawler/silverCrawler-war/src/main/java/org/silverpeas/components/silvercrawler/servlets/handlers/SubDirectoryFromResultHandler.java:[42,29] error: cannot find symbol
08:25:07 [2025-04-03T06:25:07.921Z] [ERROR] symbol: method verifyTaintedData(String)
08:25:07 [2025-04-03T06:25:07.921Z] [ERROR] location: class FileUtil
08:25:07 [2025-04-03T06:25:07.921Z] [ERROR] /var/lib/jenkins/workspace/Silverpeas_Stable_AutoDeploy/Silverpeas-Components/silverCrawler/silverCrawler-war/src/main/java/org/silverpeas/components/silvercrawler/control/SilverCrawlerSessionController.java:[147,59] error: cannot find symbol
08:25:07 [2025-04-03T06:25:07.921Z] [ERROR] symbol: method verifyTaintedData(String)
08:25:07 [2025-04-03T06:25:07.921Z] [ERROR] location: class FileUtil
08:25:07 [2025-04-03T06:25:07.921Z] [ERROR] /var/lib/jenkins/workspace/Silverpeas_Stable_AutoDeploy/Silverpeas-Components/silverCrawler/silverCrawler-war/src/main/java/org/silverpeas/components/silvercrawler/control/SilverCrawlerSessionController.java:[270,56] error: cannot find symbol
08:25:07 [2025-04-03T06:25:07.921Z] [ERROR] symbol: method verifyTaintedData(String)
08:25:07 [2025-04-03T06:25:07.921Z] [ERROR] location: class FileUtil
08:25:07 [2025-04-03T06:25:07.921Z] [ERROR] /var/lib/jenkins/workspace/Silverpeas_Stable_AutoDeploy/Silverpeas-Components/silverCrawler/silverCrawler-war/src/main/java/org/silverpeas/components/silvercrawler/control/SilverCrawlerSessionController.java:[275,57] error: cannot find symbol
08:25:07 [2025-04-03T06:25:07.921Z] [ERROR] symbol: method verifyTaintedData(String)
08:25:07 [2025-04-03T06:25:07.921Z] [ERROR] location: class FileUtil
08:25:07 [2025-04-03T06:25:07.921Z] [ERROR] /var/lib/jenkins/workspace/Silverpeas_Stable_AutoDeploy/Silverpeas-Components/silverCrawler/silverCrawler-war/src/main/java/org/silverpeas/components/silvercrawler/control/SilverCrawlerSessionController.java:[294,24] error: cannot find symbol
08:25:07 [2025-04-03T06:25:07.921Z] [ERROR] symbol: method verifyTaintedData(String)
08:25:07 [2025-04-03T06:25:07.921Z] [ERROR] location: class FileUtil
08:25:07 [2025-04-03T06:25:07.921Z] [ERROR] /var/lib/jenkins/workspace/Silverpeas_Stable_AutoDeploy/Silverpeas-Components/silverCrawler/silverCrawler-war/src/main/java/org/silverpeas/components/silvercrawler/control/SilverCrawlerSessionController.java:[300,24] error: cannot find symbol
08:25:07 [2025-04-03T06:25:07.921Z] [ERROR] symbol: method verifyTaintedData(String)
08:25:07 [2025-04-03T06:25:07.921Z] [ERROR] location: class FileUtil
08:25:07 [2025-04-03T06:25:07.921Z] [ERROR] /var/lib/jenkins/workspace/Silverpeas_Stable_AutoDeploy/Silverpeas-Components/silverCrawler/silverCrawler-war/src/main/java/org/silverpeas/components/silvercrawler/control/SilverCrawlerSessionController.java:[513,42] error: cannot find symbol
08:25:07 [2025-04-03T06:25:07.921Z] [ERROR] symbol: method verifyTaintedData(String)
08:25:07 [2025-04-03T06:25:07.921Z] [ERROR] location: class FileUtil
08:25:07 [2025-04-03T06:25:07.921Z] [ERROR] /var/lib/jenkins/workspace/Silverpeas_Stable_AutoDeploy/Silverpeas-Components/silverCrawler/silverCrawler-war/src/main/java/org/silverpeas/components/silvercrawler/control/SilverCrawlerSessionController.java:[584,42] error: cannot find symbol
08:25:07 [2025-04-03T06:25:07.921Z] [ERROR] symbol: method verifyTaintedData(String)
08:25:07 [2025-04-03T06:25:07.921Z] [ERROR] location: class FileUtil
08:25:07 [2025-04-03T06:25:07.921Z] [ERROR] /var/lib/jenkins/workspace/Silverpeas_Stable_AutoDeploy/Silverpeas-Components/silverCrawler/silverCrawler-war/src/main/java/org/silverpeas/components/silvercrawler/servlets/handlers/RenameFolderFormHandler.java:[44,32] error: cannot find symbol
08:25:07 [2025-04-03T06:25:07.921Z] [ERROR] symbol: method verifyTaintedData(String)
08:25:07 [2025-04-03T06:25:07.921Z] [ERROR] location: class FileUtil
08:25:07 [2025-04-03T06:25:07.922Z] [ERROR] /var/lib/jenkins/workspace/Silverpeas_Stable_AutoDeploy/Silverpeas-Components/silverCrawler/silverCrawler-war/src/main/java/org/silverpeas/components/silvercrawler/servlets/handlers/SubDirectoryHandler.java:[43,29] error: cannot find symbol
08:25:07 [2025-04-03T06:25:07.922Z] [ERROR] symbol: method verifyTaintedData(String)
08:25:07 [2025-04-03T06:25:07.922Z] [ERROR] location: class FileUtil
08:25:07 [2025-04-03T06:25:07.922Z] [ERROR] /var/lib/jenkins/workspace/Silverpeas_Stable_AutoDeploy/Silverpeas-Components/silverCrawler/silverCrawler-war/src/main/java/org/silverpeas/components/silvercrawler/servlets/handlers/IndexPathHandler.java:[43,32] error: cannot find symbol
08:25:07 [2025-04-03T06:25:07.922Z] [ERROR] symbol: method verifyTaintedData(String)
08:25:07 [2025-04-03T06:25:07.922Z] [ERROR] location: class FileUtil
08:25:07 [2025-04-03T06:25:07.922Z] [ERROR] /var/lib/jenkins/workspace/Silverpeas_Stable_AutoDeploy/Silverpeas-Components/silverCrawler/silverCrawler-war/src/main/java/org/silverpeas/components/silvercrawler/servlets/handlers/CreateFolderHandler.java:[43,29] error: cannot find symbol
08:25:07 [2025-04-03T06:25:07.922Z] [ERROR] symbol: method verifyTaintedData(String)
08:25:07 [2025-04-03T06:25:07.922Z] [ERROR] location: class FileUtil
08:25:07 [2025-04-03T06:25:07.922Z] [ERROR] /var/lib/jenkins/workspace/Silverpeas_Stable_AutoDeploy/Silverpeas-Components/silverCrawler/silverCrawler-war/src/main/java/org/silverpeas/components/silvercrawler/servlets/handlers/SearchHandler.java:[45,34] error: cannot find symbol
08:25:07 [2025-04-03T06:25:07.922Z] [ERROR] symbol: method verifyTaintedData(String)
08:25:07 [2025-04-03T06:25:07.922Z] [ERROR] location: class FileUtil
08:25:07 [2025-04-03T06:25:07.922Z] [ERROR] /var/lib/jenkins/workspace/Silverpeas_Stable_AutoDeploy/Silverpeas-Components/silverCrawler/silverCrawler-war/src/main/java/org/silverpeas/components/silvercrawler/servlets/handlers/RenameFolderHandler.java:[43,32] error: cannot find symbol
08:25:07 [2025-04-03T06:25:07.922Z] [ERROR] symbol: method verifyTaintedData(String)
08:25:07 [2025-04-03T06:25:07.922Z] [ERROR] location: class FileUtil
08:25:07 [2025-04-03T06:25:07.922Z] [ERROR] /var/lib/jenkins/workspace/Silverpeas_Stable_AutoDeploy/Silverpeas-Components/silverCrawler/silverCrawler-war/src/main/java/org/silverpeas/components/silvercrawler/servlets/handlers/RenameFolderHandler.java:[44,29] error: cannot find symbol
08:25:07 [2025-04-03T06:25:07.922Z] [ERROR] symbol: method verifyTaintedData(String)
08:25:07 [2025-04-03T06:25:07.922Z] [ERROR] location: class FileUtil
08:25:07 [2025-04-03T06:25:07.922Z] [ERROR] /var/lib/jenkins/workspace/Silverpeas_Stable_AutoDeploy/Silverpeas-Components/silverCrawler/silverCrawler-war/src/main/java/org/silverpeas/components/silvercrawler/servlets/handlers/DownloadFolderHandler.java:[42,32] error: cannot find symbol
08:25:07 [2025-04-03T06:25:07.922Z] [ERROR] symbol: method verifyTaintedData(String)
08:25:07 [2025-04-03T06:25:07.922Z] [ERROR] location: class FileUtil
08:25:07 [2025-04-03T06:25:07.922Z] [ERROR] /var/lib/jenkins/workspace/Silverpeas_Stable_AutoDeploy/Silverpeas-Components/silverCrawler/silverCrawler-war/src/main/java/org/silverpeas/components/silvercrawler/servlets/handlers/ViewDownloadHistoryHandler.java:[43,26] error: cannot find symbol
08:25:07 [2025-04-03T06:25:07.922Z] [ERROR] symbol: method verifyTaintedData(String)
08:25:07 [2025-04-03T06:25:07.922Z] [ERROR] location: class FileUtil
08:25:07 [2025-04-03T06:25:07.922Z] [ERROR] /var/lib/jenkins/workspace/Silverpeas_Stable_AutoDeploy/Silverpeas-Components/silverCrawler/silverCrawler-war/src/main/java/org/silverpeas/components/silvercrawler/servlets/handlers/GoToDirectoryHandler.java:[43,29] error: cannot find symbol
08:25:07 [2025-04-03T06:25:07.922Z] [ERROR] symbol: method verifyTaintedData(String)
08:25:07 [2025-04-03T06:25:07.922Z] [ERROR] location: class FileUtil
08:25:07 [2025-04-03T06:25:07.922Z] [ERROR] /var/lib/jenkins/workspace/Silverpeas_Stable_AutoDeploy/Silverpeas-Components/silverCrawler/silverCrawler-war/src/main/java/org/silverpeas/components/silvercrawler/servlets/handlers/RemoveFileHandler.java:[43,30] error: cannot find symbol
08:25:07 [2025-04-03T06:25:07.922Z] [ERROR] symbol: method verifyTaintedData(String)
08:25:07 [2025-04-03T06:25:07.922Z] [ERROR] location: class FileUtil
08:25:07 [2025-04-03T06:25:07.922Z] [ERROR] /var/lib/jenkins/workspace/Silverpeas_Stable_AutoDeploy/Silverpeas-Components/silverCrawler/silverCrawler-war/src/main/java/org/silverpeas/components/silvercrawler/servlets/SilverCrawlerFileServer.java:[82,32] error: cannot find symbol
08:25:07 [2025-04-03T06:25:07.922Z] [ERROR] symbol: method verifyTaintedData(String)
08:25:07 [2025-04-03T06:25:07.922Z] [ERROR] location: class FileUtil
08:25:07 [2025-04-03T06:25:07.922Z] [ERROR] /var/lib/jenkins/workspace/Silverpeas_Stable_AutoDeploy/Silverpeas-Components/silverCrawler/silverCrawler-war/src/main/java/org/silverpeas/components/silvercrawler/servlets/SilverCrawlerFileServer.java:[85,26] error: cannot find symbol
08:25:07 [2025-04-03T06:25:07.922Z] [ERROR] symbol: method verifyTaintedData(String)
08:25:07 [2025-04-03T06:25:07.922Z] [ERROR] location: class FileUtil
08:25:07 [2025-04-03T06:25:07.922Z] [ERROR] /var/lib/jenkins/workspace/Silverpeas_Stable_AutoDeploy/Silverpeas-Components/silverCrawler/silverCrawler-war/src/main/java/org/silverpeas/components/silvercrawler/servlets/handlers/ViewDownloadHistoryFromResultHandler.java:[43,30] error: cannot find symbol
08:25:07 [2025-04-03T06:25:07.922Z] [ERROR] symbol: method verifyTaintedData(String)
08:25:07 [2025-04-03T06:25:07.922Z] [ERROR] location: class FileUtil
08:25:07 [2025-04-03T06:25:07.922Z] [ERROR] /var/lib/jenkins/workspace/Silverpeas_Stable_AutoDeploy/Silverpeas-Components/silverCrawler/silverCrawler-war/src/main/java/org/silverpeas/components/silvercrawler/servlets/handlers/ViewHistoryByUserHandler.java:[45,32] error: cannot find symbol
08:25:07 [2025-04-03T06:25:07.922Z] [ERROR] symbol: method verifyTaintedData(String)
08:25:07 [2025-04-03T06:25:07.922Z] [ERROR] location: class FileUtil
08:25:07 [2025-04-03T06:25:07.922Z] [ERROR] /var/lib/jenkins/workspace/Silverpeas_Stable_AutoDeploy/Silverpeas-Components/silverCrawler/silverCrawler-war/src/main/java/org/silverpeas/components/silvercrawler/servlets/handlers/RemoveFolderHandler.java:[43,32] error: cannot find symbol
08:25:07 [2025-04-03T06:25:07.922Z] [ERROR] symbol: method verifyTaintedData(String)
08:25:07 [2025-04-03T06:25:07.922Z] [ERROR] location: class FileUtil
08:25:07 [2025-04-03T06:25:07.922Z] [ERROR] /var/lib/jenkins/workspace/Silverpeas_Stable_AutoDeploy/Silverpeas-Components/silverCrawler/silverCrawler-war/src/main/java/org/silverpeas/components/silvercrawler/servlets/handlers/RenameFileFormHandler.java:[44,30] error: cannot find symbol
08:25:07 [2025-04-03T06:25:07.922Z] [ERROR] symbol: method verifyTaintedData(String)
08:25:07 [2025-04-03T06:25:07.922Z] [ERROR] location: class FileUtil
08:25:07 [2025-04-03T06:25:07.922Z] [ERROR] /var/lib/jenkins/workspace/Silverpeas_Stable_AutoDeploy/Silverpeas-Components/silverCrawler/silverCrawler-war/src/main/java/org/silverpeas/components/silvercrawler/servlets/handlers/RenameFileHandler.java:[43,30] error: cannot find symbol
08:25:07 [2025-04-03T06:25:07.922Z] [ERROR] symbol: method verifyTaintedData(String)
08:25:07 [2025-04-03T06:25:07.922Z] [ERROR] location: class FileUtil
08:25:07 [2025-04-03T06:25:07.922Z] [ERROR] /var/lib/jenkins/workspace/Silverpeas_Stable_AutoDeploy/Silverpeas-Components/silverCrawler/silverCrawler-war/src/main/java/org/silverpeas/components/silvercrawler/servlets/handlers/RenameFileHandler.java:[44,29] error: cannot find symbol
08:25:07 [2025-04-03T06:25:07.922Z] [ERROR] symbol: method verifyTaintedData(String)
08:25:07 [2025-04-03T06:25:07.922Z] [ERROR] location: class FileUtil
08:25:07 [2025-04-03T06:25:07.922Z] [ERROR] -> [Help 1]
08:25:07 [2025-04-03T06:25:07.922Z] [ERROR]
08:25:07 [2025-04-03T06:25:07.922Z] [ERROR] To see the full stack trace of the errors, re-run Maven with the -e switch.
08:25:07 [2025-04-03T06:25:07.922Z] [ERROR] Re-run Maven using the -X switch to enable full debug logging.
08:25:07 [2025-04-03T06:25:07.922Z] [ERROR]
08:25:07 [2025-04-03T06:25:07.922Z] [ERROR] For more information about the errors and possible solutions, please read the following articles:
08:25:07 [2025-04-03T06:25:07.922Z] [ERROR] [Help 1] http://cwiki.apache.org/confluence/display/MAVEN/MojoFailureException
08:25:07 [2025-04-03T06:25:07.922Z] [ERROR]
08:25:07 [2025-04-03T06:25:07.922Z] [ERROR] After correcting the problems, you can resume the build with the command
08:25:07 [2025-04-03T06:25:07.922Z] [ERROR] mvn <args> -rf :silverpeas-silvercrawler-war
08:25:08 [2025-04-03T06:25:08.178Z] [Pipeline] }
08:25:08 [2025-04-03T06:25:08.190Z] [Pipeline] // dir
08:25:08 [2025-04-03T06:25:08.209Z] [Pipeline] }
08:25:08 [2025-04-03T06:25:08.219Z] [Pipeline] // stage
08:25:08 [2025-04-03T06:25:08.231Z] [Pipeline] stage
08:25:08 [2025-04-03T06:25:08.232Z] [Pipeline] { (Build Silverpeas-Assembly)
08:25:08 [2025-04-03T06:25:08.244Z] Stage "Build Silverpeas-Assembly" skipped due to earlier failure(s)
08:25:08 [2025-04-03T06:25:08.244Z] [Pipeline] getContext
08:25:08 [2025-04-03T06:25:08.246Z] [Pipeline] }
08:25:08 [2025-04-03T06:25:08.256Z] [Pipeline] // stage
08:25:08 [2025-04-03T06:25:08.269Z] [Pipeline] stage
08:25:08 [2025-04-03T06:25:08.270Z] [Pipeline] { (Build Silverpeas Setup)
08:25:08 [2025-04-03T06:25:08.280Z] Stage "Build Silverpeas Setup" skipped due to earlier failure(s)
08:25:08 [2025-04-03T06:25:08.281Z] [Pipeline] getContext
08:25:08 [2025-04-03T06:25:08.283Z] [Pipeline] }
08:25:08 [2025-04-03T06:25:08.293Z] [Pipeline] // stage
08:25:08 [2025-04-03T06:25:08.306Z] [Pipeline] stage
08:25:08 [2025-04-03T06:25:08.307Z] [Pipeline] { (Build Silverpeas Distribution)
08:25:08 [2025-04-03T06:25:08.326Z] Stage "Build Silverpeas Distribution" skipped due to earlier failure(s)
08:25:08 [2025-04-03T06:25:08.327Z] [Pipeline] getContext
08:25:08 [2025-04-03T06:25:08.329Z] [Pipeline] }
08:25:08 [2025-04-03T06:25:08.363Z] [Pipeline] // stage
08:25:08 [2025-04-03T06:25:08.384Z] [Pipeline] stage
08:25:08 [2025-04-03T06:25:08.384Z] [Pipeline] { (Build Silverpeas-Looks)
08:25:08 [2025-04-03T06:25:08.398Z] Stage "Build Silverpeas-Looks" skipped due to earlier failure(s)
08:25:08 [2025-04-03T06:25:08.399Z] [Pipeline] getContext
08:25:08 [2025-04-03T06:25:08.401Z] [Pipeline] }
08:25:08 [2025-04-03T06:25:08.414Z] [Pipeline] // stage
08:25:08 [2025-04-03T06:25:08.431Z] [Pipeline] stage
08:25:08 [2025-04-03T06:25:08.432Z] [Pipeline] { (Publish Silverpeas-Core)
08:25:08 [2025-04-03T06:25:08.445Z] Stage "Publish Silverpeas-Core" skipped due to earlier failure(s)
08:25:08 [2025-04-03T06:25:08.446Z] [Pipeline] getContext
08:25:08 [2025-04-03T06:25:08.447Z] [Pipeline] }
08:25:08 [2025-04-03T06:25:08.460Z] [Pipeline] // stage
08:25:08 [2025-04-03T06:25:08.476Z] [Pipeline] stage
08:25:08 [2025-04-03T06:25:08.477Z] [Pipeline] { (Publish Silverpeas-Components)
08:25:08 [2025-04-03T06:25:08.489Z] Stage "Publish Silverpeas-Components" skipped due to earlier failure(s)
08:25:08 [2025-04-03T06:25:08.490Z] [Pipeline] getContext
08:25:08 [2025-04-03T06:25:08.492Z] [Pipeline] }
08:25:08 [2025-04-03T06:25:08.504Z] [Pipeline] // stage
08:25:08 [2025-04-03T06:25:08.518Z] [Pipeline] stage
08:25:08 [2025-04-03T06:25:08.519Z] [Pipeline] { (Publish Silverpeas-Assembly)
08:25:08 [2025-04-03T06:25:08.531Z] Stage "Publish Silverpeas-Assembly" skipped due to earlier failure(s)
08:25:08 [2025-04-03T06:25:08.532Z] [Pipeline] getContext
08:25:08 [2025-04-03T06:25:08.534Z] [Pipeline] }
08:25:08 [2025-04-03T06:25:08.545Z] [Pipeline] // stage
08:25:08 [2025-04-03T06:25:08.560Z] [Pipeline] stage
08:25:08 [2025-04-03T06:25:08.561Z] [Pipeline] { (Publish Silverpeas-Setup)
08:25:08 [2025-04-03T06:25:08.572Z] Stage "Publish Silverpeas-Setup" skipped due to earlier failure(s)
08:25:08 [2025-04-03T06:25:08.573Z] [Pipeline] getContext
08:25:08 [2025-04-03T06:25:08.575Z] [Pipeline] }
08:25:08 [2025-04-03T06:25:08.586Z] [Pipeline] // stage
08:25:08 [2025-04-03T06:25:08.599Z] [Pipeline] stage
08:25:08 [2025-04-03T06:25:08.600Z] [Pipeline] { (Publish Silverpeas-Distribution)
08:25:08 [2025-04-03T06:25:08.611Z] Stage "Publish Silverpeas-Distribution" skipped due to earlier failure(s)
08:25:08 [2025-04-03T06:25:08.612Z] [Pipeline] getContext
08:25:08 [2025-04-03T06:25:08.614Z] [Pipeline] }
08:25:08 [2025-04-03T06:25:08.625Z] [Pipeline] // stage
08:25:08 [2025-04-03T06:25:08.638Z] [Pipeline] stage
08:25:08 [2025-04-03T06:25:08.639Z] [Pipeline] { (Publish Silverpeas-Looks)
08:25:08 [2025-04-03T06:25:08.650Z] Stage "Publish Silverpeas-Looks" skipped due to earlier failure(s)
08:25:08 [2025-04-03T06:25:08.651Z] [Pipeline] getContext
08:25:08 [2025-04-03T06:25:08.653Z] [Pipeline] }
08:25:08 [2025-04-03T06:25:08.663Z] [Pipeline] // stage
08:25:08 [2025-04-03T06:25:08.675Z] [Pipeline] stage
08:25:08 [2025-04-03T06:25:08.676Z] [Pipeline] { (Publish Community Web Site)
08:25:08 [2025-04-03T06:25:08.686Z] Stage "Publish Community Web Site" skipped due to earlier failure(s)
08:25:08 [2025-04-03T06:25:08.687Z] [Pipeline] getContext
08:25:08 [2025-04-03T06:25:08.688Z] [Pipeline] }
08:25:08 [2025-04-03T06:25:08.698Z] [Pipeline] // stage
08:25:08 [2025-04-03T06:25:08.710Z] [Pipeline] }
08:25:08 [2025-04-03T06:25:08.720Z] [Pipeline] // stage
08:25:08 [2025-04-03T06:25:08.740Z] [Pipeline] stage
08:25:08 [2025-04-03T06:25:08.740Z] [Pipeline] { (Create YAML build report)
08:25:08 [2025-04-03T06:25:08.759Z] Stage "Create YAML build report" skipped due to earlier failure(s)
08:25:08 [2025-04-03T06:25:08.760Z] [Pipeline] getContext
08:25:08 [2025-04-03T06:25:08.761Z] [Pipeline] }
08:25:08 [2025-04-03T06:25:08.779Z] [Pipeline] // stage
08:25:08 [2025-04-03T06:25:08.804Z] [Pipeline] stage
08:25:08 [2025-04-03T06:25:08.804Z] [Pipeline] { (Declarative: Post Actions)
08:25:08 [2025-04-03T06:25:08.837Z] [Pipeline] step
08:25:09 [2025-04-03T06:25:09.007Z] Sending e-mails to: miguel.moquillon@silverpeas.org david.lesimple@silverpeas.com sebastien.vuillet@silverpeas.com silveryocha@chastagnier.com
08:25:09 [2025-04-03T06:25:09.122Z] [Pipeline] }
08:25:09 [2025-04-03T06:25:09.142Z] [Pipeline] // stage
08:25:09 [2025-04-03T06:25:09.169Z] [Pipeline] }
08:25:09 [2025-04-03T06:25:09.187Z] [Pipeline] // withEnv
08:25:09 [2025-04-03T06:25:09.206Z] [Pipeline] }
08:25:09 [2025-04-03T06:25:09.208Z] $ docker stop --time=1 565299c1ac6eba74f5499fc2a0d1055af69886a9ed6a00856f66d51159e3546d
08:25:10 [2025-04-03T06:25:10.757Z] $ docker rm -f --volumes 565299c1ac6eba74f5499fc2a0d1055af69886a9ed6a00856f66d51159e3546d
08:25:11 [2025-04-03T06:25:11.368Z] [Pipeline] // withDockerContainer
08:25:11 [2025-04-03T06:25:11.377Z] [Pipeline] }
08:25:11 [2025-04-03T06:25:11.386Z] [Pipeline] // withEnv
08:25:11 [2025-04-03T06:25:11.404Z] [Pipeline] }
08:25:11 [2025-04-03T06:25:11.423Z] [Pipeline] // node
08:25:11 [2025-04-03T06:25:11.443Z] [Pipeline] End of Pipeline
08:25:11 [2025-04-03T06:25:11.497Z] ERROR: script returned exit code 1
08:25:11 [2025-04-03T06:25:11.547Z] Finished: FAILURE