Console Output
Skipping 1 546 KB..
Full Log): 3.5/9.0 MB | 366 kB
16:30:24 [2026-10-30T15:30:24.094Z] Progress (2): 3.5/9.0 MB | 366 kB
16:30:24 [2026-10-30T15:30:24.094Z] Progress (2): 3.5/9.0 MB | 366 kB
16:30:24 [2026-10-30T15:30:24.094Z] Progress (2): 3.5/9.0 MB | 366 kB
16:30:24 [2026-10-30T15:30:24.094Z] Progress (2): 3.5/9.0 MB | 366 kB
16:30:24 [2026-10-30T15:30:24.094Z] Progress (2): 3.5/9.0 MB | 366 kB
16:30:24 [2026-10-30T15:30:24.094Z] Progress (2): 3.5/9.0 MB | 366 kB
16:30:24 [2026-10-30T15:30:24.094Z] Progress (2): 3.5/9.0 MB | 366 kB
16:30:24 [2026-10-30T15:30:24.094Z] Progress (2): 3.5/9.0 MB | 366 kB
16:30:24 [2026-10-30T15:30:24.094Z] Progress (2): 3.5/9.0 MB | 366 kB
16:30:24 [2026-10-30T15:30:24.094Z] Progress (2): 3.5/9.0 MB | 366 kB
16:30:24 [2026-10-30T15:30:24.094Z] Progress (2): 3.5/9.0 MB | 366 kB
16:30:24 [2026-10-30T15:30:24.094Z] Progress (2): 3.5/9.0 MB | 366 kB
16:30:24 [2026-10-30T15:30:24.094Z] Progress (2): 3.5/9.0 MB | 366 kB
16:30:24 [2026-10-30T15:30:24.094Z] Progress (2): 3.5/9.0 MB | 366 kB
16:30:24 [2026-10-30T15:30:24.094Z] Progress (2): 3.5/9.0 MB | 366 kB
16:30:24 [2026-10-30T15:30:24.094Z] Progress (2): 3.5/9.0 MB | 366 kB
16:30:24 [2026-10-30T15:30:24.094Z] Progress (2): 3.5/9.0 MB | 366 kB
16:30:24 [2026-10-30T15:30:24.094Z] Progress (2): 3.6/9.0 MB | 366 kB
16:30:24 [2026-10-30T15:30:24.094Z] Progress (2): 3.6/9.0 MB | 366 kB
16:30:24 [2026-10-30T15:30:24.094Z] Progress (2): 3.6/9.0 MB | 366 kB
16:30:24 [2026-10-30T15:30:24.094Z] Progress (2): 3.6/9.0 MB | 366 kB
16:30:24 [2026-10-30T15:30:24.094Z] Progress (2): 3.6/9.0 MB | 366 kB
16:30:24 [2026-10-30T15:30:24.094Z] Progress (2): 3.6/9.0 MB | 366 kB
16:30:24 [2026-10-30T15:30:24.094Z] Progress (2): 3.6/9.0 MB | 366 kB
16:30:24 [2026-10-30T15:30:24.094Z] Progress (2): 3.6/9.0 MB | 366 kB
16:30:24 [2026-10-30T15:30:24.094Z] Progress (2): 3.6/9.0 MB | 366 kB
16:30:24 [2026-10-30T15:30:24.094Z] Progress (2): 3.6/9.0 MB | 366 kB
16:30:24 [2026-10-30T15:30:24.094Z] Progress (2): 3.6/9.0 MB | 366 kB
16:30:24 [2026-10-30T15:30:24.094Z] Progress (2): 3.6/9.0 MB | 366 kB
16:30:24 [2026-10-30T15:30:24.094Z] Progress (2): 3.6/9.0 MB | 366 kB
16:30:24 [2026-10-30T15:30:24.094Z] Progress (2): 3.6/9.0 MB | 366 kB
16:30:24 [2026-10-30T15:30:24.094Z] Progress (2): 3.6/9.0 MB | 366 kB
16:30:24 [2026-10-30T15:30:24.094Z] Progress (2): 3.6/9.0 MB | 366 kB
16:30:24 [2026-10-30T15:30:24.094Z] Progress (2): 3.6/9.0 MB | 366 kB
16:30:24 [2026-10-30T15:30:24.094Z] Progress (2): 3.6/9.0 MB | 366 kB
16:30:24 [2026-10-30T15:30:24.094Z] Progress (2): 3.7/9.0 MB | 366 kB
16:30:24 [2026-10-30T15:30:24.094Z] Progress (2): 3.7/9.0 MB | 366 kB
16:30:24 [2026-10-30T15:30:24.094Z] Progress (2): 3.7/9.0 MB | 366 kB
16:30:24 [2026-10-30T15:30:24.094Z] Progress (2): 3.7/9.0 MB | 366 kB
16:30:24 [2026-10-30T15:30:24.094Z] Progress (2): 3.7/9.0 MB | 366 kB
16:30:24 [2026-10-30T15:30:24.094Z] Progress (2): 3.7/9.0 MB | 366 kB
16:30:24 [2026-10-30T15:30:24.094Z] Progress (2): 3.7/9.0 MB | 366 kB
16:30:24 [2026-10-30T15:30:24.094Z] Progress (2): 3.7/9.0 MB | 366 kB
16:30:24 [2026-10-30T15:30:24.094Z] Progress (2): 3.7/9.0 MB | 366 kB
16:30:24 [2026-10-30T15:30:24.094Z] Progress (2): 3.7/9.0 MB | 366 kB
16:30:24 [2026-10-30T15:30:24.094Z] Progress (2): 3.7/9.0 MB | 366 kB
16:30:24 [2026-10-30T15:30:24.094Z] Progress (2): 3.7/9.0 MB | 366 kB
16:30:24 [2026-10-30T15:30:24.094Z] Progress (2): 3.7/9.0 MB | 366 kB
16:30:24 [2026-10-30T15:30:24.094Z] Progress (2): 3.7/9.0 MB | 366 kB
16:30:24 [2026-10-30T15:30:24.094Z] Progress (2): 3.7/9.0 MB | 366 kB
16:30:24 [2026-10-30T15:30:24.094Z] Progress (2): 3.7/9.0 MB | 366 kB
16:30:24 [2026-10-30T15:30:24.094Z] Progress (2): 3.7/9.0 MB | 366 kB
16:30:24 [2026-10-30T15:30:24.094Z] Progress (2): 3.7/9.0 MB | 366 kB
16:30:24 [2026-10-30T15:30:24.094Z] Progress (2): 3.7/9.0 MB | 366 kB
16:30:24 [2026-10-30T15:30:24.094Z] Progress (2): 3.8/9.0 MB | 366 kB
16:30:24 [2026-10-30T15:30:24.094Z] Progress (2): 3.8/9.0 MB | 366 kB
16:30:24 [2026-10-30T15:30:24.094Z] Progress (2): 3.8/9.0 MB | 366 kB
16:30:24 [2026-10-30T15:30:24.094Z] Progress (2): 3.8/9.0 MB | 366 kB
16:30:24 [2026-10-30T15:30:24.094Z] Progress (2): 3.8/9.0 MB | 366 kB
16:30:24 [2026-10-30T15:30:24.094Z] Progress (2): 3.8/9.0 MB | 366 kB
16:30:24 [2026-10-30T15:30:24.094Z] Progress (2): 3.8/9.0 MB | 366 kB
16:30:24 [2026-10-30T15:30:24.094Z]
16:30:24 [2026-10-30T15:30:24.094Z] Downloaded from Silverpeas: https://nexus3.silverpeas.org/repository/silverpeas/net/bytebuddy/byte-buddy-agent/1.17.7/byte-buddy-agent-1.17.7.jar (366 kB at 2.4 MB/s)
16:30:24 [2026-10-30T15:30:24.094Z] Progress (1): 3.8/9.0 MB
16:30:24 [2026-10-30T15:30:24.094Z] Progress (1): 3.8/9.0 MB
16:30:24 [2026-10-30T15:30:24.094Z] Progress (1): 3.8/9.0 MB
16:30:24 [2026-10-30T15:30:24.094Z] Progress (1): 3.8/9.0 MB
16:30:24 [2026-10-30T15:30:24.094Z] Progress (1): 3.8/9.0 MB
16:30:24 [2026-10-30T15:30:24.094Z] Progress (1): 3.8/9.0 MB
16:30:24 [2026-10-30T15:30:24.094Z] Progress (1): 3.8/9.0 MB
16:30:24 [2026-10-30T15:30:24.094Z] Progress (1): 3.8/9.0 MB
16:30:24 [2026-10-30T15:30:24.094Z] Progress (1): 3.8/9.0 MB
16:30:24 [2026-10-30T15:30:24.094Z] Progress (1): 3.8/9.0 MB
16:30:24 [2026-10-30T15:30:24.094Z] Progress (1): 3.8/9.0 MB
16:30:24 [2026-10-30T15:30:24.094Z] Progress (1): 3.9/9.0 MB
16:30:24 [2026-10-30T15:30:24.094Z] Progress (1): 3.9/9.0 MB
16:30:24 [2026-10-30T15:30:24.094Z] Progress (1): 3.9/9.0 MB
16:30:24 [2026-10-30T15:30:24.094Z] Progress (1): 3.9/9.0 MB
16:30:24 [2026-10-30T15:30:24.094Z] Progress (1): 3.9/9.0 MB
16:30:24 [2026-10-30T15:30:24.094Z] Progress (1): 3.9/9.0 MB
16:30:24 [2026-10-30T15:30:24.094Z] Progress (1): 3.9/9.0 MB
16:30:24 [2026-10-30T15:30:24.094Z] Progress (1): 3.9/9.0 MB
16:30:24 [2026-10-30T15:30:24.094Z] Progress (1): 3.9/9.0 MB
16:30:24 [2026-10-30T15:30:24.094Z] Progress (1): 3.9/9.0 MB
16:30:24 [2026-10-30T15:30:24.094Z] Progress (1): 3.9/9.0 MB
16:30:24 [2026-10-30T15:30:24.094Z] Progress (1): 3.9/9.0 MB
16:30:24 [2026-10-30T15:30:24.094Z] Progress (1): 3.9/9.0 MB
16:30:24 [2026-10-30T15:30:24.094Z] Progress (1): 3.9/9.0 MB
16:30:24 [2026-10-30T15:30:24.094Z] Progress (1): 3.9/9.0 MB
16:30:24 [2026-10-30T15:30:24.094Z] Progress (1): 3.9/9.0 MB
16:30:24 [2026-10-30T15:30:24.094Z] Progress (1): 3.9/9.0 MB
16:30:24 [2026-10-30T15:30:24.094Z] Progress (1): 3.9/9.0 MB
16:30:24 [2026-10-30T15:30:24.094Z] Progress (1): 3.9/9.0 MB
16:30:24 [2026-10-30T15:30:24.094Z] Progress (1): 4.0/9.0 MB
16:30:24 [2026-10-30T15:30:24.094Z] Progress (1): 4.0/9.0 MB
16:30:24 [2026-10-30T15:30:24.094Z] Progress (1): 4.0/9.0 MB
16:30:24 [2026-10-30T15:30:24.094Z] Progress (1): 4.0/9.0 MB
16:30:24 [2026-10-30T15:30:24.094Z] Progress (1): 4.0/9.0 MB
16:30:24 [2026-10-30T15:30:24.094Z] Progress (1): 4.0/9.0 MB
16:30:24 [2026-10-30T15:30:24.094Z] Progress (1): 4.0/9.0 MB
16:30:24 [2026-10-30T15:30:24.094Z] Progress (1): 4.0/9.0 MB
16:30:24 [2026-10-30T15:30:24.094Z] Progress (1): 4.0/9.0 MB
16:30:24 [2026-10-30T15:30:24.094Z] Progress (1): 4.0/9.0 MB
16:30:24 [2026-10-30T15:30:24.094Z] Progress (1): 4.0/9.0 MB
16:30:24 [2026-10-30T15:30:24.094Z] Progress (1): 4.0/9.0 MB
16:30:24 [2026-10-30T15:30:24.094Z] Progress (1): 4.0/9.0 MB
16:30:24 [2026-10-30T15:30:24.094Z] Progress (1): 4.0/9.0 MB
16:30:24 [2026-10-30T15:30:24.094Z] Progress (1): 4.0/9.0 MB
16:30:24 [2026-10-30T15:30:24.094Z] Progress (1): 4.0/9.0 MB
16:30:24 [2026-10-30T15:30:24.094Z] Progress (1): 4.0/9.0 MB
16:30:24 [2026-10-30T15:30:24.094Z] Progress (1): 4.0/9.0 MB
16:30:24 [2026-10-30T15:30:24.094Z] Progress (1): 4.1/9.0 MB
16:30:24 [2026-10-30T15:30:24.094Z] Progress (1): 4.1/9.0 MB
16:30:24 [2026-10-30T15:30:24.094Z] Progress (1): 4.1/9.0 MB
16:30:24 [2026-10-30T15:30:24.094Z] Progress (1): 4.1/9.0 MB
16:30:24 [2026-10-30T15:30:24.094Z] Progress (1): 4.1/9.0 MB
16:30:24 [2026-10-30T15:30:24.094Z] Progress (1): 4.1/9.0 MB
16:30:24 [2026-10-30T15:30:24.094Z] Progress (1): 4.1/9.0 MB
16:30:24 [2026-10-30T15:30:24.094Z] Progress (1): 4.1/9.0 MB
16:30:24 [2026-10-30T15:30:24.094Z] Progress (1): 4.1/9.0 MB
16:30:24 [2026-10-30T15:30:24.094Z] Progress (1): 4.1/9.0 MB
16:30:24 [2026-10-30T15:30:24.094Z] Progress (1): 4.1/9.0 MB
16:30:24 [2026-10-30T15:30:24.094Z] Progress (1): 4.1/9.0 MB
16:30:24 [2026-10-30T15:30:24.094Z] Progress (1): 4.1/9.0 MB
16:30:24 [2026-10-30T15:30:24.094Z] Progress (1): 4.1/9.0 MB
16:30:24 [2026-10-30T15:30:24.094Z] Progress (1): 4.1/9.0 MB
16:30:24 [2026-10-30T15:30:24.094Z] Progress (1): 4.1/9.0 MB
16:30:24 [2026-10-30T15:30:24.094Z] Progress (1): 4.1/9.0 MB
16:30:24 [2026-10-30T15:30:24.094Z] Progress (1): 4.1/9.0 MB
16:30:24 [2026-10-30T15:30:24.094Z] Progress (1): 4.2/9.0 MB
16:30:24 [2026-10-30T15:30:24.094Z] Progress (1): 4.2/9.0 MB
16:30:24 [2026-10-30T15:30:24.094Z] Progress (1): 4.2/9.0 MB
16:30:24 [2026-10-30T15:30:24.094Z] Progress (1): 4.2/9.0 MB
16:30:24 [2026-10-30T15:30:24.094Z] Progress (1): 4.2/9.0 MB
16:30:24 [2026-10-30T15:30:24.094Z] Progress (1): 4.2/9.0 MB
16:30:24 [2026-10-30T15:30:24.094Z] Progress (1): 4.2/9.0 MB
16:30:24 [2026-10-30T15:30:24.094Z] Progress (1): 4.2/9.0 MB
16:30:24 [2026-10-30T15:30:24.094Z] Progress (1): 4.2/9.0 MB
16:30:24 [2026-10-30T15:30:24.094Z] Progress (1): 4.2/9.0 MB
16:30:24 [2026-10-30T15:30:24.094Z] Progress (1): 4.2/9.0 MB
16:30:24 [2026-10-30T15:30:24.094Z] Progress (1): 4.2/9.0 MB
16:30:24 [2026-10-30T15:30:24.094Z] Progress (1): 4.2/9.0 MB
16:30:24 [2026-10-30T15:30:24.094Z] Progress (1): 4.2/9.0 MB
16:30:24 [2026-10-30T15:30:24.094Z] Progress (1): 4.2/9.0 MB
16:30:24 [2026-10-30T15:30:24.094Z] Progress (1): 4.2/9.0 MB
16:30:24 [2026-10-30T15:30:24.094Z] Progress (1): 4.2/9.0 MB
16:30:24 [2026-10-30T15:30:24.094Z] Progress (1): 4.2/9.0 MB
16:30:24 [2026-10-30T15:30:24.094Z] Progress (1): 4.3/9.0 MB
16:30:24 [2026-10-30T15:30:24.094Z] Progress (1): 4.3/9.0 MB
16:30:24 [2026-10-30T15:30:24.094Z] Progress (1): 4.3/9.0 MB
16:30:24 [2026-10-30T15:30:24.094Z] Progress (1): 4.3/9.0 MB
16:30:24 [2026-10-30T15:30:24.094Z] Progress (1): 4.3/9.0 MB
16:30:24 [2026-10-30T15:30:24.094Z] Progress (1): 4.3/9.0 MB
16:30:24 [2026-10-30T15:30:24.094Z] Progress (1): 4.3/9.0 MB
16:30:24 [2026-10-30T15:30:24.094Z] Progress (1): 4.3/9.0 MB
16:30:24 [2026-10-30T15:30:24.094Z] Progress (1): 4.3/9.0 MB
16:30:24 [2026-10-30T15:30:24.094Z] Progress (1): 4.3/9.0 MB
16:30:24 [2026-10-30T15:30:24.094Z] Progress (1): 4.3/9.0 MB
16:30:24 [2026-10-30T15:30:24.094Z] Progress (1): 4.3/9.0 MB
16:30:24 [2026-10-30T15:30:24.094Z] Progress (1): 4.3/9.0 MB
16:30:24 [2026-10-30T15:30:24.094Z] Progress (1): 4.3/9.0 MB
16:30:24 [2026-10-30T15:30:24.094Z] Progress (1): 4.3/9.0 MB
16:30:24 [2026-10-30T15:30:24.094Z] Progress (1): 4.3/9.0 MB
16:30:24 [2026-10-30T15:30:24.094Z] Progress (1): 4.3/9.0 MB
16:30:24 [2026-10-30T15:30:24.094Z] Progress (1): 4.3/9.0 MB
16:30:24 [2026-10-30T15:30:24.094Z] Progress (1): 4.3/9.0 MB
16:30:24 [2026-10-30T15:30:24.094Z] Progress (1): 4.4/9.0 MB
16:30:24 [2026-10-30T15:30:24.094Z] Progress (1): 4.4/9.0 MB
16:30:24 [2026-10-30T15:30:24.094Z] Progress (1): 4.4/9.0 MB
16:30:24 [2026-10-30T15:30:24.094Z] Progress (1): 4.4/9.0 MB
16:30:24 [2026-10-30T15:30:24.094Z] Progress (1): 4.4/9.0 MB
16:30:24 [2026-10-30T15:30:24.094Z] Progress (1): 4.4/9.0 MB
16:30:24 [2026-10-30T15:30:24.095Z] Progress (1): 4.4/9.0 MB
16:30:24 [2026-10-30T15:30:24.095Z] Progress (1): 4.4/9.0 MB
16:30:24 [2026-10-30T15:30:24.095Z] Progress (1): 4.4/9.0 MB
16:30:24 [2026-10-30T15:30:24.095Z] Progress (1): 4.4/9.0 MB
16:30:24 [2026-10-30T15:30:24.095Z] Progress (1): 4.4/9.0 MB
16:30:24 [2026-10-30T15:30:24.095Z] Progress (1): 4.4/9.0 MB
16:30:24 [2026-10-30T15:30:24.095Z] Progress (1): 4.4/9.0 MB
16:30:24 [2026-10-30T15:30:24.095Z] Progress (1): 4.4/9.0 MB
16:30:24 [2026-10-30T15:30:24.095Z] Progress (1): 4.4/9.0 MB
16:30:24 [2026-10-30T15:30:24.095Z] Progress (1): 4.4/9.0 MB
16:30:24 [2026-10-30T15:30:24.095Z] Progress (1): 4.4/9.0 MB
16:30:24 [2026-10-30T15:30:24.095Z] Progress (1): 4.4/9.0 MB
16:30:24 [2026-10-30T15:30:24.095Z] Progress (1): 4.5/9.0 MB
16:30:24 [2026-10-30T15:30:24.095Z] Progress (1): 4.5/9.0 MB
16:30:24 [2026-10-30T15:30:24.095Z] Progress (1): 4.5/9.0 MB
16:30:24 [2026-10-30T15:30:24.095Z] Progress (1): 4.5/9.0 MB
16:30:24 [2026-10-30T15:30:24.095Z] Progress (1): 4.5/9.0 MB
16:30:24 [2026-10-30T15:30:24.095Z] Progress (1): 4.5/9.0 MB
16:30:24 [2026-10-30T15:30:24.095Z] Progress (1): 4.5/9.0 MB
16:30:24 [2026-10-30T15:30:24.095Z] Progress (1): 4.5/9.0 MB
16:30:24 [2026-10-30T15:30:24.095Z] Progress (1): 4.5/9.0 MB
16:30:24 [2026-10-30T15:30:24.095Z] Progress (1): 4.5/9.0 MB
16:30:24 [2026-10-30T15:30:24.095Z] Progress (1): 4.5/9.0 MB
16:30:24 [2026-10-30T15:30:24.095Z] Progress (1): 4.5/9.0 MB
16:30:24 [2026-10-30T15:30:24.095Z] Progress (1): 4.5/9.0 MB
16:30:24 [2026-10-30T15:30:24.095Z] Progress (1): 4.5/9.0 MB
16:30:24 [2026-10-30T15:30:24.095Z] Progress (1): 4.5/9.0 MB
16:30:24 [2026-10-30T15:30:24.095Z] Progress (1): 4.5/9.0 MB
16:30:24 [2026-10-30T15:30:24.095Z] Progress (1): 4.5/9.0 MB
16:30:24 [2026-10-30T15:30:24.095Z] Progress (1): 4.5/9.0 MB
16:30:24 [2026-10-30T15:30:24.095Z] Progress (1): 4.5/9.0 MB
16:30:24 [2026-10-30T15:30:24.095Z] Progress (1): 4.6/9.0 MB
16:30:24 [2026-10-30T15:30:24.095Z] Progress (1): 4.6/9.0 MB
16:30:24 [2026-10-30T15:30:24.095Z] Progress (1): 4.6/9.0 MB
16:30:24 [2026-10-30T15:30:24.095Z] Progress (1): 4.6/9.0 MB
16:30:24 [2026-10-30T15:30:24.095Z] Progress (1): 4.6/9.0 MB
16:30:24 [2026-10-30T15:30:24.095Z] Progress (1): 4.6/9.0 MB
16:30:24 [2026-10-30T15:30:24.095Z] Progress (1): 4.6/9.0 MB
16:30:24 [2026-10-30T15:30:24.095Z] Progress (1): 4.6/9.0 MB
16:30:24 [2026-10-30T15:30:24.095Z] Progress (1): 4.6/9.0 MB
16:30:24 [2026-10-30T15:30:24.095Z] Progress (1): 4.6/9.0 MB
16:30:24 [2026-10-30T15:30:24.095Z] Progress (1): 4.6/9.0 MB
16:30:24 [2026-10-30T15:30:24.095Z] Progress (1): 4.6/9.0 MB
16:30:24 [2026-10-30T15:30:24.095Z] Progress (1): 4.6/9.0 MB
16:30:24 [2026-10-30T15:30:24.095Z] Progress (1): 4.6/9.0 MB
16:30:24 [2026-10-30T15:30:24.095Z] Progress (1): 4.6/9.0 MB
16:30:24 [2026-10-30T15:30:24.095Z] Progress (1): 4.6/9.0 MB
16:30:24 [2026-10-30T15:30:24.095Z] Progress (1): 4.6/9.0 MB
16:30:24 [2026-10-30T15:30:24.095Z] Progress (1): 4.6/9.0 MB
16:30:24 [2026-10-30T15:30:24.095Z] Progress (1): 4.7/9.0 MB
16:30:24 [2026-10-30T15:30:24.095Z] Progress (1): 4.7/9.0 MB
16:30:24 [2026-10-30T15:30:24.095Z] Progress (1): 4.7/9.0 MB
16:30:24 [2026-10-30T15:30:24.095Z] Progress (1): 4.7/9.0 MB
16:30:24 [2026-10-30T15:30:24.095Z] Progress (1): 4.7/9.0 MB
16:30:24 [2026-10-30T15:30:24.095Z] Progress (1): 4.7/9.0 MB
16:30:24 [2026-10-30T15:30:24.095Z] Progress (1): 4.7/9.0 MB
16:30:24 [2026-10-30T15:30:24.095Z] Progress (1): 4.7/9.0 MB
16:30:24 [2026-10-30T15:30:24.095Z] Progress (1): 4.7/9.0 MB
16:30:24 [2026-10-30T15:30:24.095Z] Progress (1): 4.7/9.0 MB
16:30:24 [2026-10-30T15:30:24.095Z] Progress (1): 4.7/9.0 MB
16:30:24 [2026-10-30T15:30:24.095Z] Progress (1): 4.7/9.0 MB
16:30:24 [2026-10-30T15:30:24.095Z] Progress (1): 4.7/9.0 MB
16:30:24 [2026-10-30T15:30:24.095Z] Progress (1): 4.7/9.0 MB
16:30:24 [2026-10-30T15:30:24.095Z] Progress (1): 4.7/9.0 MB
16:30:24 [2026-10-30T15:30:24.095Z] Progress (1): 4.7/9.0 MB
16:30:24 [2026-10-30T15:30:24.095Z] Progress (1): 4.7/9.0 MB
16:30:24 [2026-10-30T15:30:24.095Z] Progress (1): 4.7/9.0 MB
16:30:24 [2026-10-30T15:30:24.095Z] Progress (1): 4.7/9.0 MB
16:30:24 [2026-10-30T15:30:24.095Z] Progress (1): 4.8/9.0 MB
16:30:24 [2026-10-30T15:30:24.095Z] Progress (1): 4.8/9.0 MB
16:30:24 [2026-10-30T15:30:24.095Z] Progress (1): 4.8/9.0 MB
16:30:24 [2026-10-30T15:30:24.095Z] Progress (1): 4.8/9.0 MB
16:30:24 [2026-10-30T15:30:24.095Z] Progress (1): 4.8/9.0 MB
16:30:24 [2026-10-30T15:30:24.095Z] Progress (1): 4.8/9.0 MB
16:30:24 [2026-10-30T15:30:24.095Z] Progress (1): 4.8/9.0 MB
16:30:24 [2026-10-30T15:30:24.095Z] Progress (1): 4.8/9.0 MB
16:30:24 [2026-10-30T15:30:24.095Z] Progress (1): 4.8/9.0 MB
16:30:24 [2026-10-30T15:30:24.095Z] Progress (1): 4.8/9.0 MB
16:30:24 [2026-10-30T15:30:24.095Z] Progress (1): 4.8/9.0 MB
16:30:24 [2026-10-30T15:30:24.095Z] Progress (1): 4.8/9.0 MB
16:30:24 [2026-10-30T15:30:24.095Z] Progress (1): 4.8/9.0 MB
16:30:24 [2026-10-30T15:30:24.095Z] Progress (1): 4.8/9.0 MB
16:30:24 [2026-10-30T15:30:24.095Z] Progress (1): 4.8/9.0 MB
16:30:24 [2026-10-30T15:30:24.095Z] Progress (1): 4.8/9.0 MB
16:30:24 [2026-10-30T15:30:24.095Z] Progress (1): 4.8/9.0 MB
16:30:24 [2026-10-30T15:30:24.095Z] Progress (1): 4.8/9.0 MB
16:30:24 [2026-10-30T15:30:24.095Z] Progress (1): 4.8/9.0 MB
16:30:24 [2026-10-30T15:30:24.095Z] Progress (1): 4.9/9.0 MB
16:30:24 [2026-10-30T15:30:24.095Z] Progress (1): 4.9/9.0 MB
16:30:24 [2026-10-30T15:30:24.095Z] Progress (1): 4.9/9.0 MB
16:30:24 [2026-10-30T15:30:24.095Z] Progress (1): 4.9/9.0 MB
16:30:24 [2026-10-30T15:30:24.095Z] Progress (1): 4.9/9.0 MB
16:30:24 [2026-10-30T15:30:24.095Z] Progress (1): 4.9/9.0 MB
16:30:24 [2026-10-30T15:30:24.095Z] Progress (1): 4.9/9.0 MB
16:30:24 [2026-10-30T15:30:24.095Z] Progress (1): 4.9/9.0 MB
16:30:24 [2026-10-30T15:30:24.095Z] Progress (1): 4.9/9.0 MB
16:30:24 [2026-10-30T15:30:24.095Z] Progress (1): 4.9/9.0 MB
16:30:24 [2026-10-30T15:30:24.095Z] Progress (1): 4.9/9.0 MB
16:30:24 [2026-10-30T15:30:24.095Z] Progress (1): 4.9/9.0 MB
16:30:24 [2026-10-30T15:30:24.095Z] Progress (1): 4.9/9.0 MB
16:30:24 [2026-10-30T15:30:24.095Z] Progress (1): 4.9/9.0 MB
16:30:24 [2026-10-30T15:30:24.095Z] Progress (1): 4.9/9.0 MB
16:30:24 [2026-10-30T15:30:24.095Z] Progress (1): 4.9/9.0 MB
16:30:24 [2026-10-30T15:30:24.095Z] Progress (1): 4.9/9.0 MB
16:30:24 [2026-10-30T15:30:24.095Z] Progress (1): 4.9/9.0 MB
16:30:24 [2026-10-30T15:30:24.095Z] Progress (1): 4.9/9.0 MB
16:30:24 [2026-10-30T15:30:24.095Z] Progress (1): 5.0/9.0 MB
16:30:24 [2026-10-30T15:30:24.095Z] Progress (1): 5.0/9.0 MB
16:30:24 [2026-10-30T15:30:24.095Z] Progress (1): 5.0/9.0 MB
16:30:24 [2026-10-30T15:30:24.095Z] Progress (1): 5.0/9.0 MB
16:30:24 [2026-10-30T15:30:24.095Z] Progress (1): 5.0/9.0 MB
16:30:24 [2026-10-30T15:30:24.095Z] Progress (1): 5.0/9.0 MB
16:30:24 [2026-10-30T15:30:24.095Z] Progress (1): 5.0/9.0 MB
16:30:24 [2026-10-30T15:30:24.095Z] Progress (1): 5.0/9.0 MB
16:30:24 [2026-10-30T15:30:24.095Z] Progress (1): 5.0/9.0 MB
16:30:24 [2026-10-30T15:30:24.095Z] Progress (1): 5.0/9.0 MB
16:30:24 [2026-10-30T15:30:24.095Z] Progress (1): 5.0/9.0 MB
16:30:24 [2026-10-30T15:30:24.095Z] Progress (1): 5.0/9.0 MB
16:30:24 [2026-10-30T15:30:24.095Z] Progress (1): 5.0/9.0 MB
16:30:24 [2026-10-30T15:30:24.095Z] Progress (1): 5.0/9.0 MB
16:30:24 [2026-10-30T15:30:24.095Z] Progress (1): 5.0/9.0 MB
16:30:24 [2026-10-30T15:30:24.095Z] Progress (1): 5.0/9.0 MB
16:30:24 [2026-10-30T15:30:24.095Z] Progress (1): 5.0/9.0 MB
16:30:24 [2026-10-30T15:30:24.095Z] Progress (1): 5.0/9.0 MB
16:30:24 [2026-10-30T15:30:24.095Z] Progress (1): 5.1/9.0 MB
16:30:24 [2026-10-30T15:30:24.095Z] Progress (1): 5.1/9.0 MB
16:30:24 [2026-10-30T15:30:24.095Z] Progress (1): 5.1/9.0 MB
16:30:24 [2026-10-30T15:30:24.095Z] Progress (1): 5.1/9.0 MB
16:30:24 [2026-10-30T15:30:24.095Z] Progress (1): 5.1/9.0 MB
16:30:24 [2026-10-30T15:30:24.095Z] Progress (1): 5.1/9.0 MB
16:30:24 [2026-10-30T15:30:24.095Z] Progress (1): 5.1/9.0 MB
16:30:24 [2026-10-30T15:30:24.095Z] Progress (1): 5.1/9.0 MB
16:30:24 [2026-10-30T15:30:24.095Z] Progress (1): 5.1/9.0 MB
16:30:24 [2026-10-30T15:30:24.095Z] Progress (1): 5.1/9.0 MB
16:30:24 [2026-10-30T15:30:24.095Z] Progress (1): 5.1/9.0 MB
16:30:24 [2026-10-30T15:30:24.095Z] Progress (1): 5.1/9.0 MB
16:30:24 [2026-10-30T15:30:24.095Z] Progress (1): 5.1/9.0 MB
16:30:24 [2026-10-30T15:30:24.095Z] Progress (1): 5.1/9.0 MB
16:30:24 [2026-10-30T15:30:24.095Z] Progress (1): 5.1/9.0 MB
16:30:24 [2026-10-30T15:30:24.095Z] Progress (1): 5.1/9.0 MB
16:30:24 [2026-10-30T15:30:24.095Z] Progress (1): 5.1/9.0 MB
16:30:24 [2026-10-30T15:30:24.095Z] Progress (1): 5.1/9.0 MB
16:30:24 [2026-10-30T15:30:24.095Z] Progress (1): 5.2/9.0 MB
16:30:24 [2026-10-30T15:30:24.095Z] Progress (1): 5.2/9.0 MB
16:30:24 [2026-10-30T15:30:24.095Z] Progress (1): 5.2/9.0 MB
16:30:24 [2026-10-30T15:30:24.095Z] Progress (1): 5.2/9.0 MB
16:30:24 [2026-10-30T15:30:24.095Z] Progress (1): 5.2/9.0 MB
16:30:24 [2026-10-30T15:30:24.095Z] Progress (1): 5.2/9.0 MB
16:30:24 [2026-10-30T15:30:24.095Z] Progress (1): 5.2/9.0 MB
16:30:24 [2026-10-30T15:30:24.095Z] Progress (1): 5.2/9.0 MB
16:30:24 [2026-10-30T15:30:24.095Z] Progress (1): 5.2/9.0 MB
16:30:24 [2026-10-30T15:30:24.095Z] Progress (1): 5.2/9.0 MB
16:30:24 [2026-10-30T15:30:24.095Z] Progress (1): 5.2/9.0 MB
16:30:24 [2026-10-30T15:30:24.095Z] Progress (1): 5.2/9.0 MB
16:30:24 [2026-10-30T15:30:24.095Z] Progress (1): 5.2/9.0 MB
16:30:24 [2026-10-30T15:30:24.095Z] Progress (1): 5.2/9.0 MB
16:30:24 [2026-10-30T15:30:24.095Z] Progress (1): 5.2/9.0 MB
16:30:24 [2026-10-30T15:30:24.095Z] Progress (1): 5.2/9.0 MB
16:30:24 [2026-10-30T15:30:24.095Z] Progress (1): 5.2/9.0 MB
16:30:24 [2026-10-30T15:30:24.095Z] Progress (1): 5.2/9.0 MB
16:30:24 [2026-10-30T15:30:24.095Z] Progress (1): 5.3/9.0 MB
16:30:24 [2026-10-30T15:30:24.095Z] Progress (1): 5.3/9.0 MB
16:30:24 [2026-10-30T15:30:24.095Z] Progress (1): 5.3/9.0 MB
16:30:24 [2026-10-30T15:30:24.095Z] Progress (1): 5.3/9.0 MB
16:30:24 [2026-10-30T15:30:24.095Z] Progress (1): 5.3/9.0 MB
16:30:24 [2026-10-30T15:30:24.095Z] Progress (1): 5.3/9.0 MB
16:30:24 [2026-10-30T15:30:24.095Z] Progress (1): 5.3/9.0 MB
16:30:24 [2026-10-30T15:30:24.095Z] Progress (1): 5.3/9.0 MB
16:30:24 [2026-10-30T15:30:24.095Z] Progress (1): 5.3/9.0 MB
16:30:24 [2026-10-30T15:30:24.095Z] Progress (1): 5.3/9.0 MB
16:30:24 [2026-10-30T15:30:24.095Z] Progress (1): 5.3/9.0 MB
16:30:24 [2026-10-30T15:30:24.095Z] Progress (1): 5.3/9.0 MB
16:30:24 [2026-10-30T15:30:24.095Z] Progress (1): 5.3/9.0 MB
16:30:24 [2026-10-30T15:30:24.095Z] Progress (1): 5.3/9.0 MB
16:30:24 [2026-10-30T15:30:24.095Z] Progress (1): 5.3/9.0 MB
16:30:24 [2026-10-30T15:30:24.095Z] Progress (1): 5.3/9.0 MB
16:30:24 [2026-10-30T15:30:24.095Z] Progress (1): 5.3/9.0 MB
16:30:24 [2026-10-30T15:30:24.095Z] Progress (1): 5.3/9.0 MB
16:30:24 [2026-10-30T15:30:24.095Z] Progress (1): 5.3/9.0 MB
16:30:24 [2026-10-30T15:30:24.095Z] Progress (1): 5.4/9.0 MB
16:30:24 [2026-10-30T15:30:24.095Z] Progress (1): 5.4/9.0 MB
16:30:24 [2026-10-30T15:30:24.095Z] Progress (1): 5.4/9.0 MB
16:30:24 [2026-10-30T15:30:24.095Z] Progress (1): 5.4/9.0 MB
16:30:24 [2026-10-30T15:30:24.095Z] Progress (1): 5.4/9.0 MB
16:30:24 [2026-10-30T15:30:24.095Z] Progress (1): 5.4/9.0 MB
16:30:24 [2026-10-30T15:30:24.095Z] Progress (1): 5.4/9.0 MB
16:30:24 [2026-10-30T15:30:24.095Z] Progress (1): 5.4/9.0 MB
16:30:24 [2026-10-30T15:30:24.095Z] Progress (1): 5.4/9.0 MB
16:30:24 [2026-10-30T15:30:24.095Z] Progress (1): 5.4/9.0 MB
16:30:24 [2026-10-30T15:30:24.095Z] Progress (1): 5.4/9.0 MB
16:30:24 [2026-10-30T15:30:24.095Z] Progress (1): 5.4/9.0 MB
16:30:24 [2026-10-30T15:30:24.095Z] Progress (1): 5.4/9.0 MB
16:30:24 [2026-10-30T15:30:24.095Z] Progress (1): 5.4/9.0 MB
16:30:24 [2026-10-30T15:30:24.095Z] Progress (1): 5.4/9.0 MB
16:30:24 [2026-10-30T15:30:24.095Z] Progress (1): 5.4/9.0 MB
16:30:24 [2026-10-30T15:30:24.095Z] Progress (1): 5.4/9.0 MB
16:30:24 [2026-10-30T15:30:24.095Z] Progress (1): 5.4/9.0 MB
16:30:24 [2026-10-30T15:30:24.095Z] Progress (1): 5.5/9.0 MB
16:30:24 [2026-10-30T15:30:24.095Z] Progress (1): 5.5/9.0 MB
16:30:24 [2026-10-30T15:30:24.095Z] Progress (1): 5.5/9.0 MB
16:30:24 [2026-10-30T15:30:24.095Z] Progress (1): 5.5/9.0 MB
16:30:24 [2026-10-30T15:30:24.095Z] Progress (1): 5.5/9.0 MB
16:30:24 [2026-10-30T15:30:24.095Z] Progress (1): 5.5/9.0 MB
16:30:24 [2026-10-30T15:30:24.095Z] Progress (1): 5.5/9.0 MB
16:30:24 [2026-10-30T15:30:24.095Z] Progress (1): 5.5/9.0 MB
16:30:24 [2026-10-30T15:30:24.095Z] Progress (1): 5.5/9.0 MB
16:30:24 [2026-10-30T15:30:24.095Z] Progress (1): 5.5/9.0 MB
16:30:24 [2026-10-30T15:30:24.095Z] Progress (1): 5.5/9.0 MB
16:30:24 [2026-10-30T15:30:24.095Z] Progress (1): 5.5/9.0 MB
16:30:24 [2026-10-30T15:30:24.095Z] Progress (1): 5.5/9.0 MB
16:30:24 [2026-10-30T15:30:24.095Z] Progress (1): 5.5/9.0 MB
16:30:24 [2026-10-30T15:30:24.095Z] Progress (1): 5.5/9.0 MB
16:30:24 [2026-10-30T15:30:24.095Z] Progress (1): 5.5/9.0 MB
16:30:24 [2026-10-30T15:30:24.095Z] Progress (1): 5.5/9.0 MB
16:30:24 [2026-10-30T15:30:24.095Z] Progress (1): 5.5/9.0 MB
16:30:24 [2026-10-30T15:30:24.095Z] Progress (1): 5.5/9.0 MB
16:30:24 [2026-10-30T15:30:24.095Z] Progress (1): 5.6/9.0 MB
16:30:24 [2026-10-30T15:30:24.095Z] Progress (1): 5.6/9.0 MB
16:30:24 [2026-10-30T15:30:24.095Z] Progress (1): 5.6/9.0 MB
16:30:24 [2026-10-30T15:30:24.095Z] Progress (1): 5.6/9.0 MB
16:30:24 [2026-10-30T15:30:24.095Z] Progress (1): 5.6/9.0 MB
16:30:24 [2026-10-30T15:30:24.095Z] Progress (1): 5.6/9.0 MB
16:30:24 [2026-10-30T15:30:24.095Z] Progress (1): 5.6/9.0 MB
16:30:24 [2026-10-30T15:30:24.095Z] Progress (1): 5.6/9.0 MB
16:30:24 [2026-10-30T15:30:24.095Z] Progress (1): 5.6/9.0 MB
16:30:24 [2026-10-30T15:30:24.095Z] Progress (1): 5.6/9.0 MB
16:30:24 [2026-10-30T15:30:24.095Z] Progress (1): 5.6/9.0 MB
16:30:24 [2026-10-30T15:30:24.095Z] Progress (1): 5.6/9.0 MB
16:30:24 [2026-10-30T15:30:24.095Z] Progress (1): 5.6/9.0 MB
16:30:24 [2026-10-30T15:30:24.095Z] Progress (1): 5.6/9.0 MB
16:30:24 [2026-10-30T15:30:24.095Z] Progress (1): 5.6/9.0 MB
16:30:24 [2026-10-30T15:30:24.095Z] Progress (1): 5.6/9.0 MB
16:30:24 [2026-10-30T15:30:24.095Z] Progress (1): 5.6/9.0 MB
16:30:24 [2026-10-30T15:30:24.095Z] Progress (1): 5.7/9.0 MB
16:30:24 [2026-10-30T15:30:24.095Z] Progress (1): 5.7/9.0 MB
16:30:24 [2026-10-30T15:30:24.095Z] Progress (1): 5.7/9.0 MB
16:30:24 [2026-10-30T15:30:24.095Z] Progress (1): 5.7/9.0 MB
16:30:24 [2026-10-30T15:30:24.095Z] Progress (1): 5.7/9.0 MB
16:30:24 [2026-10-30T15:30:24.095Z] Progress (1): 5.7/9.0 MB
16:30:24 [2026-10-30T15:30:24.095Z] Progress (1): 5.7/9.0 MB
16:30:24 [2026-10-30T15:30:24.095Z] Progress (1): 5.7/9.0 MB
16:30:24 [2026-10-30T15:30:24.095Z] Progress (1): 5.7/9.0 MB
16:30:24 [2026-10-30T15:30:24.095Z] Progress (1): 5.7/9.0 MB
16:30:24 [2026-10-30T15:30:24.095Z] Progress (1): 5.7/9.0 MB
16:30:24 [2026-10-30T15:30:24.095Z] Progress (1): 5.7/9.0 MB
16:30:24 [2026-10-30T15:30:24.095Z] Progress (1): 5.7/9.0 MB
16:30:24 [2026-10-30T15:30:24.095Z] Progress (1): 5.7/9.0 MB
16:30:24 [2026-10-30T15:30:24.095Z] Progress (1): 5.7/9.0 MB
16:30:24 [2026-10-30T15:30:24.095Z] Progress (1): 5.7/9.0 MB
16:30:24 [2026-10-30T15:30:24.095Z] Progress (1): 5.7/9.0 MB
16:30:24 [2026-10-30T15:30:24.095Z] Progress (1): 5.7/9.0 MB
16:30:24 [2026-10-30T15:30:24.095Z] Progress (1): 5.7/9.0 MB
16:30:24 [2026-10-30T15:30:24.095Z] Progress (1): 5.8/9.0 MB
16:30:24 [2026-10-30T15:30:24.095Z] Progress (1): 5.8/9.0 MB
16:30:24 [2026-10-30T15:30:24.095Z] Progress (1): 5.8/9.0 MB
16:30:24 [2026-10-30T15:30:24.095Z] Progress (1): 5.8/9.0 MB
16:30:24 [2026-10-30T15:30:24.095Z] Progress (1): 5.8/9.0 MB
16:30:24 [2026-10-30T15:30:24.095Z] Progress (1): 5.8/9.0 MB
16:30:24 [2026-10-30T15:30:24.095Z] Progress (1): 5.8/9.0 MB
16:30:24 [2026-10-30T15:30:24.095Z] Progress (1): 5.8/9.0 MB
16:30:24 [2026-10-30T15:30:24.095Z] Progress (1): 5.8/9.0 MB
16:30:24 [2026-10-30T15:30:24.095Z] Progress (1): 5.8/9.0 MB
16:30:24 [2026-10-30T15:30:24.095Z] Progress (1): 5.8/9.0 MB
16:30:24 [2026-10-30T15:30:24.095Z] Progress (1): 5.8/9.0 MB
16:30:24 [2026-10-30T15:30:24.095Z] Progress (1): 5.8/9.0 MB
16:30:24 [2026-10-30T15:30:24.095Z] Progress (1): 5.8/9.0 MB
16:30:24 [2026-10-30T15:30:24.095Z] Progress (1): 5.8/9.0 MB
16:30:24 [2026-10-30T15:30:24.095Z] Progress (1): 5.8/9.0 MB
16:30:24 [2026-10-30T15:30:24.095Z] Progress (1): 5.8/9.0 MB
16:30:24 [2026-10-30T15:30:24.095Z] Progress (1): 5.8/9.0 MB
16:30:24 [2026-10-30T15:30:24.095Z] Progress (1): 5.8/9.0 MB
16:30:24 [2026-10-30T15:30:24.095Z] Progress (1): 5.9/9.0 MB
16:30:24 [2026-10-30T15:30:24.095Z] Progress (1): 5.9/9.0 MB
16:30:24 [2026-10-30T15:30:24.095Z] Progress (1): 5.9/9.0 MB
16:30:24 [2026-10-30T15:30:24.095Z] Progress (1): 5.9/9.0 MB
16:30:24 [2026-10-30T15:30:24.095Z] Progress (1): 5.9/9.0 MB
16:30:24 [2026-10-30T15:30:24.095Z] Progress (1): 5.9/9.0 MB
16:30:24 [2026-10-30T15:30:24.095Z] Progress (1): 5.9/9.0 MB
16:30:24 [2026-10-30T15:30:24.095Z] Progress (1): 5.9/9.0 MB
16:30:24 [2026-10-30T15:30:24.095Z] Progress (1): 5.9/9.0 MB
16:30:24 [2026-10-30T15:30:24.095Z] Progress (1): 5.9/9.0 MB
16:30:24 [2026-10-30T15:30:24.095Z] Progress (1): 5.9/9.0 MB
16:30:24 [2026-10-30T15:30:24.095Z] Progress (1): 5.9/9.0 MB
16:30:24 [2026-10-30T15:30:24.095Z] Progress (1): 5.9/9.0 MB
16:30:24 [2026-10-30T15:30:24.095Z] Progress (1): 5.9/9.0 MB
16:30:24 [2026-10-30T15:30:24.095Z] Progress (1): 5.9/9.0 MB
16:30:24 [2026-10-30T15:30:24.095Z] Progress (1): 5.9/9.0 MB
16:30:24 [2026-10-30T15:30:24.095Z] Progress (1): 5.9/9.0 MB
16:30:24 [2026-10-30T15:30:24.095Z] Progress (1): 5.9/9.0 MB
16:30:24 [2026-10-30T15:30:24.095Z] Progress (1): 6.0/9.0 MB
16:30:24 [2026-10-30T15:30:24.095Z] Progress (1): 6.0/9.0 MB
16:30:24 [2026-10-30T15:30:24.095Z] Progress (1): 6.0/9.0 MB
16:30:24 [2026-10-30T15:30:24.095Z] Progress (1): 6.0/9.0 MB
16:30:24 [2026-10-30T15:30:24.095Z] Progress (1): 6.0/9.0 MB
16:30:24 [2026-10-30T15:30:24.095Z] Progress (1): 6.0/9.0 MB
16:30:24 [2026-10-30T15:30:24.095Z] Progress (1): 6.0/9.0 MB
16:30:24 [2026-10-30T15:30:24.095Z] Progress (1): 6.0/9.0 MB
16:30:24 [2026-10-30T15:30:24.095Z] Progress (1): 6.0/9.0 MB
16:30:24 [2026-10-30T15:30:24.095Z] Progress (1): 6.0/9.0 MB
16:30:24 [2026-10-30T15:30:24.095Z] Progress (1): 6.0/9.0 MB
16:30:24 [2026-10-30T15:30:24.095Z] Progress (1): 6.0/9.0 MB
16:30:24 [2026-10-30T15:30:24.095Z] Progress (1): 6.0/9.0 MB
16:30:24 [2026-10-30T15:30:24.095Z] Progress (1): 6.0/9.0 MB
16:30:24 [2026-10-30T15:30:24.095Z] Progress (1): 6.0/9.0 MB
16:30:24 [2026-10-30T15:30:24.095Z] Progress (1): 6.0/9.0 MB
16:30:24 [2026-10-30T15:30:24.095Z] Progress (1): 6.0/9.0 MB
16:30:24 [2026-10-30T15:30:24.095Z] Progress (1): 6.0/9.0 MB
16:30:24 [2026-10-30T15:30:24.095Z] Progress (1): 6.1/9.0 MB
16:30:24 [2026-10-30T15:30:24.095Z] Progress (1): 6.1/9.0 MB
16:30:24 [2026-10-30T15:30:24.095Z] Progress (1): 6.1/9.0 MB
16:30:24 [2026-10-30T15:30:24.095Z] Progress (1): 6.1/9.0 MB
16:30:24 [2026-10-30T15:30:24.095Z] Progress (1): 6.1/9.0 MB
16:30:24 [2026-10-30T15:30:24.095Z] Progress (1): 6.1/9.0 MB
16:30:24 [2026-10-30T15:30:24.095Z] Progress (1): 6.1/9.0 MB
16:30:24 [2026-10-30T15:30:24.095Z] Progress (1): 6.1/9.0 MB
16:30:24 [2026-10-30T15:30:24.095Z] Progress (1): 6.1/9.0 MB
16:30:24 [2026-10-30T15:30:24.095Z] Progress (1): 6.1/9.0 MB
16:30:24 [2026-10-30T15:30:24.095Z] Progress (1): 6.1/9.0 MB
16:30:24 [2026-10-30T15:30:24.095Z] Progress (1): 6.1/9.0 MB
16:30:24 [2026-10-30T15:30:24.095Z] Progress (1): 6.1/9.0 MB
16:30:24 [2026-10-30T15:30:24.095Z] Progress (1): 6.1/9.0 MB
16:30:24 [2026-10-30T15:30:24.095Z] Progress (1): 6.1/9.0 MB
16:30:24 [2026-10-30T15:30:24.095Z] Progress (1): 6.1/9.0 MB
16:30:24 [2026-10-30T15:30:24.095Z] Progress (1): 6.1/9.0 MB
16:30:24 [2026-10-30T15:30:24.095Z] Progress (1): 6.1/9.0 MB
16:30:24 [2026-10-30T15:30:24.095Z] Progress (1): 6.2/9.0 MB
16:30:24 [2026-10-30T15:30:24.095Z] Progress (1): 6.2/9.0 MB
16:30:24 [2026-10-30T15:30:24.095Z] Progress (1): 6.2/9.0 MB
16:30:24 [2026-10-30T15:30:24.095Z] Progress (1): 6.2/9.0 MB
16:30:24 [2026-10-30T15:30:24.095Z] Progress (1): 6.2/9.0 MB
16:30:24 [2026-10-30T15:30:24.095Z] Progress (1): 6.2/9.0 MB
16:30:24 [2026-10-30T15:30:24.095Z] Progress (1): 6.2/9.0 MB
16:30:24 [2026-10-30T15:30:24.095Z] Progress (1): 6.2/9.0 MB
16:30:24 [2026-10-30T15:30:24.095Z] Progress (1): 6.2/9.0 MB
16:30:24 [2026-10-30T15:30:24.095Z] Progress (1): 6.2/9.0 MB
16:30:24 [2026-10-30T15:30:24.095Z] Progress (1): 6.2/9.0 MB
16:30:24 [2026-10-30T15:30:24.095Z] Progress (1): 6.2/9.0 MB
16:30:24 [2026-10-30T15:30:24.095Z] Progress (1): 6.2/9.0 MB
16:30:24 [2026-10-30T15:30:24.095Z] Progress (1): 6.2/9.0 MB
16:30:24 [2026-10-30T15:30:24.095Z] Progress (1): 6.2/9.0 MB
16:30:24 [2026-10-30T15:30:24.096Z] Progress (1): 6.2/9.0 MB
16:30:24 [2026-10-30T15:30:24.096Z] Progress (1): 6.2/9.0 MB
16:30:24 [2026-10-30T15:30:24.096Z] Progress (1): 6.2/9.0 MB
16:30:24 [2026-10-30T15:30:24.096Z] Progress (1): 6.3/9.0 MB
16:30:24 [2026-10-30T15:30:24.096Z] Progress (1): 6.3/9.0 MB
16:30:24 [2026-10-30T15:30:24.096Z] Progress (1): 6.3/9.0 MB
16:30:24 [2026-10-30T15:30:24.096Z] Progress (1): 6.3/9.0 MB
16:30:24 [2026-10-30T15:30:24.096Z] Progress (1): 6.3/9.0 MB
16:30:24 [2026-10-30T15:30:24.096Z] Progress (1): 6.3/9.0 MB
16:30:24 [2026-10-30T15:30:24.096Z] Progress (1): 6.3/9.0 MB
16:30:24 [2026-10-30T15:30:24.096Z] Progress (1): 6.3/9.0 MB
16:30:24 [2026-10-30T15:30:24.096Z] Progress (1): 6.3/9.0 MB
16:30:24 [2026-10-30T15:30:24.096Z] Progress (1): 6.3/9.0 MB
16:30:24 [2026-10-30T15:30:24.096Z] Progress (1): 6.3/9.0 MB
16:30:24 [2026-10-30T15:30:24.096Z] Progress (1): 6.3/9.0 MB
16:30:24 [2026-10-30T15:30:24.096Z] Progress (1): 6.3/9.0 MB
16:30:24 [2026-10-30T15:30:24.096Z] Progress (1): 6.3/9.0 MB
16:30:24 [2026-10-30T15:30:24.096Z] Progress (1): 6.3/9.0 MB
16:30:24 [2026-10-30T15:30:24.096Z] Progress (1): 6.3/9.0 MB
16:30:24 [2026-10-30T15:30:24.096Z] Progress (1): 6.3/9.0 MB
16:30:24 [2026-10-30T15:30:24.096Z] Progress (1): 6.3/9.0 MB
16:30:24 [2026-10-30T15:30:24.096Z] Progress (1): 6.3/9.0 MB
16:30:24 [2026-10-30T15:30:24.096Z] Progress (1): 6.4/9.0 MB
16:30:24 [2026-10-30T15:30:24.096Z] Progress (1): 6.4/9.0 MB
16:30:24 [2026-10-30T15:30:24.096Z] Progress (1): 6.4/9.0 MB
16:30:24 [2026-10-30T15:30:24.096Z] Progress (1): 6.4/9.0 MB
16:30:24 [2026-10-30T15:30:24.096Z] Progress (1): 6.4/9.0 MB
16:30:24 [2026-10-30T15:30:24.096Z] Progress (1): 6.4/9.0 MB
16:30:24 [2026-10-30T15:30:24.096Z] Progress (1): 6.4/9.0 MB
16:30:24 [2026-10-30T15:30:24.096Z] Progress (1): 6.4/9.0 MB
16:30:24 [2026-10-30T15:30:24.096Z] Progress (1): 6.4/9.0 MB
16:30:24 [2026-10-30T15:30:24.096Z] Progress (1): 6.4/9.0 MB
16:30:24 [2026-10-30T15:30:24.096Z] Progress (1): 6.4/9.0 MB
16:30:24 [2026-10-30T15:30:24.096Z] Progress (1): 6.4/9.0 MB
16:30:24 [2026-10-30T15:30:24.096Z] Progress (1): 6.4/9.0 MB
16:30:24 [2026-10-30T15:30:24.096Z] Progress (1): 6.4/9.0 MB
16:30:24 [2026-10-30T15:30:24.096Z] Progress (1): 6.4/9.0 MB
16:30:24 [2026-10-30T15:30:24.096Z] Progress (1): 6.4/9.0 MB
16:30:24 [2026-10-30T15:30:24.096Z] Progress (1): 6.4/9.0 MB
16:30:24 [2026-10-30T15:30:24.096Z] Progress (1): 6.4/9.0 MB
16:30:24 [2026-10-30T15:30:24.096Z] Progress (1): 6.5/9.0 MB
16:30:24 [2026-10-30T15:30:24.096Z] Progress (1): 6.5/9.0 MB
16:30:24 [2026-10-30T15:30:24.096Z] Progress (1): 6.5/9.0 MB
16:30:24 [2026-10-30T15:30:24.096Z] Progress (1): 6.5/9.0 MB
16:30:24 [2026-10-30T15:30:24.096Z] Progress (1): 6.5/9.0 MB
16:30:24 [2026-10-30T15:30:24.096Z] Progress (1): 6.5/9.0 MB
16:30:24 [2026-10-30T15:30:24.096Z] Progress (1): 6.5/9.0 MB
16:30:24 [2026-10-30T15:30:24.096Z] Progress (1): 6.5/9.0 MB
16:30:24 [2026-10-30T15:30:24.096Z] Progress (1): 6.5/9.0 MB
16:30:24 [2026-10-30T15:30:24.096Z] Progress (1): 6.5/9.0 MB
16:30:24 [2026-10-30T15:30:24.096Z] Progress (1): 6.5/9.0 MB
16:30:24 [2026-10-30T15:30:24.096Z] Progress (1): 6.5/9.0 MB
16:30:24 [2026-10-30T15:30:24.096Z] Progress (1): 6.5/9.0 MB
16:30:24 [2026-10-30T15:30:24.096Z] Progress (1): 6.5/9.0 MB
16:30:24 [2026-10-30T15:30:24.096Z] Progress (1): 6.5/9.0 MB
16:30:24 [2026-10-30T15:30:24.096Z] Progress (1): 6.5/9.0 MB
16:30:24 [2026-10-30T15:30:24.096Z] Progress (1): 6.5/9.0 MB
16:30:24 [2026-10-30T15:30:24.096Z] Progress (1): 6.5/9.0 MB
16:30:24 [2026-10-30T15:30:24.096Z] Progress (1): 6.5/9.0 MB
16:30:24 [2026-10-30T15:30:24.096Z] Progress (1): 6.6/9.0 MB
16:30:24 [2026-10-30T15:30:24.096Z] Progress (1): 6.6/9.0 MB
16:30:24 [2026-10-30T15:30:24.096Z] Progress (1): 6.6/9.0 MB
16:30:24 [2026-10-30T15:30:24.096Z] Progress (1): 6.6/9.0 MB
16:30:24 [2026-10-30T15:30:24.096Z] Progress (1): 6.6/9.0 MB
16:30:24 [2026-10-30T15:30:24.096Z] Progress (1): 6.6/9.0 MB
16:30:24 [2026-10-30T15:30:24.096Z] Progress (1): 6.6/9.0 MB
16:30:24 [2026-10-30T15:30:24.096Z] Progress (1): 6.6/9.0 MB
16:30:24 [2026-10-30T15:30:24.096Z] Progress (1): 6.6/9.0 MB
16:30:24 [2026-10-30T15:30:24.096Z] Progress (1): 6.6/9.0 MB
16:30:24 [2026-10-30T15:30:24.096Z] Progress (1): 6.6/9.0 MB
16:30:24 [2026-10-30T15:30:24.096Z] Progress (1): 6.6/9.0 MB
16:30:24 [2026-10-30T15:30:24.096Z] Progress (1): 6.6/9.0 MB
16:30:24 [2026-10-30T15:30:24.096Z] Progress (1): 6.6/9.0 MB
16:30:24 [2026-10-30T15:30:24.096Z] Progress (1): 6.6/9.0 MB
16:30:24 [2026-10-30T15:30:24.096Z] Progress (1): 6.6/9.0 MB
16:30:24 [2026-10-30T15:30:24.096Z] Progress (1): 6.6/9.0 MB
16:30:24 [2026-10-30T15:30:24.096Z] Progress (1): 6.6/9.0 MB
16:30:24 [2026-10-30T15:30:24.096Z] Progress (1): 6.7/9.0 MB
16:30:24 [2026-10-30T15:30:24.096Z] Progress (1): 6.7/9.0 MB
16:30:24 [2026-10-30T15:30:24.096Z] Progress (1): 6.7/9.0 MB
16:30:24 [2026-10-30T15:30:24.096Z] Progress (1): 6.7/9.0 MB
16:30:24 [2026-10-30T15:30:24.096Z] Progress (1): 6.7/9.0 MB
16:30:24 [2026-10-30T15:30:24.096Z] Progress (1): 6.7/9.0 MB
16:30:24 [2026-10-30T15:30:24.096Z] Progress (1): 6.7/9.0 MB
16:30:24 [2026-10-30T15:30:24.096Z] Progress (1): 6.7/9.0 MB
16:30:24 [2026-10-30T15:30:24.096Z] Progress (1): 6.7/9.0 MB
16:30:24 [2026-10-30T15:30:24.096Z] Progress (1): 6.7/9.0 MB
16:30:24 [2026-10-30T15:30:24.096Z] Progress (1): 6.7/9.0 MB
16:30:24 [2026-10-30T15:30:24.096Z] Progress (1): 6.7/9.0 MB
16:30:24 [2026-10-30T15:30:24.096Z] Progress (1): 6.7/9.0 MB
16:30:24 [2026-10-30T15:30:24.096Z] Progress (1): 6.7/9.0 MB
16:30:24 [2026-10-30T15:30:24.096Z] Progress (1): 6.7/9.0 MB
16:30:24 [2026-10-30T15:30:24.096Z] Progress (1): 6.7/9.0 MB
16:30:24 [2026-10-30T15:30:24.096Z] Progress (1): 6.7/9.0 MB
16:30:24 [2026-10-30T15:30:24.096Z] Progress (1): 6.7/9.0 MB
16:30:24 [2026-10-30T15:30:24.096Z] Progress (1): 6.7/9.0 MB
16:30:24 [2026-10-30T15:30:24.096Z] Progress (1): 6.8/9.0 MB
16:30:24 [2026-10-30T15:30:24.096Z] Progress (1): 6.8/9.0 MB
16:30:24 [2026-10-30T15:30:24.096Z] Progress (1): 6.8/9.0 MB
16:30:24 [2026-10-30T15:30:24.096Z] Progress (1): 6.8/9.0 MB
16:30:24 [2026-10-30T15:30:24.096Z] Progress (1): 6.8/9.0 MB
16:30:24 [2026-10-30T15:30:24.096Z] Progress (1): 6.8/9.0 MB
16:30:24 [2026-10-30T15:30:24.096Z] Progress (1): 6.8/9.0 MB
16:30:24 [2026-10-30T15:30:24.096Z] Progress (1): 6.8/9.0 MB
16:30:24 [2026-10-30T15:30:24.096Z] Progress (1): 6.8/9.0 MB
16:30:24 [2026-10-30T15:30:24.096Z] Progress (1): 6.8/9.0 MB
16:30:24 [2026-10-30T15:30:24.096Z] Progress (1): 6.8/9.0 MB
16:30:24 [2026-10-30T15:30:24.096Z] Progress (1): 6.8/9.0 MB
16:30:24 [2026-10-30T15:30:24.096Z] Progress (1): 6.8/9.0 MB
16:30:24 [2026-10-30T15:30:24.096Z] Progress (1): 6.8/9.0 MB
16:30:24 [2026-10-30T15:30:24.096Z] Progress (1): 6.8/9.0 MB
16:30:24 [2026-10-30T15:30:24.096Z] Progress (1): 6.8/9.0 MB
16:30:24 [2026-10-30T15:30:24.096Z] Progress (1): 6.8/9.0 MB
16:30:24 [2026-10-30T15:30:24.096Z] Progress (1): 6.8/9.0 MB
16:30:24 [2026-10-30T15:30:24.096Z] Progress (1): 6.8/9.0 MB
16:30:24 [2026-10-30T15:30:24.096Z] Progress (1): 6.9/9.0 MB
16:30:24 [2026-10-30T15:30:24.096Z] Progress (1): 6.9/9.0 MB
16:30:24 [2026-10-30T15:30:24.096Z] Progress (1): 6.9/9.0 MB
16:30:24 [2026-10-30T15:30:24.096Z] Progress (1): 6.9/9.0 MB
16:30:24 [2026-10-30T15:30:24.096Z] Progress (1): 6.9/9.0 MB
16:30:24 [2026-10-30T15:30:24.096Z] Progress (1): 6.9/9.0 MB
16:30:24 [2026-10-30T15:30:24.096Z] Progress (1): 6.9/9.0 MB
16:30:24 [2026-10-30T15:30:24.096Z] Progress (1): 6.9/9.0 MB
16:30:24 [2026-10-30T15:30:24.096Z] Progress (1): 6.9/9.0 MB
16:30:24 [2026-10-30T15:30:24.096Z] Progress (1): 6.9/9.0 MB
16:30:24 [2026-10-30T15:30:24.096Z] Progress (1): 6.9/9.0 MB
16:30:24 [2026-10-30T15:30:24.096Z] Progress (1): 6.9/9.0 MB
16:30:24 [2026-10-30T15:30:24.096Z] Progress (1): 6.9/9.0 MB
16:30:24 [2026-10-30T15:30:24.096Z] Progress (1): 6.9/9.0 MB
16:30:24 [2026-10-30T15:30:24.096Z] Progress (1): 6.9/9.0 MB
16:30:24 [2026-10-30T15:30:24.096Z] Progress (1): 6.9/9.0 MB
16:30:24 [2026-10-30T15:30:24.096Z] Progress (1): 6.9/9.0 MB
16:30:24 [2026-10-30T15:30:24.096Z] Progress (1): 6.9/9.0 MB
16:30:24 [2026-10-30T15:30:24.096Z] Progress (1): 7.0/9.0 MB
16:30:24 [2026-10-30T15:30:24.096Z] Progress (1): 7.0/9.0 MB
16:30:24 [2026-10-30T15:30:24.096Z] Progress (1): 7.0/9.0 MB
16:30:24 [2026-10-30T15:30:24.096Z] Progress (1): 7.0/9.0 MB
16:30:24 [2026-10-30T15:30:24.096Z] Progress (1): 7.0/9.0 MB
16:30:24 [2026-10-30T15:30:24.096Z] Progress (1): 7.0/9.0 MB
16:30:24 [2026-10-30T15:30:24.096Z] Progress (1): 7.0/9.0 MB
16:30:24 [2026-10-30T15:30:24.096Z] Progress (1): 7.0/9.0 MB
16:30:24 [2026-10-30T15:30:24.096Z] Progress (1): 7.0/9.0 MB
16:30:24 [2026-10-30T15:30:24.096Z] Progress (1): 7.0/9.0 MB
16:30:24 [2026-10-30T15:30:24.096Z] Progress (1): 7.0/9.0 MB
16:30:24 [2026-10-30T15:30:24.096Z] Progress (1): 7.0/9.0 MB
16:30:24 [2026-10-30T15:30:24.096Z] Progress (1): 7.0/9.0 MB
16:30:24 [2026-10-30T15:30:24.096Z] Progress (1): 7.0/9.0 MB
16:30:24 [2026-10-30T15:30:24.096Z] Progress (1): 7.0/9.0 MB
16:30:24 [2026-10-30T15:30:24.096Z] Progress (1): 7.0/9.0 MB
16:30:24 [2026-10-30T15:30:24.096Z] Progress (1): 7.0/9.0 MB
16:30:24 [2026-10-30T15:30:24.096Z] Progress (1): 7.0/9.0 MB
16:30:24 [2026-10-30T15:30:24.096Z] Progress (1): 7.0/9.0 MB
16:30:24 [2026-10-30T15:30:24.096Z] Progress (1): 7.1/9.0 MB
16:30:24 [2026-10-30T15:30:24.096Z] Progress (1): 7.1/9.0 MB
16:30:24 [2026-10-30T15:30:24.096Z] Progress (1): 7.1/9.0 MB
16:30:24 [2026-10-30T15:30:24.096Z] Progress (1): 7.1/9.0 MB
16:30:24 [2026-10-30T15:30:24.096Z] Progress (1): 7.1/9.0 MB
16:30:24 [2026-10-30T15:30:24.096Z] Progress (1): 7.1/9.0 MB
16:30:24 [2026-10-30T15:30:24.096Z] Progress (1): 7.1/9.0 MB
16:30:24 [2026-10-30T15:30:24.096Z] Progress (1): 7.1/9.0 MB
16:30:24 [2026-10-30T15:30:24.096Z] Progress (1): 7.1/9.0 MB
16:30:24 [2026-10-30T15:30:24.096Z] Progress (1): 7.1/9.0 MB
16:30:24 [2026-10-30T15:30:24.096Z] Progress (1): 7.1/9.0 MB
16:30:24 [2026-10-30T15:30:24.096Z] Progress (1): 7.1/9.0 MB
16:30:24 [2026-10-30T15:30:24.096Z] Progress (1): 7.1/9.0 MB
16:30:24 [2026-10-30T15:30:24.096Z] Progress (1): 7.1/9.0 MB
16:30:24 [2026-10-30T15:30:24.096Z] Progress (1): 7.1/9.0 MB
16:30:24 [2026-10-30T15:30:24.096Z] Progress (1): 7.1/9.0 MB
16:30:24 [2026-10-30T15:30:24.096Z] Progress (1): 7.1/9.0 MB
16:30:24 [2026-10-30T15:30:24.096Z] Progress (1): 7.1/9.0 MB
16:30:24 [2026-10-30T15:30:24.096Z] Progress (1): 7.2/9.0 MB
16:30:24 [2026-10-30T15:30:24.096Z] Progress (1): 7.2/9.0 MB
16:30:24 [2026-10-30T15:30:24.096Z] Progress (1): 7.2/9.0 MB
16:30:24 [2026-10-30T15:30:24.096Z] Progress (1): 7.2/9.0 MB
16:30:24 [2026-10-30T15:30:24.096Z] Progress (1): 7.2/9.0 MB
16:30:24 [2026-10-30T15:30:24.096Z] Progress (1): 7.2/9.0 MB
16:30:24 [2026-10-30T15:30:24.096Z] Progress (1): 7.2/9.0 MB
16:30:24 [2026-10-30T15:30:24.096Z] Progress (1): 7.2/9.0 MB
16:30:24 [2026-10-30T15:30:24.096Z] Progress (1): 7.2/9.0 MB
16:30:24 [2026-10-30T15:30:24.096Z] Progress (1): 7.2/9.0 MB
16:30:24 [2026-10-30T15:30:24.096Z] Progress (1): 7.2/9.0 MB
16:30:24 [2026-10-30T15:30:24.096Z] Progress (1): 7.2/9.0 MB
16:30:24 [2026-10-30T15:30:24.096Z] Progress (1): 7.2/9.0 MB
16:30:24 [2026-10-30T15:30:24.096Z] Progress (1): 7.2/9.0 MB
16:30:24 [2026-10-30T15:30:24.096Z] Progress (1): 7.2/9.0 MB
16:30:24 [2026-10-30T15:30:24.096Z] Progress (1): 7.2/9.0 MB
16:30:24 [2026-10-30T15:30:24.096Z] Progress (1): 7.2/9.0 MB
16:30:24 [2026-10-30T15:30:24.096Z] Progress (1): 7.2/9.0 MB
16:30:24 [2026-10-30T15:30:24.096Z] Progress (1): 7.2/9.0 MB
16:30:24 [2026-10-30T15:30:24.096Z] Progress (1): 7.3/9.0 MB
16:30:24 [2026-10-30T15:30:24.096Z] Progress (1): 7.3/9.0 MB
16:30:24 [2026-10-30T15:30:24.096Z] Progress (1): 7.3/9.0 MB
16:30:24 [2026-10-30T15:30:24.096Z] Progress (1): 7.3/9.0 MB
16:30:24 [2026-10-30T15:30:24.096Z] Progress (1): 7.3/9.0 MB
16:30:24 [2026-10-30T15:30:24.096Z] Progress (1): 7.3/9.0 MB
16:30:24 [2026-10-30T15:30:24.096Z] Progress (1): 7.3/9.0 MB
16:30:24 [2026-10-30T15:30:24.096Z] Progress (1): 7.3/9.0 MB
16:30:24 [2026-10-30T15:30:24.096Z] Progress (1): 7.3/9.0 MB
16:30:24 [2026-10-30T15:30:24.096Z] Progress (1): 7.3/9.0 MB
16:30:24 [2026-10-30T15:30:24.096Z] Progress (1): 7.3/9.0 MB
16:30:24 [2026-10-30T15:30:24.096Z] Progress (1): 7.3/9.0 MB
16:30:24 [2026-10-30T15:30:24.096Z] Progress (1): 7.3/9.0 MB
16:30:24 [2026-10-30T15:30:24.096Z] Progress (1): 7.3/9.0 MB
16:30:24 [2026-10-30T15:30:24.096Z] Progress (1): 7.3/9.0 MB
16:30:24 [2026-10-30T15:30:24.096Z] Progress (1): 7.3/9.0 MB
16:30:24 [2026-10-30T15:30:24.096Z] Progress (1): 7.3/9.0 MB
16:30:24 [2026-10-30T15:30:24.096Z] Progress (1): 7.3/9.0 MB
16:30:24 [2026-10-30T15:30:24.096Z] Progress (1): 7.4/9.0 MB
16:30:24 [2026-10-30T15:30:24.096Z] Progress (1): 7.4/9.0 MB
16:30:24 [2026-10-30T15:30:24.096Z] Progress (1): 7.4/9.0 MB
16:30:24 [2026-10-30T15:30:24.096Z] Progress (1): 7.4/9.0 MB
16:30:24 [2026-10-30T15:30:24.096Z] Progress (1): 7.4/9.0 MB
16:30:24 [2026-10-30T15:30:24.096Z] Progress (1): 7.4/9.0 MB
16:30:24 [2026-10-30T15:30:24.096Z] Progress (1): 7.4/9.0 MB
16:30:24 [2026-10-30T15:30:24.096Z] Progress (1): 7.4/9.0 MB
16:30:24 [2026-10-30T15:30:24.096Z] Progress (1): 7.4/9.0 MB
16:30:24 [2026-10-30T15:30:24.096Z] Progress (1): 7.4/9.0 MB
16:30:24 [2026-10-30T15:30:24.096Z] Progress (1): 7.4/9.0 MB
16:30:24 [2026-10-30T15:30:24.096Z] Progress (1): 7.4/9.0 MB
16:30:24 [2026-10-30T15:30:24.096Z] Progress (1): 7.4/9.0 MB
16:30:24 [2026-10-30T15:30:24.096Z] Progress (1): 7.4/9.0 MB
16:30:24 [2026-10-30T15:30:24.096Z] Progress (1): 7.4/9.0 MB
16:30:24 [2026-10-30T15:30:24.096Z] Progress (1): 7.4/9.0 MB
16:30:24 [2026-10-30T15:30:24.096Z] Progress (1): 7.4/9.0 MB
16:30:24 [2026-10-30T15:30:24.096Z] Progress (1): 7.4/9.0 MB
16:30:24 [2026-10-30T15:30:24.096Z] Progress (1): 7.5/9.0 MB
16:30:24 [2026-10-30T15:30:24.096Z] Progress (1): 7.5/9.0 MB
16:30:24 [2026-10-30T15:30:24.096Z] Progress (1): 7.5/9.0 MB
16:30:24 [2026-10-30T15:30:24.096Z] Progress (1): 7.5/9.0 MB
16:30:24 [2026-10-30T15:30:24.096Z] Progress (1): 7.5/9.0 MB
16:30:24 [2026-10-30T15:30:24.096Z] Progress (1): 7.5/9.0 MB
16:30:24 [2026-10-30T15:30:24.096Z] Progress (1): 7.5/9.0 MB
16:30:24 [2026-10-30T15:30:24.096Z] Progress (1): 7.5/9.0 MB
16:30:24 [2026-10-30T15:30:24.096Z] Progress (1): 7.5/9.0 MB
16:30:24 [2026-10-30T15:30:24.096Z] Progress (1): 7.5/9.0 MB
16:30:24 [2026-10-30T15:30:24.096Z] Progress (1): 7.5/9.0 MB
16:30:24 [2026-10-30T15:30:24.096Z] Progress (1): 7.5/9.0 MB
16:30:24 [2026-10-30T15:30:24.096Z] Progress (1): 7.5/9.0 MB
16:30:24 [2026-10-30T15:30:24.096Z] Progress (1): 7.5/9.0 MB
16:30:24 [2026-10-30T15:30:24.096Z] Progress (1): 7.5/9.0 MB
16:30:24 [2026-10-30T15:30:24.096Z] Progress (1): 7.5/9.0 MB
16:30:24 [2026-10-30T15:30:24.096Z] Progress (1): 7.5/9.0 MB
16:30:24 [2026-10-30T15:30:24.096Z] Progress (1): 7.5/9.0 MB
16:30:24 [2026-10-30T15:30:24.096Z] Progress (1): 7.5/9.0 MB
16:30:24 [2026-10-30T15:30:24.096Z] Progress (1): 7.6/9.0 MB
16:30:24 [2026-10-30T15:30:24.096Z] Progress (1): 7.6/9.0 MB
16:30:24 [2026-10-30T15:30:24.096Z] Progress (1): 7.6/9.0 MB
16:30:24 [2026-10-30T15:30:24.096Z] Progress (1): 7.6/9.0 MB
16:30:24 [2026-10-30T15:30:24.096Z] Progress (1): 7.6/9.0 MB
16:30:24 [2026-10-30T15:30:24.096Z] Progress (1): 7.6/9.0 MB
16:30:24 [2026-10-30T15:30:24.096Z] Progress (1): 7.6/9.0 MB
16:30:24 [2026-10-30T15:30:24.096Z] Progress (1): 7.6/9.0 MB
16:30:24 [2026-10-30T15:30:24.096Z] Progress (1): 7.6/9.0 MB
16:30:24 [2026-10-30T15:30:24.096Z] Progress (1): 7.6/9.0 MB
16:30:24 [2026-10-30T15:30:24.096Z] Progress (1): 7.6/9.0 MB
16:30:24 [2026-10-30T15:30:24.096Z] Progress (1): 7.6/9.0 MB
16:30:24 [2026-10-30T15:30:24.096Z] Progress (1): 7.6/9.0 MB
16:30:24 [2026-10-30T15:30:24.096Z] Progress (1): 7.6/9.0 MB
16:30:24 [2026-10-30T15:30:24.096Z] Progress (1): 7.6/9.0 MB
16:30:24 [2026-10-30T15:30:24.096Z] Progress (1): 7.6/9.0 MB
16:30:24 [2026-10-30T15:30:24.096Z] Progress (1): 7.6/9.0 MB
16:30:24 [2026-10-30T15:30:24.096Z] Progress (1): 7.7/9.0 MB
16:30:24 [2026-10-30T15:30:24.096Z] Progress (1): 7.7/9.0 MB
16:30:24 [2026-10-30T15:30:24.096Z] Progress (1): 7.7/9.0 MB
16:30:24 [2026-10-30T15:30:24.096Z] Progress (1): 7.7/9.0 MB
16:30:24 [2026-10-30T15:30:24.096Z] Progress (1): 7.7/9.0 MB
16:30:24 [2026-10-30T15:30:24.096Z] Progress (1): 7.7/9.0 MB
16:30:24 [2026-10-30T15:30:24.096Z] Progress (1): 7.7/9.0 MB
16:30:24 [2026-10-30T15:30:24.096Z] Progress (1): 7.7/9.0 MB
16:30:24 [2026-10-30T15:30:24.096Z] Progress (1): 7.7/9.0 MB
16:30:24 [2026-10-30T15:30:24.096Z] Progress (1): 7.7/9.0 MB
16:30:24 [2026-10-30T15:30:24.096Z] Progress (1): 7.7/9.0 MB
16:30:24 [2026-10-30T15:30:24.096Z] Progress (1): 7.7/9.0 MB
16:30:24 [2026-10-30T15:30:24.096Z] Progress (1): 7.7/9.0 MB
16:30:24 [2026-10-30T15:30:24.096Z] Progress (1): 7.7/9.0 MB
16:30:24 [2026-10-30T15:30:24.096Z] Progress (1): 7.7/9.0 MB
16:30:24 [2026-10-30T15:30:24.096Z] Progress (1): 7.7/9.0 MB
16:30:24 [2026-10-30T15:30:24.096Z] Progress (1): 7.7/9.0 MB
16:30:24 [2026-10-30T15:30:24.096Z] Progress (1): 7.7/9.0 MB
16:30:24 [2026-10-30T15:30:24.096Z] Progress (1): 7.7/9.0 MB
16:30:24 [2026-10-30T15:30:24.096Z] Progress (1): 7.7/9.0 MB
16:30:24 [2026-10-30T15:30:24.096Z] Progress (1): 7.8/9.0 MB
16:30:24 [2026-10-30T15:30:24.096Z] Progress (1): 7.8/9.0 MB
16:30:24 [2026-10-30T15:30:24.096Z] Progress (1): 7.8/9.0 MB
16:30:24 [2026-10-30T15:30:24.096Z] Progress (1): 7.8/9.0 MB
16:30:24 [2026-10-30T15:30:24.096Z] Progress (1): 7.8/9.0 MB
16:30:24 [2026-10-30T15:30:24.096Z] Progress (1): 7.8/9.0 MB
16:30:24 [2026-10-30T15:30:24.096Z] Progress (1): 7.8/9.0 MB
16:30:24 [2026-10-30T15:30:24.096Z] Progress (1): 7.8/9.0 MB
16:30:24 [2026-10-30T15:30:24.096Z] Progress (1): 7.8/9.0 MB
16:30:24 [2026-10-30T15:30:24.096Z] Progress (1): 7.8/9.0 MB
16:30:24 [2026-10-30T15:30:24.096Z] Progress (1): 7.8/9.0 MB
16:30:24 [2026-10-30T15:30:24.096Z] Progress (1): 7.8/9.0 MB
16:30:24 [2026-10-30T15:30:24.096Z] Progress (1): 7.8/9.0 MB
16:30:24 [2026-10-30T15:30:24.096Z] Progress (1): 7.8/9.0 MB
16:30:24 [2026-10-30T15:30:24.096Z] Progress (1): 7.8/9.0 MB
16:30:24 [2026-10-30T15:30:24.096Z] Progress (1): 7.8/9.0 MB
16:30:24 [2026-10-30T15:30:24.096Z] Progress (1): 7.8/9.0 MB
16:30:24 [2026-10-30T15:30:24.096Z] Progress (1): 7.8/9.0 MB
16:30:24 [2026-10-30T15:30:24.096Z] Progress (1): 7.9/9.0 MB
16:30:24 [2026-10-30T15:30:24.096Z] Progress (1): 7.9/9.0 MB
16:30:24 [2026-10-30T15:30:24.096Z] Progress (1): 7.9/9.0 MB
16:30:24 [2026-10-30T15:30:24.096Z] Progress (1): 7.9/9.0 MB
16:30:24 [2026-10-30T15:30:24.096Z] Progress (1): 7.9/9.0 MB
16:30:24 [2026-10-30T15:30:24.096Z] Progress (1): 7.9/9.0 MB
16:30:24 [2026-10-30T15:30:24.096Z] Progress (1): 7.9/9.0 MB
16:30:24 [2026-10-30T15:30:24.096Z] Progress (1): 7.9/9.0 MB
16:30:24 [2026-10-30T15:30:24.096Z] Progress (1): 7.9/9.0 MB
16:30:24 [2026-10-30T15:30:24.096Z] Progress (1): 7.9/9.0 MB
16:30:24 [2026-10-30T15:30:24.096Z] Progress (1): 7.9/9.0 MB
16:30:24 [2026-10-30T15:30:24.096Z] Progress (1): 7.9/9.0 MB
16:30:24 [2026-10-30T15:30:24.096Z] Progress (1): 7.9/9.0 MB
16:30:24 [2026-10-30T15:30:24.096Z] Progress (1): 7.9/9.0 MB
16:30:24 [2026-10-30T15:30:24.096Z] Progress (1): 7.9/9.0 MB
16:30:24 [2026-10-30T15:30:24.096Z] Progress (1): 7.9/9.0 MB
16:30:24 [2026-10-30T15:30:24.096Z] Progress (1): 7.9/9.0 MB
16:30:24 [2026-10-30T15:30:24.096Z] Progress (1): 7.9/9.0 MB
16:30:24 [2026-10-30T15:30:24.096Z] Progress (1): 8.0/9.0 MB
16:30:24 [2026-10-30T15:30:24.096Z] Progress (1): 8.0/9.0 MB
16:30:24 [2026-10-30T15:30:24.096Z] Progress (1): 8.0/9.0 MB
16:30:24 [2026-10-30T15:30:24.096Z] Progress (1): 8.0/9.0 MB
16:30:24 [2026-10-30T15:30:24.096Z] Progress (1): 8.0/9.0 MB
16:30:24 [2026-10-30T15:30:24.096Z] Progress (1): 8.0/9.0 MB
16:30:24 [2026-10-30T15:30:24.096Z] Progress (1): 8.0/9.0 MB
16:30:24 [2026-10-30T15:30:24.096Z] Progress (1): 8.0/9.0 MB
16:30:24 [2026-10-30T15:30:24.096Z] Progress (1): 8.0/9.0 MB
16:30:24 [2026-10-30T15:30:24.096Z] Progress (1): 8.0/9.0 MB
16:30:24 [2026-10-30T15:30:24.096Z] Progress (1): 8.0/9.0 MB
16:30:24 [2026-10-30T15:30:24.096Z] Progress (1): 8.0/9.0 MB
16:30:24 [2026-10-30T15:30:24.096Z] Progress (1): 8.0/9.0 MB
16:30:24 [2026-10-30T15:30:24.096Z] Progress (1): 8.0/9.0 MB
16:30:24 [2026-10-30T15:30:24.096Z] Progress (1): 8.0/9.0 MB
16:30:24 [2026-10-30T15:30:24.096Z] Progress (1): 8.0/9.0 MB
16:30:24 [2026-10-30T15:30:24.096Z] Progress (1): 8.0/9.0 MB
16:30:24 [2026-10-30T15:30:24.096Z] Progress (1): 8.0/9.0 MB
16:30:24 [2026-10-30T15:30:24.096Z] Progress (1): 8.1/9.0 MB
16:30:24 [2026-10-30T15:30:24.096Z] Progress (1): 8.1/9.0 MB
16:30:24 [2026-10-30T15:30:24.096Z] Progress (1): 8.1/9.0 MB
16:30:24 [2026-10-30T15:30:24.096Z] Progress (1): 8.1/9.0 MB
16:30:24 [2026-10-30T15:30:24.096Z] Progress (1): 8.1/9.0 MB
16:30:24 [2026-10-30T15:30:24.096Z] Progress (1): 8.1/9.0 MB
16:30:24 [2026-10-30T15:30:24.096Z] Progress (1): 8.1/9.0 MB
16:30:24 [2026-10-30T15:30:24.096Z] Progress (1): 8.1/9.0 MB
16:30:24 [2026-10-30T15:30:24.096Z] Progress (1): 8.1/9.0 MB
16:30:24 [2026-10-30T15:30:24.096Z] Progress (1): 8.1/9.0 MB
16:30:24 [2026-10-30T15:30:24.096Z] Progress (1): 8.1/9.0 MB
16:30:24 [2026-10-30T15:30:24.096Z] Progress (1): 8.1/9.0 MB
16:30:24 [2026-10-30T15:30:24.096Z] Progress (1): 8.1/9.0 MB
16:30:24 [2026-10-30T15:30:24.096Z] Progress (1): 8.1/9.0 MB
16:30:24 [2026-10-30T15:30:24.096Z] Progress (1): 8.1/9.0 MB
16:30:24 [2026-10-30T15:30:24.096Z] Progress (1): 8.1/9.0 MB
16:30:24 [2026-10-30T15:30:24.096Z] Progress (1): 8.1/9.0 MB
16:30:24 [2026-10-30T15:30:24.096Z] Progress (1): 8.1/9.0 MB
16:30:24 [2026-10-30T15:30:24.096Z] Progress (1): 8.2/9.0 MB
16:30:24 [2026-10-30T15:30:24.096Z] Progress (1): 8.2/9.0 MB
16:30:24 [2026-10-30T15:30:24.096Z] Progress (1): 8.2/9.0 MB
16:30:24 [2026-10-30T15:30:24.096Z] Progress (1): 8.2/9.0 MB
16:30:24 [2026-10-30T15:30:24.096Z] Progress (1): 8.2/9.0 MB
16:30:24 [2026-10-30T15:30:24.096Z] Progress (1): 8.2/9.0 MB
16:30:24 [2026-10-30T15:30:24.096Z] Progress (1): 8.2/9.0 MB
16:30:24 [2026-10-30T15:30:24.096Z] Progress (1): 8.2/9.0 MB
16:30:24 [2026-10-30T15:30:24.096Z] Progress (1): 8.2/9.0 MB
16:30:24 [2026-10-30T15:30:24.096Z] Progress (1): 8.2/9.0 MB
16:30:24 [2026-10-30T15:30:24.096Z] Progress (1): 8.2/9.0 MB
16:30:24 [2026-10-30T15:30:24.096Z] Progress (1): 8.2/9.0 MB
16:30:24 [2026-10-30T15:30:24.096Z] Progress (1): 8.2/9.0 MB
16:30:24 [2026-10-30T15:30:24.096Z] Progress (1): 8.2/9.0 MB
16:30:24 [2026-10-30T15:30:24.096Z] Progress (1): 8.2/9.0 MB
16:30:24 [2026-10-30T15:30:24.096Z] Progress (1): 8.2/9.0 MB
16:30:24 [2026-10-30T15:30:24.096Z] Progress (1): 8.2/9.0 MB
16:30:24 [2026-10-30T15:30:24.096Z] Progress (1): 8.2/9.0 MB
16:30:24 [2026-10-30T15:30:24.096Z] Progress (1): 8.2/9.0 MB
16:30:24 [2026-10-30T15:30:24.096Z] Progress (1): 8.3/9.0 MB
16:30:24 [2026-10-30T15:30:24.096Z] Progress (1): 8.3/9.0 MB
16:30:24 [2026-10-30T15:30:24.096Z] Progress (1): 8.3/9.0 MB
16:30:24 [2026-10-30T15:30:24.096Z] Progress (1): 8.3/9.0 MB
16:30:24 [2026-10-30T15:30:24.096Z] Progress (1): 8.3/9.0 MB
16:30:24 [2026-10-30T15:30:24.096Z] Progress (1): 8.3/9.0 MB
16:30:24 [2026-10-30T15:30:24.096Z] Progress (1): 8.3/9.0 MB
16:30:24 [2026-10-30T15:30:24.096Z] Progress (1): 8.3/9.0 MB
16:30:24 [2026-10-30T15:30:24.096Z] Progress (1): 8.3/9.0 MB
16:30:24 [2026-10-30T15:30:24.096Z] Progress (1): 8.3/9.0 MB
16:30:24 [2026-10-30T15:30:24.096Z] Progress (1): 8.3/9.0 MB
16:30:24 [2026-10-30T15:30:24.096Z] Progress (1): 8.3/9.0 MB
16:30:24 [2026-10-30T15:30:24.096Z] Progress (1): 8.3/9.0 MB
16:30:24 [2026-10-30T15:30:24.096Z] Progress (1): 8.3/9.0 MB
16:30:24 [2026-10-30T15:30:24.096Z] Progress (1): 8.3/9.0 MB
16:30:24 [2026-10-30T15:30:24.096Z] Progress (1): 8.3/9.0 MB
16:30:24 [2026-10-30T15:30:24.096Z] Progress (1): 8.3/9.0 MB
16:30:24 [2026-10-30T15:30:24.096Z] Progress (1): 8.3/9.0 MB
16:30:24 [2026-10-30T15:30:24.096Z] Progress (1): 8.4/9.0 MB
16:30:24 [2026-10-30T15:30:24.096Z] Progress (1): 8.4/9.0 MB
16:30:24 [2026-10-30T15:30:24.096Z] Progress (1): 8.4/9.0 MB
16:30:24 [2026-10-30T15:30:24.096Z] Progress (1): 8.4/9.0 MB
16:30:24 [2026-10-30T15:30:24.096Z] Progress (1): 8.4/9.0 MB
16:30:24 [2026-10-30T15:30:24.096Z] Progress (1): 8.4/9.0 MB
16:30:24 [2026-10-30T15:30:24.096Z] Progress (1): 8.4/9.0 MB
16:30:24 [2026-10-30T15:30:24.096Z] Progress (1): 8.4/9.0 MB
16:30:24 [2026-10-30T15:30:24.096Z] Progress (1): 8.4/9.0 MB
16:30:24 [2026-10-30T15:30:24.096Z] Progress (1): 8.4/9.0 MB
16:30:24 [2026-10-30T15:30:24.096Z] Progress (1): 8.4/9.0 MB
16:30:24 [2026-10-30T15:30:24.096Z] Progress (1): 8.4/9.0 MB
16:30:24 [2026-10-30T15:30:24.096Z] Progress (1): 8.4/9.0 MB
16:30:24 [2026-10-30T15:30:24.096Z] Progress (1): 8.4/9.0 MB
16:30:24 [2026-10-30T15:30:24.096Z] Progress (1): 8.4/9.0 MB
16:30:24 [2026-10-30T15:30:24.096Z] Progress (1): 8.4/9.0 MB
16:30:24 [2026-10-30T15:30:24.096Z] Progress (1): 8.4/9.0 MB
16:30:24 [2026-10-30T15:30:24.096Z] Progress (1): 8.4/9.0 MB
16:30:24 [2026-10-30T15:30:24.096Z] Progress (1): 8.5/9.0 MB
16:30:24 [2026-10-30T15:30:24.096Z] Progress (1): 8.5/9.0 MB
16:30:24 [2026-10-30T15:30:24.096Z] Progress (1): 8.5/9.0 MB
16:30:24 [2026-10-30T15:30:24.096Z] Progress (1): 8.5/9.0 MB
16:30:24 [2026-10-30T15:30:24.096Z] Progress (1): 8.5/9.0 MB
16:30:24 [2026-10-30T15:30:24.096Z] Progress (1): 8.5/9.0 MB
16:30:24 [2026-10-30T15:30:24.096Z] Progress (1): 8.5/9.0 MB
16:30:24 [2026-10-30T15:30:24.096Z] Progress (1): 8.5/9.0 MB
16:30:24 [2026-10-30T15:30:24.096Z] Progress (1): 8.5/9.0 MB
16:30:24 [2026-10-30T15:30:24.096Z] Progress (1): 8.5/9.0 MB
16:30:24 [2026-10-30T15:30:24.096Z] Progress (1): 8.5/9.0 MB
16:30:24 [2026-10-30T15:30:24.096Z] Progress (1): 8.5/9.0 MB
16:30:24 [2026-10-30T15:30:24.097Z] Progress (1): 8.5/9.0 MB
16:30:24 [2026-10-30T15:30:24.097Z] Progress (1): 8.5/9.0 MB
16:30:24 [2026-10-30T15:30:24.097Z] Progress (1): 8.5/9.0 MB
16:30:24 [2026-10-30T15:30:24.097Z] Progress (1): 8.5/9.0 MB
16:30:24 [2026-10-30T15:30:24.097Z] Progress (1): 8.5/9.0 MB
16:30:24 [2026-10-30T15:30:24.097Z] Progress (1): 8.5/9.0 MB
16:30:24 [2026-10-30T15:30:24.097Z] Progress (1): 8.5/9.0 MB
16:30:24 [2026-10-30T15:30:24.097Z] Progress (1): 8.6/9.0 MB
16:30:24 [2026-10-30T15:30:24.097Z] Progress (1): 8.6/9.0 MB
16:30:24 [2026-10-30T15:30:24.097Z] Progress (1): 8.6/9.0 MB
16:30:24 [2026-10-30T15:30:24.097Z] Progress (1): 8.6/9.0 MB
16:30:24 [2026-10-30T15:30:24.097Z] Progress (1): 8.6/9.0 MB
16:30:24 [2026-10-30T15:30:24.097Z] Progress (1): 8.6/9.0 MB
16:30:24 [2026-10-30T15:30:24.097Z] Progress (1): 8.6/9.0 MB
16:30:24 [2026-10-30T15:30:24.097Z] Progress (1): 8.6/9.0 MB
16:30:24 [2026-10-30T15:30:24.097Z] Progress (1): 8.6/9.0 MB
16:30:24 [2026-10-30T15:30:24.097Z] Progress (1): 8.6/9.0 MB
16:30:24 [2026-10-30T15:30:24.097Z] Progress (1): 8.6/9.0 MB
16:30:24 [2026-10-30T15:30:24.097Z] Progress (1): 8.6/9.0 MB
16:30:24 [2026-10-30T15:30:24.097Z] Progress (1): 8.6/9.0 MB
16:30:24 [2026-10-30T15:30:24.097Z] Progress (1): 8.6/9.0 MB
16:30:24 [2026-10-30T15:30:24.097Z] Progress (1): 8.6/9.0 MB
16:30:24 [2026-10-30T15:30:24.097Z] Progress (1): 8.6/9.0 MB
16:30:24 [2026-10-30T15:30:24.097Z] Progress (1): 8.6/9.0 MB
16:30:24 [2026-10-30T15:30:24.097Z] Progress (1): 8.6/9.0 MB
16:30:24 [2026-10-30T15:30:24.097Z] Progress (1): 8.7/9.0 MB
16:30:24 [2026-10-30T15:30:24.097Z] Progress (1): 8.7/9.0 MB
16:30:24 [2026-10-30T15:30:24.097Z] Progress (1): 8.7/9.0 MB
16:30:24 [2026-10-30T15:30:24.097Z] Progress (1): 8.7/9.0 MB
16:30:24 [2026-10-30T15:30:24.097Z] Progress (1): 8.7/9.0 MB
16:30:24 [2026-10-30T15:30:24.097Z] Progress (1): 8.7/9.0 MB
16:30:24 [2026-10-30T15:30:24.097Z] Progress (1): 8.7/9.0 MB
16:30:24 [2026-10-30T15:30:24.097Z] Progress (1): 8.7/9.0 MB
16:30:24 [2026-10-30T15:30:24.097Z] Progress (1): 8.7/9.0 MB
16:30:24 [2026-10-30T15:30:24.097Z] Progress (1): 8.7/9.0 MB
16:30:24 [2026-10-30T15:30:24.097Z] Progress (1): 8.7/9.0 MB
16:30:24 [2026-10-30T15:30:24.097Z] Progress (1): 8.7/9.0 MB
16:30:24 [2026-10-30T15:30:24.097Z] Progress (1): 8.7/9.0 MB
16:30:24 [2026-10-30T15:30:24.097Z] Progress (1): 8.7/9.0 MB
16:30:24 [2026-10-30T15:30:24.097Z] Progress (1): 8.7/9.0 MB
16:30:24 [2026-10-30T15:30:24.097Z] Progress (1): 8.7/9.0 MB
16:30:24 [2026-10-30T15:30:24.097Z] Progress (1): 8.7/9.0 MB
16:30:24 [2026-10-30T15:30:24.097Z] Progress (1): 8.7/9.0 MB
16:30:24 [2026-10-30T15:30:24.097Z] Progress (1): 8.7/9.0 MB
16:30:24 [2026-10-30T15:30:24.097Z] Progress (1): 8.7/9.0 MB
16:30:24 [2026-10-30T15:30:24.097Z] Progress (1): 8.8/9.0 MB
16:30:24 [2026-10-30T15:30:24.097Z] Progress (1): 8.8/9.0 MB
16:30:24 [2026-10-30T15:30:24.097Z] Progress (1): 8.8/9.0 MB
16:30:24 [2026-10-30T15:30:24.097Z] Progress (1): 8.8/9.0 MB
16:30:24 [2026-10-30T15:30:24.097Z] Progress (1): 8.8/9.0 MB
16:30:24 [2026-10-30T15:30:24.097Z] Progress (1): 8.8/9.0 MB
16:30:24 [2026-10-30T15:30:24.097Z] Progress (1): 8.8/9.0 MB
16:30:24 [2026-10-30T15:30:24.097Z] Progress (1): 8.8/9.0 MB
16:30:24 [2026-10-30T15:30:24.097Z] Progress (1): 8.8/9.0 MB
16:30:24 [2026-10-30T15:30:24.097Z] Progress (1): 8.8/9.0 MB
16:30:24 [2026-10-30T15:30:24.097Z] Progress (1): 8.8/9.0 MB
16:30:24 [2026-10-30T15:30:24.097Z] Progress (1): 8.8/9.0 MB
16:30:24 [2026-10-30T15:30:24.097Z] Progress (1): 8.8/9.0 MB
16:30:24 [2026-10-30T15:30:24.097Z] Progress (1): 8.8/9.0 MB
16:30:24 [2026-10-30T15:30:24.097Z] Progress (1): 8.8/9.0 MB
16:30:24 [2026-10-30T15:30:24.097Z] Progress (1): 8.8/9.0 MB
16:30:24 [2026-10-30T15:30:24.097Z] Progress (1): 8.8/9.0 MB
16:30:24 [2026-10-30T15:30:24.097Z] Progress (1): 8.8/9.0 MB
16:30:24 [2026-10-30T15:30:24.097Z] Progress (1): 8.9/9.0 MB
16:30:24 [2026-10-30T15:30:24.097Z] Progress (1): 8.9/9.0 MB
16:30:24 [2026-10-30T15:30:24.097Z] Progress (1): 8.9/9.0 MB
16:30:24 [2026-10-30T15:30:24.097Z] Progress (1): 8.9/9.0 MB
16:30:24 [2026-10-30T15:30:24.097Z] Progress (1): 8.9/9.0 MB
16:30:24 [2026-10-30T15:30:24.097Z] Progress (1): 8.9/9.0 MB
16:30:24 [2026-10-30T15:30:24.097Z] Progress (1): 8.9/9.0 MB
16:30:24 [2026-10-30T15:30:24.097Z] Progress (1): 8.9/9.0 MB
16:30:24 [2026-10-30T15:30:24.097Z] Progress (1): 8.9/9.0 MB
16:30:24 [2026-10-30T15:30:24.097Z] Progress (1): 8.9/9.0 MB
16:30:24 [2026-10-30T15:30:24.097Z] Progress (1): 8.9/9.0 MB
16:30:24 [2026-10-30T15:30:24.097Z] Progress (1): 8.9/9.0 MB
16:30:24 [2026-10-30T15:30:24.097Z] Progress (1): 8.9/9.0 MB
16:30:24 [2026-10-30T15:30:24.097Z] Progress (1): 8.9/9.0 MB
16:30:24 [2026-10-30T15:30:24.097Z] Progress (1): 8.9/9.0 MB
16:30:24 [2026-10-30T15:30:24.097Z] Progress (1): 8.9/9.0 MB
16:30:24 [2026-10-30T15:30:24.097Z] Progress (1): 8.9/9.0 MB
16:30:24 [2026-10-30T15:30:24.097Z] Progress (1): 8.9/9.0 MB
16:30:24 [2026-10-30T15:30:24.097Z] Progress (1): 9.0/9.0 MB
16:30:24 [2026-10-30T15:30:24.097Z] Progress (1): 9.0/9.0 MB
16:30:24 [2026-10-30T15:30:24.097Z] Progress (1): 9.0/9.0 MB
16:30:24 [2026-10-30T15:30:24.097Z] Progress (1): 9.0/9.0 MB
16:30:24 [2026-10-30T15:30:24.097Z] Progress (1): 9.0/9.0 MB
16:30:24 [2026-10-30T15:30:24.097Z] Progress (1): 9.0/9.0 MB
16:30:24 [2026-10-30T15:30:24.097Z] Progress (1): 9.0/9.0 MB
16:30:24 [2026-10-30T15:30:24.097Z] Progress (1): 9.0/9.0 MB
16:30:24 [2026-10-30T15:30:24.097Z] Progress (1): 9.0/9.0 MB
16:30:24 [2026-10-30T15:30:24.097Z] Progress (1): 9.0/9.0 MB
16:30:24 [2026-10-30T15:30:24.097Z] Progress (1): 9.0/9.0 MB
16:30:24 [2026-10-30T15:30:24.097Z] Progress (1): 9.0/9.0 MB
16:30:24 [2026-10-30T15:30:24.097Z] Progress (1): 9.0/9.0 MB
16:30:24 [2026-10-30T15:30:24.097Z] Progress (1): 9.0 MB
16:30:24 [2026-10-30T15:30:24.097Z]
16:30:24 [2026-10-30T15:30:24.097Z] Downloaded from Silverpeas: https://nexus3.silverpeas.org/repository/silverpeas/net/bytebuddy/byte-buddy/1.17.7/byte-buddy-1.17.7.jar (9.0 MB at 33 MB/s)
16:30:24 [2026-10-30T15:30:24.097Z] [INFO]
16:30:24 [2026-10-30T15:30:24.097Z] [INFO] --- clean:3.2.0:clean (default-clean) @ silverpeas-kernel-test ---
16:30:24 [2026-10-30T15:30:24.097Z] [INFO]
16:30:24 [2026-10-30T15:30:24.097Z] [INFO] --- git-commit-id:4.9.10:revision (default) @ silverpeas-kernel-test ---
16:30:24 [2026-10-30T15:30:24.647Z] [INFO]
16:30:24 [2026-10-30T15:30:24.647Z] [INFO] --- jacoco:0.8.8:prepare-agent (default) @ silverpeas-kernel-test ---
16:30:24 [2026-10-30T15:30:24.647Z] [INFO] argLine set to -javaagent:/home/silverbuild/.m2/repository/org/jacoco/org.jacoco.agent/0.8.8/org.jacoco.agent-0.8.8-runtime.jar=destfile=/var/lib/jenkins/workspace/Silverpeas_Kernel_AutoDeploy/kernel-test/target/jacoco.exec
16:30:24 [2026-10-30T15:30:24.647Z] [INFO]
16:30:24 [2026-10-30T15:30:24.647Z] [INFO] --- resources:3.3.0:resources (default-resources) @ silverpeas-kernel-test ---
16:30:24 [2026-10-30T15:30:24.647Z] [INFO] Copying 4 resources
16:30:24 [2026-10-30T15:30:24.647Z] [INFO]
16:30:24 [2026-10-30T15:30:24.647Z] [INFO] --- compiler:3.10.1:compile (default-compile) @ silverpeas-kernel-test ---
16:30:24 [2026-10-30T15:30:24.647Z] [INFO] Changes detected - recompiling the module!
16:30:24 [2026-10-30T15:30:24.647Z] [INFO] Compiling 24 source files to /var/lib/jenkins/workspace/Silverpeas_Kernel_AutoDeploy/kernel-test/target/classes
16:30:25 [2026-10-30T15:30:25.198Z] [WARNING] unknown enum constant When.ALWAYS
16:30:25 [2026-10-30T15:30:25.198Z] [INFO]
16:30:25 [2026-10-30T15:30:25.198Z] [INFO] --- resources:3.3.0:testResources (default-testResources) @ silverpeas-kernel-test ---
16:30:25 [2026-10-30T15:30:25.198Z] [INFO] skip non existing resourceDirectory /var/lib/jenkins/workspace/Silverpeas_Kernel_AutoDeploy/kernel-test/src/test/resources
16:30:25 [2026-10-30T15:30:25.198Z] [INFO] skip non existing resourceDirectory /var/lib/jenkins/workspace/Silverpeas_Kernel_AutoDeploy/kernel-test/src/test/resources
16:30:25 [2026-10-30T15:30:25.198Z] [INFO]
16:30:25 [2026-10-30T15:30:25.198Z] [INFO] --- compiler:3.10.1:testCompile (default-testCompile) @ silverpeas-kernel-test ---
16:30:25 [2026-10-30T15:30:25.198Z] [INFO] Changes detected - recompiling the module!
16:30:25 [2026-10-30T15:30:25.198Z] [INFO] Compiling 16 source files to /var/lib/jenkins/workspace/Silverpeas_Kernel_AutoDeploy/kernel-test/target/test-classes
16:30:25 [2026-10-30T15:30:25.448Z] [INFO]
16:30:25 [2026-10-30T15:30:25.448Z] [INFO] --- surefire:2.22.2:test (default-test) @ silverpeas-kernel-test ---
16:30:25 [2026-10-30T15:30:25.448Z] [INFO]
16:30:25 [2026-10-30T15:30:25.448Z] [INFO] -------------------------------------------------------
16:30:25 [2026-10-30T15:30:25.448Z] [INFO] T E S T S
16:30:25 [2026-10-30T15:30:25.448Z] [INFO] -------------------------------------------------------
16:30:26 [2026-10-30T15:30:26.792Z] [INFO] Running org.silverpeas.kernel.test.extension.InjectFieldTest
16:30:27 [2026-10-30T15:30:27.043Z] [INFO] Tests run: 2, Failures: 0, Errors: 0, Skipped: 0, Time elapsed: 0.097 s - in org.silverpeas.kernel.test.extension.InjectFieldTest
16:30:27 [2026-10-30T15:30:27.043Z] [INFO] Running org.silverpeas.kernel.test.extension.ManagedBeanFieldTest
16:30:27 [2026-10-30T15:30:27.043Z] Mockito is currently self-attaching to enable the inline-mock-maker. This will no longer work in future releases of the JDK. Please add Mockito as an agent to your build as described in Mockito's documentation: https://javadoc.io/doc/org.mockito/mockito-core/latest/org.mockito/org/mockito/Mockito.html#0.3
16:30:27 [2026-10-30T15:30:27.043Z] java.lang.instrument.IllegalClassFormatException: Error while instrumenting com/sun/tools/attach/VirtualMachine with JaCoCo 0.8.8.202204050719/5dcf34a.
16:30:27 [2026-10-30T15:30:27.043Z] at org.jacoco.agent.rt.internal_b6258fc.CoverageTransformer.transform(CoverageTransformer.java:94)
16:30:27 [2026-10-30T15:30:27.043Z] at java.instrument/java.lang.instrument.ClassFileTransformer.transform(ClassFileTransformer.java:244)
16:30:27 [2026-10-30T15:30:27.043Z] at java.instrument/sun.instrument.TransformerManager.transform(TransformerManager.java:188)
16:30:27 [2026-10-30T15:30:27.043Z] at java.instrument/sun.instrument.InstrumentationImpl.transform(InstrumentationImpl.java:610)
16:30:27 [2026-10-30T15:30:27.043Z] at java.base/java.lang.ClassLoader.defineClass2(Native Method)
16:30:27 [2026-10-30T15:30:27.043Z] at java.base/java.lang.ClassLoader.defineClass(ClassLoader.java:1118)
16:30:27 [2026-10-30T15:30:27.043Z] at java.base/java.security.SecureClassLoader.defineClass(SecureClassLoader.java:182)
16:30:27 [2026-10-30T15:30:27.043Z] at java.base/jdk.internal.loader.BuiltinClassLoader.defineClass(BuiltinClassLoader.java:821)
16:30:27 [2026-10-30T15:30:27.043Z] at java.base/jdk.internal.loader.BuiltinClassLoader.findClassInModuleOrNull(BuiltinClassLoader.java:741)
16:30:27 [2026-10-30T15:30:27.043Z] at java.base/jdk.internal.loader.BuiltinClassLoader.loadClassOrNull(BuiltinClassLoader.java:665)
16:30:27 [2026-10-30T15:30:27.043Z] at java.base/jdk.internal.loader.BuiltinClassLoader.loadClass(BuiltinClassLoader.java:639)
16:30:27 [2026-10-30T15:30:27.043Z] at java.base/jdk.internal.loader.ClassLoaders$AppClassLoader.loadClass(ClassLoaders.java:188)
16:30:27 [2026-10-30T15:30:27.043Z] at java.base/java.lang.ClassLoader.loadClass(ClassLoader.java:526)
16:30:27 [2026-10-30T15:30:27.043Z] at java.base/java.lang.Class.forName0(Native Method)
16:30:27 [2026-10-30T15:30:27.043Z] at java.base/java.lang.Class.forName(Class.java:536)
16:30:27 [2026-10-30T15:30:27.043Z] at java.base/java.lang.Class.forName(Class.java:515)
16:30:27 [2026-10-30T15:30:27.043Z] at net.bytebuddy.agent.ByteBuddyAgent$AttachmentProvider$Accessor$Simple.of(ByteBuddyAgent.java:955)
16:30:27 [2026-10-30T15:30:27.043Z] at net.bytebuddy.agent.ByteBuddyAgent$AttachmentProvider$ForModularizedVm.attempt(ByteBuddyAgent.java:1079)
16:30:27 [2026-10-30T15:30:27.043Z] at net.bytebuddy.agent.ByteBuddyAgent$AttachmentProvider$Compound.attempt(ByteBuddyAgent.java:1259)
16:30:27 [2026-10-30T15:30:27.043Z] at net.bytebuddy.agent.ByteBuddyAgent.install(ByteBuddyAgent.java:593)
16:30:27 [2026-10-30T15:30:27.043Z] at net.bytebuddy.agent.ByteBuddyAgent.install(ByteBuddyAgent.java:579)
16:30:27 [2026-10-30T15:30:27.043Z] at net.bytebuddy.agent.ByteBuddyAgent.install(ByteBuddyAgent.java:531)
16:30:27 [2026-10-30T15:30:27.043Z] at net.bytebuddy.agent.ByteBuddyAgent.install(ByteBuddyAgent.java:508)
16:30:27 [2026-10-30T15:30:27.043Z] at org.mockito.internal.PremainAttachAccess.getInstrumentation(PremainAttachAccess.java:80)
16:30:27 [2026-10-30T15:30:27.043Z] at org.mockito.internal.creation.bytebuddy.InlineDelegateByteBuddyMockMaker.<clinit>(InlineDelegateByteBuddyMockMaker.java:138)
16:30:27 [2026-10-30T15:30:27.043Z] at org.mockito.internal.creation.bytebuddy.InlineByteBuddyMockMaker.<init>(InlineByteBuddyMockMaker.java:23)
16:30:27 [2026-10-30T15:30:27.043Z] at java.base/jdk.internal.reflect.DirectConstructorHandleAccessor.newInstance(DirectConstructorHandleAccessor.java:62)
16:30:27 [2026-10-30T15:30:27.043Z] at java.base/java.lang.reflect.Constructor.newInstanceWithCaller(Constructor.java:502)
16:30:27 [2026-10-30T15:30:27.043Z] at java.base/java.lang.reflect.Constructor.newInstance(Constructor.java:486)
16:30:27 [2026-10-30T15:30:27.043Z] at org.mockito.internal.configuration.plugins.DefaultMockitoPlugins.create(DefaultMockitoPlugins.java:103)
16:30:27 [2026-10-30T15:30:27.043Z] at org.mockito.internal.configuration.plugins.DefaultMockitoPlugins.getDefaultPlugin(DefaultMockitoPlugins.java:79)
16:30:27 [2026-10-30T15:30:27.043Z] at org.mockito.internal.configuration.plugins.PluginLoader.loadPlugin(PluginLoader.java:75)
16:30:27 [2026-10-30T15:30:27.043Z] at org.mockito.internal.configuration.plugins.PluginLoader.loadPlugin(PluginLoader.java:49)
16:30:27 [2026-10-30T15:30:27.043Z] at org.mockito.internal.configuration.plugins.PluginRegistry.<init>(PluginRegistry.java:29)
16:30:27 [2026-10-30T15:30:27.043Z] at org.mockito.internal.configuration.plugins.Plugins.<clinit>(Plugins.java:26)
16:30:27 [2026-10-30T15:30:27.043Z] at org.mockito.internal.util.MockUtil.<clinit>(MockUtil.java:32)
16:30:27 [2026-10-30T15:30:27.043Z] at org.silverpeas.kernel.test.extension.SilverTestEnv.registerInBeanContainer(SilverTestEnv.java:399)
16:30:27 [2026-10-30T15:30:27.043Z] at org.silverpeas.kernel.test.extension.SilverTestEnv.registerFieldBean(SilverTestEnv.java:357)
16:30:27 [2026-10-30T15:30:27.043Z] at org.silverpeas.kernel.test.extension.SilverTestEnv.setupTestInstanceField(SilverTestEnv.java:345)
16:30:27 [2026-10-30T15:30:27.043Z] at org.silverpeas.kernel.test.extension.SilverTestEnv.processTestManagedBeanAnnotation(SilverTestEnv.java:298)
16:30:27 [2026-10-30T15:30:27.043Z] at org.silverpeas.kernel.test.extension.SilverTestEnv.lambda$postProcessTestInstance$0(SilverTestEnv.java:176)
16:30:27 [2026-10-30T15:30:27.043Z] at org.silverpeas.kernel.test.util.Reflections.loopInheritance(Reflections.java:68)
16:30:27 [2026-10-30T15:30:27.043Z] at org.silverpeas.kernel.test.extension.SilverTestEnv.postProcessTestInstance(SilverTestEnv.java:172)
16:30:27 [2026-10-30T15:30:27.043Z] at org.junit.jupiter.engine.descriptor.ClassBasedTestDescriptor.lambda$invokeTestInstancePostProcessors$12(ClassBasedTestDescriptor.java:421)
16:30:27 [2026-10-30T15:30:27.043Z] at org.junit.jupiter.engine.descriptor.ClassBasedTestDescriptor.executeAndMaskThrowable(ClassBasedTestDescriptor.java:426)
16:30:27 [2026-10-30T15:30:27.043Z] at org.junit.jupiter.engine.descriptor.ClassBasedTestDescriptor.lambda$invokeTestInstancePostProcessors$13(ClassBasedTestDescriptor.java:420)
16:30:27 [2026-10-30T15:30:27.043Z] at java.base/java.util.stream.ForEachOps$ForEachOp$OfRef.accept(ForEachOps.java:184)
16:30:27 [2026-10-30T15:30:27.043Z] at java.base/java.util.stream.ReferencePipeline$3$1.accept(ReferencePipeline.java:197)
16:30:27 [2026-10-30T15:30:27.043Z] at java.base/java.util.stream.ReferencePipeline$2$1.accept(ReferencePipeline.java:179)
16:30:27 [2026-10-30T15:30:27.043Z] at java.base/java.util.stream.ReferencePipeline$3$1.accept(ReferencePipeline.java:197)
16:30:27 [2026-10-30T15:30:27.043Z] at java.base/java.util.ArrayList$ArrayListSpliterator.forEachRemaining(ArrayList.java:1708)
16:30:27 [2026-10-30T15:30:27.043Z] at java.base/java.util.stream.AbstractPipeline.copyInto(AbstractPipeline.java:509)
16:30:27 [2026-10-30T15:30:27.043Z] at java.base/java.util.stream.AbstractPipeline.wrapAndCopyInto(AbstractPipeline.java:499)
16:30:27 [2026-10-30T15:30:27.043Z] at java.base/java.util.stream.ForEachOps$ForEachOp.evaluateSequential(ForEachOps.java:151)
16:30:27 [2026-10-30T15:30:27.043Z] at java.base/java.util.stream.ForEachOps$ForEachOp$OfRef.evaluateSequential(ForEachOps.java:174)
16:30:27 [2026-10-30T15:30:27.043Z] at java.base/java.util.stream.AbstractPipeline.evaluate(AbstractPipeline.java:234)
16:30:27 [2026-10-30T15:30:27.043Z] at java.base/java.util.stream.ReferencePipeline.forEach(ReferencePipeline.java:596)
16:30:27 [2026-10-30T15:30:27.043Z] at org.junit.jupiter.engine.descriptor.ClassBasedTestDescriptor.invokeTestInstancePostProcessors(ClassBasedTestDescriptor.java:420)
16:30:27 [2026-10-30T15:30:27.043Z] at org.junit.jupiter.engine.descriptor.ClassBasedTestDescriptor.lambda$instantiateAndPostProcessTestInstance$8(ClassBasedTestDescriptor.java:331)
16:30:27 [2026-10-30T15:30:27.043Z] at org.junit.platform.engine.support.hierarchical.ThrowableCollector.execute(ThrowableCollector.java:73)
16:30:27 [2026-10-30T15:30:27.043Z] at org.junit.jupiter.engine.descriptor.ClassBasedTestDescriptor.instantiateAndPostProcessTestInstance(ClassBasedTestDescriptor.java:330)
16:30:27 [2026-10-30T15:30:27.043Z] at org.junit.jupiter.engine.descriptor.ClassBasedTestDescriptor.lambda$testInstancesProvider$6(ClassBasedTestDescriptor.java:319)
16:30:27 [2026-10-30T15:30:27.043Z] at java.base/java.util.Optional.orElseGet(Optional.java:364)
16:30:27 [2026-10-30T15:30:27.043Z] at org.junit.jupiter.engine.descriptor.ClassBasedTestDescriptor.lambda$testInstancesProvider$7(ClassBasedTestDescriptor.java:318)
16:30:27 [2026-10-30T15:30:27.043Z] at org.junit.jupiter.engine.execution.TestInstancesProvider.getTestInstances(TestInstancesProvider.java:27)
16:30:27 [2026-10-30T15:30:27.043Z] at org.junit.jupiter.engine.descriptor.TestMethodTestDescriptor.lambda$prepare$0(TestMethodTestDescriptor.java:129)
16:30:27 [2026-10-30T15:30:27.043Z] at org.junit.platform.engine.support.hierarchical.ThrowableCollector.execute(ThrowableCollector.java:73)
16:30:27 [2026-10-30T15:30:27.043Z] at org.junit.jupiter.engine.descriptor.TestMethodTestDescriptor.prepare(TestMethodTestDescriptor.java:128)
16:30:27 [2026-10-30T15:30:27.043Z] at org.junit.jupiter.engine.descriptor.TestMethodTestDescriptor.prepare(TestMethodTestDescriptor.java:70)
16:30:27 [2026-10-30T15:30:27.043Z] at org.junit.platform.engine.support.hierarchical.NodeTestTask.lambda$prepare$2(NodeTestTask.java:129)
16:30:27 [2026-10-30T15:30:27.043Z] at org.junit.platform.engine.support.hierarchical.ThrowableCollector.execute(ThrowableCollector.java:73)
16:30:27 [2026-10-30T15:30:27.043Z] at org.junit.platform.engine.support.hierarchical.NodeTestTask.prepare(NodeTestTask.java:129)
16:30:27 [2026-10-30T15:30:27.043Z] at org.junit.platform.engine.support.hierarchical.NodeTestTask.execute(NodeTestTask.java:96)
16:30:27 [2026-10-30T15:30:27.043Z] at org.junit.platform.engine.support.hierarchical.ForkJoinPoolHierarchicalTestExecutorService$ExclusiveTask.exec(ForkJoinPoolHierarchicalTestExecutorService.java:274)
16:30:27 [2026-10-30T15:30:27.043Z] at org.junit.platform.engine.support.hierarchical.ForkJoinPoolHierarchicalTestExecutorService$ExclusiveTask.execSync(ForkJoinPoolHierarchicalTestExecutorService.java:247)
16:30:27 [2026-10-30T15:30:27.043Z] at org.junit.platform.engine.support.hierarchical.ForkJoinPoolHierarchicalTestExecutorService.executeSync(ForkJoinPoolHierarchicalTestExecutorService.java:194)
16:30:27 [2026-10-30T15:30:27.043Z] at org.junit.platform.engine.support.hierarchical.ForkJoinPoolHierarchicalTestExecutorService.invokeAll(ForkJoinPoolHierarchicalTestExecutorService.java:166)
16:30:27 [2026-10-30T15:30:27.043Z] at org.junit.platform.engine.support.hierarchical.NodeTestTask.lambda$executeRecursively$6(NodeTestTask.java:161)
16:30:27 [2026-10-30T15:30:27.043Z] at org.junit.platform.engine.support.hierarchical.ThrowableCollector.execute(ThrowableCollector.java:73)
16:30:27 [2026-10-30T15:30:27.043Z] at org.junit.platform.engine.support.hierarchical.NodeTestTask.lambda$executeRecursively$8(NodeTestTask.java:147)
16:30:27 [2026-10-30T15:30:27.043Z] at org.junit.platform.engine.support.hierarchical.Node.around(Node.java:137)
16:30:27 [2026-10-30T15:30:27.043Z] at org.junit.platform.engine.support.hierarchical.NodeTestTask.lambda$executeRecursively$9(NodeTestTask.java:145)
16:30:27 [2026-10-30T15:30:27.043Z] at org.junit.platform.engine.support.hierarchical.ThrowableCollector.execute(ThrowableCollector.java:73)
16:30:27 [2026-10-30T15:30:27.043Z] at org.junit.platform.engine.support.hierarchical.NodeTestTask.executeRecursively(NodeTestTask.java:144)
16:30:27 [2026-10-30T15:30:27.043Z] at org.junit.platform.engine.support.hierarchical.NodeTestTask.execute(NodeTestTask.java:101)
16:30:27 [2026-10-30T15:30:27.043Z] at org.junit.platform.engine.support.hierarchical.ForkJoinPoolHierarchicalTestExecutorService$ExclusiveTask.exec(ForkJoinPoolHierarchicalTestExecutorService.java:274)
16:30:27 [2026-10-30T15:30:27.043Z] at org.junit.platform.engine.support.hierarchical.ForkJoinPoolHierarchicalTestExecutorService$ExclusiveTask.execSync(ForkJoinPoolHierarchicalTestExecutorService.java:247)
16:30:27 [2026-10-30T15:30:27.043Z] at org.junit.platform.engine.support.hierarchical.ForkJoinPoolHierarchicalTestExecutorService.executeSync(ForkJoinPoolHierarchicalTestExecutorService.java:194)
16:30:27 [2026-10-30T15:30:27.043Z] at org.junit.platform.engine.support.hierarchical.ForkJoinPoolHierarchicalTestExecutorService.invokeAll(ForkJoinPoolHierarchicalTestExecutorService.java:166)
16:30:27 [2026-10-30T15:30:27.043Z] at org.junit.platform.engine.support.hierarchical.NodeTestTask.lambda$executeRecursively$6(NodeTestTask.java:161)
16:30:27 [2026-10-30T15:30:27.043Z] at org.junit.platform.engine.support.hierarchical.ThrowableCollector.execute(ThrowableCollector.java:73)
16:30:27 [2026-10-30T15:30:27.043Z] at org.junit.platform.engine.support.hierarchical.NodeTestTask.lambda$executeRecursively$8(NodeTestTask.java:147)
16:30:27 [2026-10-30T15:30:27.043Z] at org.junit.platform.engine.support.hierarchical.Node.around(Node.java:137)
16:30:27 [2026-10-30T15:30:27.043Z] at org.junit.platform.engine.support.hierarchical.NodeTestTask.lambda$executeRecursively$9(NodeTestTask.java:145)
16:30:27 [2026-10-30T15:30:27.043Z] at org.junit.platform.engine.support.hierarchical.ThrowableCollector.execute(ThrowableCollector.java:73)
16:30:27 [2026-10-30T15:30:27.043Z] at org.junit.platform.engine.support.hierarchical.NodeTestTask.executeRecursively(NodeTestTask.java:144)
16:30:27 [2026-10-30T15:30:27.043Z] at org.junit.platform.engine.support.hierarchical.NodeTestTask.execute(NodeTestTask.java:101)
16:30:27 [2026-10-30T15:30:27.043Z] at org.junit.platform.engine.support.hierarchical.ForkJoinPoolHierarchicalTestExecutorService$ExclusiveTask.exec(ForkJoinPoolHierarchicalTestExecutorService.java:274)
16:30:27 [2026-10-30T15:30:27.043Z] at java.base/java.util.concurrent.ForkJoinTask.doExec(ForkJoinTask.java:387)
16:30:27 [2026-10-30T15:30:27.043Z] at java.base/java.util.concurrent.ForkJoinPool$WorkQueue.topLevelExec(ForkJoinPool.java:1312)
16:30:27 [2026-10-30T15:30:27.043Z] at java.base/java.util.concurrent.ForkJoinPool.scan(ForkJoinPool.java:1843)
16:30:27 [2026-10-30T15:30:27.043Z] at java.base/java.util.concurrent.ForkJoinPool.runWorker(ForkJoinPool.java:1808)
16:30:27 [2026-10-30T15:30:27.043Z] at java.base/java.util.concurrent.ForkJoinWorkerThread.run(ForkJoinWorkerThread.java:188)
16:30:27 [2026-10-30T15:30:27.043Z] Caused by: java.io.IOException: Error while instrumenting com/sun/tools/attach/VirtualMachine with JaCoCo 0.8.8.202204050719/5dcf34a.
16:30:27 [2026-10-30T15:30:27.043Z] at org.jacoco.agent.rt.internal_b6258fc.core.instr.Instrumenter.instrumentError(Instrumenter.java:161)
16:30:27 [2026-10-30T15:30:27.043Z] at org.jacoco.agent.rt.internal_b6258fc.core.instr.Instrumenter.instrument(Instrumenter.java:111)
16:30:27 [2026-10-30T15:30:27.043Z] at org.jacoco.agent.rt.internal_b6258fc.CoverageTransformer.transform(CoverageTransformer.java:92)
16:30:27 [2026-10-30T15:30:27.043Z] ... 102 more
16:30:27 [2026-10-30T15:30:27.043Z] Caused by: java.lang.IllegalArgumentException: Unsupported class file major version 65
16:30:27 [2026-10-30T15:30:27.043Z] at org.jacoco.agent.rt.internal_b6258fc.asm.ClassReader.<init>(ClassReader.java:199)
16:30:27 [2026-10-30T15:30:27.043Z] at org.jacoco.agent.rt.internal_b6258fc.asm.ClassReader.<init>(ClassReader.java:180)
16:30:27 [2026-10-30T15:30:27.043Z] at org.jacoco.agent.rt.internal_b6258fc.asm.ClassReader.<init>(ClassReader.java:166)
16:30:27 [2026-10-30T15:30:27.043Z] at org.jacoco.agent.rt.internal_b6258fc.core.internal.instr.InstrSupport.classReaderFor(InstrSupport.java:280)
16:30:27 [2026-10-30T15:30:27.043Z] at org.jacoco.agent.rt.internal_b6258fc.core.instr.Instrumenter.instrument(Instrumenter.java:77)
16:30:27 [2026-10-30T15:30:27.043Z] at org.jacoco.agent.rt.internal_b6258fc.core.instr.Instrumenter.instrument(Instrumenter.java:109)
16:30:27 [2026-10-30T15:30:27.043Z] ... 103 more
16:30:27 [2026-10-30T15:30:27.294Z] WARNING: A Java agent has been loaded dynamically (/home/silverbuild/.m2/repository/net/bytebuddy/byte-buddy-agent/1.17.7/byte-buddy-agent-1.17.7.jar)
16:30:27 [2026-10-30T15:30:27.294Z] WARNING: If a serviceability tool is in use, please run with -XX:+EnableDynamicAgentLoading to hide this warning
16:30:27 [2026-10-30T15:30:27.294Z] WARNING: If a serviceability tool is not in use, please run with -Djdk.instrument.traceUsage for more information
16:30:27 [2026-10-30T15:30:27.294Z] WARNING: Dynamic loading of agents will be disallowed by default in a future release
16:30:28 [2026-10-30T15:30:28.205Z] [INFO] Tests run: 2, Failures: 0, Errors: 0, Skipped: 0, Time elapsed: 1.258 s - in org.silverpeas.kernel.test.extension.ManagedBeanFieldTest
16:30:28 [2026-10-30T15:30:28.205Z] [INFO] Running org.silverpeas.kernel.test.extension.ManagedMockParameterTest
16:30:28 [2026-10-30T15:30:28.755Z] [INFO] Tests run: 2, Failures: 0, Errors: 0, Skipped: 0, Time elapsed: 0.364 s - in org.silverpeas.kernel.test.extension.ManagedMockParameterTest
16:30:28 [2026-10-30T15:30:28.755Z] [INFO] Running org.silverpeas.kernel.test.extension.ManagedMockFieldTest
16:30:28 [2026-10-30T15:30:28.755Z] [INFO] Tests run: 2, Failures: 0, Errors: 0, Skipped: 0, Time elapsed: 0.107 s - in org.silverpeas.kernel.test.extension.ManagedMockFieldTest
16:30:28 [2026-10-30T15:30:28.755Z] [INFO] Running org.silverpeas.kernel.test.extension.ManagedMocksTest
16:30:28 [2026-10-30T15:30:28.755Z] [INFO] Tests run: 4, Failures: 0, Errors: 0, Skipped: 0, Time elapsed: 0.059 s - in org.silverpeas.kernel.test.extension.ManagedMocksTest
16:30:28 [2026-10-30T15:30:28.755Z] [INFO] Running org.silverpeas.kernel.test.extension.ManagedBeanParameterTest
16:30:28 [2026-10-30T15:30:28.755Z] [INFO] Tests run: 2, Failures: 0, Errors: 0, Skipped: 0, Time elapsed: 0.012 s - in org.silverpeas.kernel.test.extension.ManagedBeanParameterTest
16:30:28 [2026-10-30T15:30:28.755Z] [INFO] Running org.silverpeas.kernel.test.extension.ManagedBeansTest
16:30:28 [2026-10-30T15:30:28.755Z] [INFO] Tests run: 4, Failures: 0, Errors: 0, Skipped: 0, Time elapsed: 0.015 s - in org.silverpeas.kernel.test.extension.ManagedBeansTest
16:30:28 [2026-10-30T15:30:28.755Z] [INFO] Running org.silverpeas.kernel.test.extension.ValuatedManagedBeanFieldTest
16:30:28 [2026-10-30T15:30:28.755Z] [INFO] Tests run: 2, Failures: 0, Errors: 0, Skipped: 0, Time elapsed: 0.008 s - in org.silverpeas.kernel.test.extension.ValuatedManagedBeanFieldTest
16:30:28 [2026-10-30T15:30:28.755Z] [INFO] Running org.silverpeas.kernel.test.extension.ManagedBeanMockFieldParameterTest
16:30:28 [2026-10-30T15:30:28.755Z] [INFO] Tests run: 3, Failures: 0, Errors: 0, Skipped: 0, Time elapsed: 0.016 s - in org.silverpeas.kernel.test.extension.ManagedBeanMockFieldParameterTest
16:30:28 [2026-10-30T15:30:28.755Z] [INFO] Running org.silverpeas.kernel.test.TestBeanContainerTest
16:30:28 [2026-10-30T15:30:28.755Z] [INFO] Tests run: 13, Failures: 0, Errors: 0, Skipped: 0, Time elapsed: 0.039 s - in org.silverpeas.kernel.test.TestBeanContainerTest
16:30:28 [2026-10-30T15:30:28.755Z] [INFO] Running org.silverpeas.kernel.test.DependencyResolverTest
16:30:29 [2026-10-30T15:30:29.006Z] java.lang.instrument.IllegalClassFormatException: Error while instrumenting org/silverpeas/kernel/test/MyBean$MockitoMock$0n3lNhWJ with JaCoCo 0.8.8.202204050719/5dcf34a.
16:30:29 [2026-10-30T15:30:29.006Z] at org.jacoco.agent.rt.internal_b6258fc.CoverageTransformer.transform(CoverageTransformer.java:94)
16:30:29 [2026-10-30T15:30:29.006Z] at java.instrument/java.lang.instrument.ClassFileTransformer.transform(ClassFileTransformer.java:244)
16:30:29 [2026-10-30T15:30:29.006Z] at java.instrument/sun.instrument.TransformerManager.transform(TransformerManager.java:188)
16:30:29 [2026-10-30T15:30:29.006Z] at java.instrument/sun.instrument.InstrumentationImpl.transform(InstrumentationImpl.java:610)
16:30:29 [2026-10-30T15:30:29.006Z] at java.base/java.lang.ClassLoader.defineClass0(Native Method)
16:30:29 [2026-10-30T15:30:29.006Z] at java.base/java.lang.System$2.defineClass(System.java:2395)
16:30:29 [2026-10-30T15:30:29.006Z] at java.base/java.lang.invoke.MethodHandles$Lookup$ClassDefiner.defineClass(MethodHandles.java:2505)
16:30:29 [2026-10-30T15:30:29.006Z] at java.base/java.lang.invoke.MethodHandles$Lookup$ClassDefiner.defineClass(MethodHandles.java:2480)
16:30:29 [2026-10-30T15:30:29.006Z] at java.base/java.lang.invoke.MethodHandles$Lookup.defineClass(MethodHandles.java:1865)
16:30:29 [2026-10-30T15:30:29.006Z] at java.base/jdk.internal.reflect.DirectMethodHandleAccessor.invoke(DirectMethodHandleAccessor.java:103)
16:30:29 [2026-10-30T15:30:29.006Z] at java.base/java.lang.reflect.Method.invoke(Method.java:580)
16:30:29 [2026-10-30T15:30:29.006Z] at net.bytebuddy.utility.Invoker$Dispatcher.invoke(Unknown Source)
16:30:29 [2026-10-30T15:30:29.006Z] at net.bytebuddy.utility.dispatcher.JavaDispatcher$Dispatcher$ForNonStaticMethod.invoke(JavaDispatcher.java:1033)
16:30:29 [2026-10-30T15:30:29.006Z] at net.bytebuddy.utility.dispatcher.JavaDispatcher$ProxiedInvocationHandler.invoke(JavaDispatcher.java:1163)
16:30:29 [2026-10-30T15:30:29.006Z] at jdk.proxy2/jdk.proxy2.$Proxy75.defineClass(Unknown Source)
16:30:29 [2026-10-30T15:30:29.006Z] at net.bytebuddy.dynamic.loading.ClassInjector$UsingLookup.injectRaw(ClassInjector.java:1686)
16:30:29 [2026-10-30T15:30:29.006Z] at net.bytebuddy.dynamic.loading.ClassInjector$AbstractBase.injectRaw(ClassInjector.java:167)
16:30:29 [2026-10-30T15:30:29.006Z] at net.bytebuddy.dynamic.loading.ClassInjector$AbstractBase.inject(ClassInjector.java:155)
16:30:29 [2026-10-30T15:30:29.006Z] at net.bytebuddy.dynamic.loading.ClassLoadingStrategy$UsingLookup.load(ClassLoadingStrategy.java:519)
16:30:29 [2026-10-30T15:30:29.006Z] at net.bytebuddy.dynamic.TypeResolutionStrategy$Passive.initialize(TypeResolutionStrategy.java:101)
16:30:29 [2026-10-30T15:30:29.006Z] at net.bytebuddy.dynamic.DynamicType$Default$Unloaded.load(DynamicType.java:6432)
16:30:29 [2026-10-30T15:30:29.006Z] at org.mockito.internal.creation.bytebuddy.SubclassBytecodeGenerator.mockClass(SubclassBytecodeGenerator.java:282)
16:30:29 [2026-10-30T15:30:29.006Z] at org.mockito.internal.creation.bytebuddy.TypeCachingBytecodeGenerator.lambda$mockClass$0(TypeCachingBytecodeGenerator.java:78)
16:30:29 [2026-10-30T15:30:29.006Z] at net.bytebuddy.TypeCache.findOrInsert(TypeCache.java:168)
16:30:29 [2026-10-30T15:30:29.006Z] at net.bytebuddy.TypeCache$WithInlineExpunction.findOrInsert(TypeCache.java:399)
16:30:29 [2026-10-30T15:30:29.006Z] at net.bytebuddy.TypeCache.findOrInsert(TypeCache.java:190)
16:30:29 [2026-10-30T15:30:29.006Z] at net.bytebuddy.TypeCache$WithInlineExpunction.findOrInsert(TypeCache.java:410)
16:30:29 [2026-10-30T15:30:29.006Z] at org.mockito.internal.creation.bytebuddy.TypeCachingBytecodeGenerator.mockClass(TypeCachingBytecodeGenerator.java:75)
16:30:29 [2026-10-30T15:30:29.006Z] at org.mockito.internal.creation.bytebuddy.InlineBytecodeGenerator.mockClass(InlineBytecodeGenerator.java:223)
16:30:29 [2026-10-30T15:30:29.006Z] at org.mockito.internal.creation.bytebuddy.TypeCachingBytecodeGenerator.lambda$mockClass$0(TypeCachingBytecodeGenerator.java:78)
16:30:29 [2026-10-30T15:30:29.006Z] at net.bytebuddy.TypeCache.findOrInsert(TypeCache.java:168)
16:30:29 [2026-10-30T15:30:29.006Z] at net.bytebuddy.TypeCache$WithInlineExpunction.findOrInsert(TypeCache.java:399)
16:30:29 [2026-10-30T15:30:29.006Z] at net.bytebuddy.TypeCache.findOrInsert(TypeCache.java:190)
16:30:29 [2026-10-30T15:30:29.006Z] at net.bytebuddy.TypeCache$WithInlineExpunction.findOrInsert(TypeCache.java:410)
16:30:29 [2026-10-30T15:30:29.006Z] at org.mockito.internal.creation.bytebuddy.TypeCachingBytecodeGenerator.mockClass(TypeCachingBytecodeGenerator.java:75)
16:30:29 [2026-10-30T15:30:29.006Z] at org.mockito.internal.creation.bytebuddy.InlineDelegateByteBuddyMockMaker.createMockType(InlineDelegateByteBuddyMockMaker.java:429)
16:30:29 [2026-10-30T15:30:29.006Z] at org.mockito.internal.creation.bytebuddy.InlineDelegateByteBuddyMockMaker.doCreateMock(InlineDelegateByteBuddyMockMaker.java:388)
16:30:29 [2026-10-30T15:30:29.006Z] at org.mockito.internal.creation.bytebuddy.InlineDelegateByteBuddyMockMaker.createMock(InlineDelegateByteBuddyMockMaker.java:367)
16:30:29 [2026-10-30T15:30:29.006Z] at org.mockito.internal.creation.bytebuddy.InlineByteBuddyMockMaker.createMock(InlineByteBuddyMockMaker.java:56)
16:30:29 [2026-10-30T15:30:29.006Z] at org.mockito.internal.util.MockUtil.createMock(MockUtil.java:99)
16:30:29 [2026-10-30T15:30:29.006Z] at org.mockito.internal.MockitoCore.mock(MockitoCore.java:84)
16:30:29 [2026-10-30T15:30:29.006Z] at org.mockito.Mockito.mock(Mockito.java:2198)
16:30:29 [2026-10-30T15:30:29.006Z] at org.mockito.Mockito.mock(Mockito.java:2113)
16:30:29 [2026-10-30T15:30:29.006Z] at org.silverpeas.kernel.test.DependencyResolver.resolveDependency(DependencyResolver.java:155)
16:30:29 [2026-10-30T15:30:29.006Z] at org.silverpeas.kernel.test.DependencyResolver.lambda$resolve$1(DependencyResolver.java:105)
16:30:29 [2026-10-30T15:30:29.006Z] at java.base/java.util.Optional.orElseGet(Optional.java:364)
16:30:29 [2026-10-30T15:30:29.006Z] at org.silverpeas.kernel.test.DependencyResolver.lambda$resolve$2(DependencyResolver.java:105)
16:30:29 [2026-10-30T15:30:29.006Z] at java.base/java.util.stream.ForEachOps$ForEachOp$OfRef.accept(ForEachOps.java:184)
16:30:29 [2026-10-30T15:30:29.006Z] at java.base/java.util.stream.ReferencePipeline$2$1.accept(ReferencePipeline.java:179)
16:30:29 [2026-10-30T15:30:29.006Z] at java.base/java.util.Spliterators$ArraySpliterator.forEachRemaining(Spliterators.java:1024)
16:30:29 [2026-10-30T15:30:29.006Z] at java.base/java.util.stream.AbstractPipeline.copyInto(AbstractPipeline.java:509)
16:30:29 [2026-10-30T15:30:29.006Z] at java.base/java.util.stream.AbstractPipeline.wrapAndCopyInto(AbstractPipeline.java:499)
16:30:29 [2026-10-30T15:30:29.006Z] at java.base/java.util.stream.ForEachOps$ForEachOp.evaluateSequential(ForEachOps.java:151)
16:30:29 [2026-10-30T15:30:29.006Z] at java.base/java.util.stream.ForEachOps$ForEachOp$OfRef.evaluateSequential(ForEachOps.java:174)
16:30:29 [2026-10-30T15:30:29.006Z] at java.base/java.util.stream.AbstractPipeline.evaluate(AbstractPipeline.java:234)
16:30:29 [2026-10-30T15:30:29.006Z] at java.base/java.util.stream.ReferencePipeline.forEach(ReferencePipeline.java:596)
16:30:29 [2026-10-30T15:30:29.006Z] at org.silverpeas.kernel.test.DependencyResolver.lambda$resolve$3(DependencyResolver.java:102)
16:30:29 [2026-10-30T15:30:29.006Z] at org.silverpeas.kernel.test.util.Reflections.loopInheritance(Reflections.java:68)
16:30:29 [2026-10-30T15:30:29.006Z] at org.silverpeas.kernel.test.DependencyResolver.resolve(DependencyResolver.java:98)
16:30:29 [2026-10-30T15:30:29.006Z] at org.silverpeas.kernel.test.DependencyResolverTest.genericInjectionIsMockedWhenNoManagedBeanIsAvailable(DependencyResolverTest.java:67)
16:30:29 [2026-10-30T15:30:29.006Z] at java.base/jdk.internal.reflect.DirectMethodHandleAccessor.invoke(DirectMethodHandleAccessor.java:103)
16:30:29 [2026-10-30T15:30:29.006Z] at java.base/java.lang.reflect.Method.invoke(Method.java:580)
16:30:29 [2026-10-30T15:30:29.006Z] at org.junit.platform.commons.util.ReflectionUtils.invokeMethod(ReflectionUtils.java:787)
16:30:29 [2026-10-30T15:30:29.006Z] at org.junit.platform.commons.support.ReflectionSupport.invokeMethod(ReflectionSupport.java:478)
16:30:29 [2026-10-30T15:30:29.006Z] at org.junit.jupiter.engine.execution.MethodInvocation.proceed(MethodInvocation.java:60)
16:30:29 [2026-10-30T15:30:29.006Z] at org.junit.jupiter.engine.execution.InvocationInterceptorChain$ValidatingInvocation.proceed(InvocationInterceptorChain.java:131)
16:30:29 [2026-10-30T15:30:29.006Z] at org.junit.jupiter.engine.extension.TimeoutExtension.intercept(TimeoutExtension.java:161)
16:30:29 [2026-10-30T15:30:29.006Z] at org.junit.jupiter.engine.extension.TimeoutExtension.interceptTestableMethod(TimeoutExtension.java:152)
16:30:29 [2026-10-30T15:30:29.006Z] at org.junit.jupiter.engine.extension.TimeoutExtension.interceptTestMethod(TimeoutExtension.java:91)
16:30:29 [2026-10-30T15:30:29.006Z] at org.junit.jupiter.engine.execution.InterceptingExecutableInvoker$ReflectiveInterceptorCall.lambda$ofVoidMethod$0(InterceptingExecutableInvoker.java:112)
16:30:29 [2026-10-30T15:30:29.006Z] at org.junit.jupiter.engine.execution.InterceptingExecutableInvoker.lambda$invoke$0(InterceptingExecutableInvoker.java:94)
16:30:29 [2026-10-30T15:30:29.006Z] at org.junit.jupiter.engine.execution.InvocationInterceptorChain$InterceptedInvocation.proceed(InvocationInterceptorChain.java:106)
16:30:29 [2026-10-30T15:30:29.006Z] at org.junit.jupiter.engine.execution.InvocationInterceptorChain.proceed(InvocationInterceptorChain.java:64)
16:30:29 [2026-10-30T15:30:29.006Z] at org.junit.jupiter.engine.execution.InvocationInterceptorChain.chainAndInvoke(InvocationInterceptorChain.java:45)
16:30:29 [2026-10-30T15:30:29.006Z] at org.junit.jupiter.engine.execution.InvocationInterceptorChain.invoke(InvocationInterceptorChain.java:37)
16:30:29 [2026-10-30T15:30:29.006Z] at org.junit.jupiter.engine.execution.InterceptingExecutableInvoker.invoke(InterceptingExecutableInvoker.java:93)
16:30:29 [2026-10-30T15:30:29.006Z] at org.junit.jupiter.engine.execution.InterceptingExecutableInvoker.invoke(InterceptingExecutableInvoker.java:87)
16:30:29 [2026-10-30T15:30:29.006Z] at org.junit.jupiter.engine.descriptor.TestMethodTestDescriptor.lambda$invokeTestMethod$4(TestMethodTestDescriptor.java:221)
16:30:29 [2026-10-30T15:30:29.006Z] at org.junit.platform.engine.support.hierarchical.ThrowableCollector.execute(ThrowableCollector.java:73)
16:30:29 [2026-10-30T15:30:29.006Z] at org.junit.jupiter.engine.descriptor.TestMethodTestDescriptor.invokeTestMethod(TestMethodTestDescriptor.java:217)
16:30:29 [2026-10-30T15:30:29.006Z] at org.junit.jupiter.engine.descriptor.TestMethodTestDescriptor.execute(TestMethodTestDescriptor.java:159)
16:30:29 [2026-10-30T15:30:29.006Z] at org.junit.jupiter.engine.descriptor.TestMethodTestDescriptor.execute(TestMethodTestDescriptor.java:70)
16:30:29 [2026-10-30T15:30:29.006Z] at org.junit.platform.engine.support.hierarchical.NodeTestTask.lambda$executeRecursively$6(NodeTestTask.java:157)
16:30:29 [2026-10-30T15:30:29.006Z] at org.junit.platform.engine.support.hierarchical.ThrowableCollector.execute(ThrowableCollector.java:73)
16:30:29 [2026-10-30T15:30:29.006Z] at org.junit.platform.engine.support.hierarchical.NodeTestTask.lambda$executeRecursively$8(NodeTestTask.java:147)
16:30:29 [2026-10-30T15:30:29.006Z] at org.junit.platform.engine.support.hierarchical.Node.around(Node.java:137)
16:30:29 [2026-10-30T15:30:29.006Z] at org.junit.platform.engine.support.hierarchical.NodeTestTask.lambda$executeRecursively$9(NodeTestTask.java:145)
16:30:29 [2026-10-30T15:30:29.006Z] at org.junit.platform.engine.support.hierarchical.ThrowableCollector.execute(ThrowableCollector.java:73)
16:30:29 [2026-10-30T15:30:29.006Z] at org.junit.platform.engine.support.hierarchical.NodeTestTask.executeRecursively(NodeTestTask.java:144)
16:30:29 [2026-10-30T15:30:29.006Z] at org.junit.platform.engine.support.hierarchical.NodeTestTask.execute(NodeTestTask.java:101)
16:30:29 [2026-10-30T15:30:29.006Z] at org.junit.platform.engine.support.hierarchical.ForkJoinPoolHierarchicalTestExecutorService$ExclusiveTask.exec(ForkJoinPoolHierarchicalTestExecutorService.java:274)
16:30:29 [2026-10-30T15:30:29.006Z] at org.junit.platform.engine.support.hierarchical.ForkJoinPoolHierarchicalTestExecutorService$ExclusiveTask.execSync(ForkJoinPoolHierarchicalTestExecutorService.java:247)
16:30:29 [2026-10-30T15:30:29.006Z] at org.junit.platform.engine.support.hierarchical.ForkJoinPoolHierarchicalTestExecutorService.executeSync(ForkJoinPoolHierarchicalTestExecutorService.java:194)
16:30:29 [2026-10-30T15:30:29.006Z] at org.junit.platform.engine.support.hierarchical.ForkJoinPoolHierarchicalTestExecutorService.invokeAll(ForkJoinPoolHierarchicalTestExecutorService.java:166)
16:30:29 [2026-10-30T15:30:29.006Z] at org.junit.platform.engine.support.hierarchical.NodeTestTask.lambda$executeRecursively$6(NodeTestTask.java:161)
16:30:29 [2026-10-30T15:30:29.006Z] at org.junit.platform.engine.support.hierarchical.ThrowableCollector.execute(ThrowableCollector.java:73)
16:30:29 [2026-10-30T15:30:29.006Z] at org.junit.platform.engine.support.hierarchical.NodeTestTask.lambda$executeRecursively$8(NodeTestTask.java:147)
16:30:29 [2026-10-30T15:30:29.006Z] at org.junit.platform.engine.support.hierarchical.Node.around(Node.java:137)
16:30:29 [2026-10-30T15:30:29.006Z] at org.junit.platform.engine.support.hierarchical.NodeTestTask.lambda$executeRecursively$9(NodeTestTask.java:145)
16:30:29 [2026-10-30T15:30:29.006Z] at org.junit.platform.engine.support.hierarchical.ThrowableCollector.execute(ThrowableCollector.java:73)
16:30:29 [2026-10-30T15:30:29.006Z] at org.junit.platform.engine.support.hierarchical.NodeTestTask.executeRecursively(NodeTestTask.java:144)
16:30:29 [2026-10-30T15:30:29.006Z] at org.junit.platform.engine.support.hierarchical.NodeTestTask.execute(NodeTestTask.java:101)
16:30:29 [2026-10-30T15:30:29.006Z] at org.junit.platform.engine.support.hierarchical.ForkJoinPoolHierarchicalTestExecutorService$ExclusiveTask.exec(ForkJoinPoolHierarchicalTestExecutorService.java:274)
16:30:29 [2026-10-30T15:30:29.006Z] at org.junit.platform.engine.support.hierarchical.ForkJoinPoolHierarchicalTestExecutorService$ExclusiveTask.execSync(ForkJoinPoolHierarchicalTestExecutorService.java:247)
16:30:29 [2026-10-30T15:30:29.006Z] at org.junit.platform.engine.support.hierarchical.ForkJoinPoolHierarchicalTestExecutorService.executeSync(ForkJoinPoolHierarchicalTestExecutorService.java:194)
16:30:29 [2026-10-30T15:30:29.006Z] at org.junit.platform.engine.support.hierarchical.ForkJoinPoolHierarchicalTestExecutorService.invokeAll(ForkJoinPoolHierarchicalTestExecutorService.java:166)
16:30:29 [2026-10-30T15:30:29.006Z] at org.junit.platform.engine.support.hierarchical.NodeTestTask.lambda$executeRecursively$6(NodeTestTask.java:161)
16:30:29 [2026-10-30T15:30:29.006Z] at org.junit.platform.engine.support.hierarchical.ThrowableCollector.execute(ThrowableCollector.java:73)
16:30:29 [2026-10-30T15:30:29.006Z] at org.junit.platform.engine.support.hierarchical.NodeTestTask.lambda$executeRecursively$8(NodeTestTask.java:147)
16:30:29 [2026-10-30T15:30:29.006Z] at org.junit.platform.engine.support.hierarchical.Node.around(Node.java:137)
16:30:29 [2026-10-30T15:30:29.006Z] at org.junit.platform.engine.support.hierarchical.NodeTestTask.lambda$executeRecursively$9(NodeTestTask.java:145)
16:30:29 [2026-10-30T15:30:29.006Z] at org.junit.platform.engine.support.hierarchical.ThrowableCollector.execute(ThrowableCollector.java:73)
16:30:29 [2026-10-30T15:30:29.006Z] at org.junit.platform.engine.support.hierarchical.NodeTestTask.executeRecursively(NodeTestTask.java:144)
16:30:29 [2026-10-30T15:30:29.006Z] at org.junit.platform.engine.support.hierarchical.NodeTestTask.execute(NodeTestTask.java:101)
16:30:29 [2026-10-30T15:30:29.006Z] at org.junit.platform.engine.support.hierarchical.ForkJoinPoolHierarchicalTestExecutorService$ExclusiveTask.exec(ForkJoinPoolHierarchicalTestExecutorService.java:274)
16:30:29 [2026-10-30T15:30:29.006Z] at java.base/java.util.concurrent.ForkJoinTask.doExec(ForkJoinTask.java:387)
16:30:29 [2026-10-30T15:30:29.006Z] at java.base/java.util.concurrent.ForkJoinPool$WorkQueue.topLevelExec(ForkJoinPool.java:1312)
16:30:29 [2026-10-30T15:30:29.006Z] at java.base/java.util.concurrent.ForkJoinPool.scan(ForkJoinPool.java:1843)
16:30:29 [2026-10-30T15:30:29.006Z] at java.base/java.util.concurrent.ForkJoinPool.runWorker(ForkJoinPool.java:1808)
16:30:29 [2026-10-30T15:30:29.006Z] at java.base/java.util.concurrent.ForkJoinWorkerThread.run(ForkJoinWorkerThread.java:188)
16:30:29 [2026-10-30T15:30:29.006Z] Caused by: java.io.IOException: Error while instrumenting org/silverpeas/kernel/test/MyBean$MockitoMock$0n3lNhWJ with JaCoCo 0.8.8.202204050719/5dcf34a.
16:30:29 [2026-10-30T15:30:29.006Z] at org.jacoco.agent.rt.internal_b6258fc.core.instr.Instrumenter.instrumentError(Instrumenter.java:161)
16:30:29 [2026-10-30T15:30:29.006Z] at org.jacoco.agent.rt.internal_b6258fc.core.instr.Instrumenter.instrument(Instrumenter.java:111)
16:30:29 [2026-10-30T15:30:29.006Z] at org.jacoco.agent.rt.internal_b6258fc.CoverageTransformer.transform(CoverageTransformer.java:92)
16:30:29 [2026-10-30T15:30:29.007Z] ... 119 more
16:30:29 [2026-10-30T15:30:29.007Z] Caused by: java.lang.IllegalArgumentException: Unsupported class file major version 65
16:30:29 [2026-10-30T15:30:29.007Z] at org.jacoco.agent.rt.internal_b6258fc.asm.ClassReader.<init>(ClassReader.java:199)
16:30:29 [2026-10-30T15:30:29.007Z] at org.jacoco.agent.rt.internal_b6258fc.asm.ClassReader.<init>(ClassReader.java:180)
16:30:29 [2026-10-30T15:30:29.007Z] at org.jacoco.agent.rt.internal_b6258fc.asm.ClassReader.<init>(ClassReader.java:166)
16:30:29 [2026-10-30T15:30:29.007Z] at org.jacoco.agent.rt.internal_b6258fc.core.internal.instr.InstrSupport.classReaderFor(InstrSupport.java:280)
16:30:29 [2026-10-30T15:30:29.007Z] at org.jacoco.agent.rt.internal_b6258fc.core.instr.Instrumenter.instrument(Instrumenter.java:77)
16:30:29 [2026-10-30T15:30:29.007Z] at org.jacoco.agent.rt.internal_b6258fc.core.instr.Instrumenter.instrument(Instrumenter.java:109)
16:30:29 [2026-10-30T15:30:29.007Z] ... 120 more
16:30:29 [2026-10-30T15:30:29.007Z] java.lang.instrument.IllegalClassFormatException: Error while instrumenting org/silverpeas/kernel/test/MyBean$MockitoMock$0n3lNhWJ$auxiliary$W1Y4LYXb with JaCoCo 0.8.8.202204050719/5dcf34a.
16:30:29 [2026-10-30T15:30:29.007Z] at org.jacoco.agent.rt.internal_b6258fc.CoverageTransformer.transform(CoverageTransformer.java:94)
16:30:29 [2026-10-30T15:30:29.007Z] at java.instrument/java.lang.instrument.ClassFileTransformer.transform(ClassFileTransformer.java:244)
16:30:29 [2026-10-30T15:30:29.007Z] at java.instrument/sun.instrument.TransformerManager.transform(TransformerManager.java:188)
16:30:29 [2026-10-30T15:30:29.007Z] at java.instrument/sun.instrument.InstrumentationImpl.transform(InstrumentationImpl.java:610)
16:30:29 [2026-10-30T15:30:29.007Z] at java.base/java.lang.ClassLoader.defineClass0(Native Method)
16:30:29 [2026-10-30T15:30:29.007Z] at java.base/java.lang.System$2.defineClass(System.java:2395)
16:30:29 [2026-10-30T15:30:29.007Z] at java.base/java.lang.invoke.MethodHandles$Lookup$ClassDefiner.defineClass(MethodHandles.java:2505)
16:30:29 [2026-10-30T15:30:29.007Z] at java.base/java.lang.invoke.MethodHandles$Lookup$ClassDefiner.defineClass(MethodHandles.java:2480)
16:30:29 [2026-10-30T15:30:29.007Z] at java.base/java.lang.invoke.MethodHandles$Lookup.defineClass(MethodHandles.java:1865)
16:30:29 [2026-10-30T15:30:29.007Z] at java.base/jdk.internal.reflect.DirectMethodHandleAccessor.invoke(DirectMethodHandleAccessor.java:103)
16:30:29 [2026-10-30T15:30:29.007Z] at java.base/java.lang.reflect.Method.invoke(Method.java:580)
16:30:29 [2026-10-30T15:30:29.007Z] at net.bytebuddy.utility.Invoker$Dispatcher.invoke(Unknown Source)
16:30:29 [2026-10-30T15:30:29.007Z] at net.bytebuddy.utility.dispatcher.JavaDispatcher$Dispatcher$ForNonStaticMethod.invoke(JavaDispatcher.java:1033)
16:30:29 [2026-10-30T15:30:29.007Z] at net.bytebuddy.utility.dispatcher.JavaDispatcher$ProxiedInvocationHandler.invoke(JavaDispatcher.java:1163)
16:30:29 [2026-10-30T15:30:29.007Z] at jdk.proxy2/jdk.proxy2.$Proxy75.defineClass(Unknown Source)
16:30:29 [2026-10-30T15:30:29.007Z] at net.bytebuddy.dynamic.loading.ClassInjector$UsingLookup.injectRaw(ClassInjector.java:1686)
16:30:29 [2026-10-30T15:30:29.007Z] at net.bytebuddy.dynamic.loading.ClassInjector$AbstractBase.injectRaw(ClassInjector.java:167)
16:30:29 [2026-10-30T15:30:29.007Z] at net.bytebuddy.dynamic.loading.ClassInjector$AbstractBase.inject(ClassInjector.java:155)
16:30:29 [2026-10-30T15:30:29.007Z] at net.bytebuddy.dynamic.loading.ClassLoadingStrategy$UsingLookup.load(ClassLoadingStrategy.java:519)
16:30:29 [2026-10-30T15:30:29.007Z] at net.bytebuddy.dynamic.TypeResolutionStrategy$Passive.initialize(TypeResolutionStrategy.java:101)
16:30:29 [2026-10-30T15:30:29.007Z] at net.bytebuddy.dynamic.DynamicType$Default$Unloaded.load(DynamicType.java:6432)
16:30:29 [2026-10-30T15:30:29.007Z] at org.mockito.internal.creation.bytebuddy.SubclassBytecodeGenerator.mockClass(SubclassBytecodeGenerator.java:282)
16:30:29 [2026-10-30T15:30:29.007Z] at org.mockito.internal.creation.bytebuddy.TypeCachingBytecodeGenerator.lambda$mockClass$0(TypeCachingBytecodeGenerator.java:78)
16:30:29 [2026-10-30T15:30:29.007Z] at net.bytebuddy.TypeCache.findOrInsert(TypeCache.java:168)
16:30:29 [2026-10-30T15:30:29.007Z] at net.bytebuddy.TypeCache$WithInlineExpunction.findOrInsert(TypeCache.java:399)
16:30:29 [2026-10-30T15:30:29.007Z] at net.bytebuddy.TypeCache.findOrInsert(TypeCache.java:190)
16:30:29 [2026-10-30T15:30:29.007Z] at net.bytebuddy.TypeCache$WithInlineExpunction.findOrInsert(TypeCache.java:410)
16:30:29 [2026-10-30T15:30:29.007Z] at org.mockito.internal.creation.bytebuddy.TypeCachingBytecodeGenerator.mockClass(TypeCachingBytecodeGenerator.java:75)
16:30:29 [2026-10-30T15:30:29.007Z] at org.mockito.internal.creation.bytebuddy.InlineBytecodeGenerator.mockClass(InlineBytecodeGenerator.java:223)
16:30:29 [2026-10-30T15:30:29.007Z] at org.mockito.internal.creation.bytebuddy.TypeCachingBytecodeGenerator.lambda$mockClass$0(TypeCachingBytecodeGenerator.java:78)
16:30:29 [2026-10-30T15:30:29.007Z] at net.bytebuddy.TypeCache.findOrInsert(TypeCache.java:168)
16:30:29 [2026-10-30T15:30:29.007Z] at net.bytebuddy.TypeCache$WithInlineExpunction.findOrInsert(TypeCache.java:399)
16:30:29 [2026-10-30T15:30:29.007Z] at net.bytebuddy.TypeCache.findOrInsert(TypeCache.java:190)
16:30:29 [2026-10-30T15:30:29.007Z] at net.bytebuddy.TypeCache$WithInlineExpunction.findOrInsert(TypeCache.java:410)
16:30:29 [2026-10-30T15:30:29.007Z] at org.mockito.internal.creation.bytebuddy.TypeCachingBytecodeGenerator.mockClass(TypeCachingBytecodeGenerator.java:75)
16:30:29 [2026-10-30T15:30:29.007Z] at org.mockito.internal.creation.bytebuddy.InlineDelegateByteBuddyMockMaker.createMockType(InlineDelegateByteBuddyMockMaker.java:429)
16:30:29 [2026-10-30T15:30:29.007Z] at org.mockito.internal.creation.bytebuddy.InlineDelegateByteBuddyMockMaker.doCreateMock(InlineDelegateByteBuddyMockMaker.java:388)
16:30:29 [2026-10-30T15:30:29.007Z] at org.mockito.internal.creation.bytebuddy.InlineDelegateByteBuddyMockMaker.createMock(InlineDelegateByteBuddyMockMaker.java:367)
16:30:29 [2026-10-30T15:30:29.007Z] at org.mockito.internal.creation.bytebuddy.InlineByteBuddyMockMaker.createMock(InlineByteBuddyMockMaker.java:56)
16:30:29 [2026-10-30T15:30:29.007Z] at org.mockito.internal.util.MockUtil.createMock(MockUtil.java:99)
16:30:29 [2026-10-30T15:30:29.007Z] at org.mockito.internal.MockitoCore.mock(MockitoCore.java:84)
16:30:29 [2026-10-30T15:30:29.007Z] at org.mockito.Mockito.mock(Mockito.java:2198)
16:30:29 [2026-10-30T15:30:29.007Z] at org.mockito.Mockito.mock(Mockito.java:2113)
16:30:29 [2026-10-30T15:30:29.007Z] at org.silverpeas.kernel.test.DependencyResolver.resolveDependency(DependencyResolver.java:155)
16:30:29 [2026-10-30T15:30:29.007Z] at org.silverpeas.kernel.test.DependencyResolver.lambda$resolve$1(DependencyResolver.java:105)
16:30:29 [2026-10-30T15:30:29.007Z] at java.base/java.util.Optional.orElseGet(Optional.java:364)
16:30:29 [2026-10-30T15:30:29.007Z] at org.silverpeas.kernel.test.DependencyResolver.lambda$resolve$2(DependencyResolver.java:105)
16:30:29 [2026-10-30T15:30:29.007Z] at java.base/java.util.stream.ForEachOps$ForEachOp$OfRef.accept(ForEachOps.java:184)
16:30:29 [2026-10-30T15:30:29.007Z] at java.base/java.util.stream.ReferencePipeline$2$1.accept(ReferencePipeline.java:179)
16:30:29 [2026-10-30T15:30:29.007Z] at java.base/java.util.Spliterators$ArraySpliterator.forEachRemaining(Spliterators.java:1024)
16:30:29 [2026-10-30T15:30:29.007Z] at java.base/java.util.stream.AbstractPipeline.copyInto(AbstractPipeline.java:509)
16:30:29 [2026-10-30T15:30:29.007Z] at java.base/java.util.stream.AbstractPipeline.wrapAndCopyInto(AbstractPipeline.java:499)
16:30:29 [2026-10-30T15:30:29.007Z] at java.base/java.util.stream.ForEachOps$ForEachOp.evaluateSequential(ForEachOps.java:151)
16:30:29 [2026-10-30T15:30:29.007Z] at java.base/java.util.stream.ForEachOps$ForEachOp$OfRef.evaluateSequential(ForEachOps.java:174)
16:30:29 [2026-10-30T15:30:29.007Z] at java.base/java.util.stream.AbstractPipeline.evaluate(AbstractPipeline.java:234)
16:30:29 [2026-10-30T15:30:29.007Z] at java.base/java.util.stream.ReferencePipeline.forEach(ReferencePipeline.java:596)
16:30:29 [2026-10-30T15:30:29.007Z] at org.silverpeas.kernel.test.DependencyResolver.lambda$resolve$3(DependencyResolver.java:102)
16:30:29 [2026-10-30T15:30:29.007Z] at org.silverpeas.kernel.test.util.Reflections.loopInheritance(Reflections.java:68)
16:30:29 [2026-10-30T15:30:29.007Z] at org.silverpeas.kernel.test.DependencyResolver.resolve(DependencyResolver.java:98)
16:30:29 [2026-10-30T15:30:29.007Z] at org.silverpeas.kernel.test.DependencyResolverTest.genericInjectionIsMockedWhenNoManagedBeanIsAvailable(DependencyResolverTest.java:67)
16:30:29 [2026-10-30T15:30:29.007Z] at java.base/jdk.internal.reflect.DirectMethodHandleAccessor.invoke(DirectMethodHandleAccessor.java:103)
16:30:29 [2026-10-30T15:30:29.007Z] at java.base/java.lang.reflect.Method.invoke(Method.java:580)
16:30:29 [2026-10-30T15:30:29.007Z] at org.junit.platform.commons.util.ReflectionUtils.invokeMethod(ReflectionUtils.java:787)
16:30:29 [2026-10-30T15:30:29.007Z] at org.junit.platform.commons.support.ReflectionSupport.invokeMethod(ReflectionSupport.java:478)
16:30:29 [2026-10-30T15:30:29.007Z] at org.junit.jupiter.engine.execution.MethodInvocation.proceed(MethodInvocation.java:60)
16:30:29 [2026-10-30T15:30:29.007Z] at org.junit.jupiter.engine.execution.InvocationInterceptorChain$ValidatingInvocation.proceed(InvocationInterceptorChain.java:131)
16:30:29 [2026-10-30T15:30:29.007Z] at org.junit.jupiter.engine.extension.TimeoutExtension.intercept(TimeoutExtension.java:161)
16:30:29 [2026-10-30T15:30:29.007Z] at org.junit.jupiter.engine.extension.TimeoutExtension.interceptTestableMethod(TimeoutExtension.java:152)
16:30:29 [2026-10-30T15:30:29.007Z] at org.junit.jupiter.engine.extension.TimeoutExtension.interceptTestMethod(TimeoutExtension.java:91)
16:30:29 [2026-10-30T15:30:29.007Z] at org.junit.jupiter.engine.execution.InterceptingExecutableInvoker$ReflectiveInterceptorCall.lambda$ofVoidMethod$0(InterceptingExecutableInvoker.java:112)
16:30:29 [2026-10-30T15:30:29.007Z] at org.junit.jupiter.engine.execution.InterceptingExecutableInvoker.lambda$invoke$0(InterceptingExecutableInvoker.java:94)
16:30:29 [2026-10-30T15:30:29.007Z] at org.junit.jupiter.engine.execution.InvocationInterceptorChain$InterceptedInvocation.proceed(InvocationInterceptorChain.java:106)
16:30:29 [2026-10-30T15:30:29.007Z] at org.junit.jupiter.engine.execution.InvocationInterceptorChain.proceed(InvocationInterceptorChain.java:64)
16:30:29 [2026-10-30T15:30:29.007Z] at org.junit.jupiter.engine.execution.InvocationInterceptorChain.chainAndInvoke(InvocationInterceptorChain.java:45)
16:30:29 [2026-10-30T15:30:29.007Z] at org.junit.jupiter.engine.execution.InvocationInterceptorChain.invoke(InvocationInterceptorChain.java:37)
16:30:29 [2026-10-30T15:30:29.007Z] at org.junit.jupiter.engine.execution.InterceptingExecutableInvoker.invoke(InterceptingExecutableInvoker.java:93)
16:30:29 [2026-10-30T15:30:29.007Z] at org.junit.jupiter.engine.execution.InterceptingExecutableInvoker.invoke(InterceptingExecutableInvoker.java:87)
16:30:29 [2026-10-30T15:30:29.008Z] at org.junit.jupiter.engine.descriptor.TestMethodTestDescriptor.lambda$invokeTestMethod$4(TestMethodTestDescriptor.java:221)
16:30:29 [2026-10-30T15:30:29.008Z] at org.junit.platform.engine.support.hierarchical.ThrowableCollector.execute(ThrowableCollector.java:73)
16:30:29 [2026-10-30T15:30:29.008Z] at org.junit.jupiter.engine.descriptor.TestMethodTestDescriptor.invokeTestMethod(TestMethodTestDescriptor.java:217)
16:30:29 [2026-10-30T15:30:29.008Z] at org.junit.jupiter.engine.descriptor.TestMethodTestDescriptor.execute(TestMethodTestDescriptor.java:159)
16:30:29 [2026-10-30T15:30:29.008Z] at org.junit.jupiter.engine.descriptor.TestMethodTestDescriptor.execute(TestMethodTestDescriptor.java:70)
16:30:29 [2026-10-30T15:30:29.008Z] at org.junit.platform.engine.support.hierarchical.NodeTestTask.lambda$executeRecursively$6(NodeTestTask.java:157)
16:30:29 [2026-10-30T15:30:29.008Z] at org.junit.platform.engine.support.hierarchical.ThrowableCollector.execute(ThrowableCollector.java:73)
16:30:29 [2026-10-30T15:30:29.008Z] at org.junit.platform.engine.support.hierarchical.NodeTestTask.lambda$executeRecursively$8(NodeTestTask.java:147)
16:30:29 [2026-10-30T15:30:29.008Z] at org.junit.platform.engine.support.hierarchical.Node.around(Node.java:137)
16:30:29 [2026-10-30T15:30:29.008Z] at org.junit.platform.engine.support.hierarchical.NodeTestTask.lambda$executeRecursively$9(NodeTestTask.java:145)
16:30:29 [2026-10-30T15:30:29.008Z] at org.junit.platform.engine.support.hierarchical.ThrowableCollector.execute(ThrowableCollector.java:73)
16:30:29 [2026-10-30T15:30:29.008Z] at org.junit.platform.engine.support.hierarchical.NodeTestTask.executeRecursively(NodeTestTask.java:144)
16:30:29 [2026-10-30T15:30:29.008Z] at org.junit.platform.engine.support.hierarchical.NodeTestTask.execute(NodeTestTask.java:101)
16:30:29 [2026-10-30T15:30:29.008Z] at org.junit.platform.engine.support.hierarchical.ForkJoinPoolHierarchicalTestExecutorService$ExclusiveTask.exec(ForkJoinPoolHierarchicalTestExecutorService.java:274)
16:30:29 [2026-10-30T15:30:29.008Z] at org.junit.platform.engine.support.hierarchical.ForkJoinPoolHierarchicalTestExecutorService$ExclusiveTask.execSync(ForkJoinPoolHierarchicalTestExecutorService.java:247)
16:30:29 [2026-10-30T15:30:29.008Z] at org.junit.platform.engine.support.hierarchical.ForkJoinPoolHierarchicalTestExecutorService.executeSync(ForkJoinPoolHierarchicalTestExecutorService.java:194)
16:30:29 [2026-10-30T15:30:29.008Z] at org.junit.platform.engine.support.hierarchical.ForkJoinPoolHierarchicalTestExecutorService.invokeAll(ForkJoinPoolHierarchicalTestExecutorService.java:166)
16:30:29 [2026-10-30T15:30:29.008Z] at org.junit.platform.engine.support.hierarchical.NodeTestTask.lambda$executeRecursively$6(NodeTestTask.java:161)
16:30:29 [2026-10-30T15:30:29.008Z] at org.junit.platform.engine.support.hierarchical.ThrowableCollector.execute(ThrowableCollector.java:73)
16:30:29 [2026-10-30T15:30:29.008Z] at org.junit.platform.engine.support.hierarchical.NodeTestTask.lambda$executeRecursively$8(NodeTestTask.java:147)
16:30:29 [2026-10-30T15:30:29.008Z] at org.junit.platform.engine.support.hierarchical.Node.around(Node.java:137)
16:30:29 [2026-10-30T15:30:29.008Z] at org.junit.platform.engine.support.hierarchical.NodeTestTask.lambda$executeRecursively$9(NodeTestTask.java:145)
16:30:29 [2026-10-30T15:30:29.008Z] at org.junit.platform.engine.support.hierarchical.ThrowableCollector.execute(ThrowableCollector.java:73)
16:30:29 [2026-10-30T15:30:29.008Z] at org.junit.platform.engine.support.hierarchical.NodeTestTask.executeRecursively(NodeTestTask.java:144)
16:30:29 [2026-10-30T15:30:29.008Z] at org.junit.platform.engine.support.hierarchical.NodeTestTask.execute(NodeTestTask.java:101)
16:30:29 [2026-10-30T15:30:29.008Z] at org.junit.platform.engine.support.hierarchical.ForkJoinPoolHierarchicalTestExecutorService$ExclusiveTask.exec(ForkJoinPoolHierarchicalTestExecutorService.java:274)
16:30:29 [2026-10-30T15:30:29.008Z] at org.junit.platform.engine.support.hierarchical.ForkJoinPoolHierarchicalTestExecutorService$ExclusiveTask.execSync(ForkJoinPoolHierarchicalTestExecutorService.java:247)
16:30:29 [2026-10-30T15:30:29.008Z] at org.junit.platform.engine.support.hierarchical.ForkJoinPoolHierarchicalTestExecutorService.executeSync(ForkJoinPoolHierarchicalTestExecutorService.java:194)
16:30:29 [2026-10-30T15:30:29.008Z] at org.junit.platform.engine.support.hierarchical.ForkJoinPoolHierarchicalTestExecutorService.invokeAll(ForkJoinPoolHierarchicalTestExecutorService.java:166)
16:30:29 [2026-10-30T15:30:29.008Z] at org.junit.platform.engine.support.hierarchical.NodeTestTask.lambda$executeRecursively$6(NodeTestTask.java:161)
16:30:29 [2026-10-30T15:30:29.008Z] at org.junit.platform.engine.support.hierarchical.ThrowableCollector.execute(ThrowableCollector.java:73)
16:30:29 [2026-10-30T15:30:29.008Z] at org.junit.platform.engine.support.hierarchical.NodeTestTask.lambda$executeRecursively$8(NodeTestTask.java:147)
16:30:29 [2026-10-30T15:30:29.008Z] at org.junit.platform.engine.support.hierarchical.Node.around(Node.java:137)
16:30:29 [2026-10-30T15:30:29.008Z] at org.junit.platform.engine.support.hierarchical.NodeTestTask.lambda$executeRecursively$9(NodeTestTask.java:145)
16:30:29 [2026-10-30T15:30:29.008Z] at org.junit.platform.engine.support.hierarchical.ThrowableCollector.execute(ThrowableCollector.java:73)
16:30:29 [2026-10-30T15:30:29.008Z] at org.junit.platform.engine.support.hierarchical.NodeTestTask.executeRecursively(NodeTestTask.java:144)
16:30:29 [2026-10-30T15:30:29.008Z] at org.junit.platform.engine.support.hierarchical.NodeTestTask.execute(NodeTestTask.java:101)
16:30:29 [2026-10-30T15:30:29.008Z] at org.junit.platform.engine.support.hierarchical.ForkJoinPoolHierarchicalTestExecutorService$ExclusiveTask.exec(ForkJoinPoolHierarchicalTestExecutorService.java:274)
16:30:29 [2026-10-30T15:30:29.008Z] at java.base/java.util.concurrent.ForkJoinTask.doExec(ForkJoinTask.java:387)
16:30:29 [2026-10-30T15:30:29.008Z] at java.base/java.util.concurrent.ForkJoinPool$WorkQueue.topLevelExec(ForkJoinPool.java:1312)
16:30:29 [2026-10-30T15:30:29.008Z] at java.base/java.util.concurrent.ForkJoinPool.scan(ForkJoinPool.java:1843)
16:30:29 [2026-10-30T15:30:29.008Z] at java.base/java.util.concurrent.ForkJoinPool.runWorker(ForkJoinPool.java:1808)
16:30:29 [2026-10-30T15:30:29.008Z] at java.base/java.util.concurrent.ForkJoinWorkerThread.run(ForkJoinWorkerThread.java:188)
16:30:29 [2026-10-30T15:30:29.008Z] Caused by: java.io.IOException: Error while instrumenting org/silverpeas/kernel/test/MyBean$MockitoMock$0n3lNhWJ$auxiliary$W1Y4LYXb with JaCoCo 0.8.8.202204050719/5dcf34a.
16:30:29 [2026-10-30T15:30:29.008Z] at org.jacoco.agent.rt.internal_b6258fc.core.instr.Instrumenter.instrumentError(Instrumenter.java:161)
16:30:29 [2026-10-30T15:30:29.008Z] at org.jacoco.agent.rt.internal_b6258fc.core.instr.Instrumenter.instrument(Instrumenter.java:111)
16:30:29 [2026-10-30T15:30:29.008Z] at org.jacoco.agent.rt.internal_b6258fc.CoverageTransformer.transform(CoverageTransformer.java:92)
16:30:29 [2026-10-30T15:30:29.008Z] ... 119 more
16:30:29 [2026-10-30T15:30:29.008Z] Caused by: java.lang.IllegalArgumentException: Unsupported class file major version 65
16:30:29 [2026-10-30T15:30:29.008Z] at org.jacoco.agent.rt.internal_b6258fc.asm.ClassReader.<init>(ClassReader.java:199)
16:30:29 [2026-10-30T15:30:29.008Z] at org.jacoco.agent.rt.internal_b6258fc.asm.ClassReader.<init>(ClassReader.java:180)
16:30:29 [2026-10-30T15:30:29.008Z] at org.jacoco.agent.rt.internal_b6258fc.asm.ClassReader.<init>(ClassReader.java:166)
16:30:29 [2026-10-30T15:30:29.008Z] at org.jacoco.agent.rt.internal_b6258fc.core.internal.instr.InstrSupport.classReaderFor(InstrSupport.java:280)
16:30:29 [2026-10-30T15:30:29.008Z] at org.jacoco.agent.rt.internal_b6258fc.core.instr.Instrumenter.instrument(Instrumenter.java:77)
16:30:29 [2026-10-30T15:30:29.008Z] at org.jacoco.agent.rt.internal_b6258fc.core.instr.Instrumenter.instrument(Instrumenter.java:109)
16:30:29 [2026-10-30T15:30:29.008Z] ... 120 more
16:30:29 [2026-10-30T15:30:29.008Z] java.lang.instrument.IllegalClassFormatException: Error while instrumenting org/silverpeas/kernel/test/MyBean$MockitoMock$0n3lNhWJ$auxiliary$KmNhBtY9 with JaCoCo 0.8.8.202204050719/5dcf34a.
16:30:29 [2026-10-30T15:30:29.008Z] at org.jacoco.agent.rt.internal_b6258fc.CoverageTransformer.transform(CoverageTransformer.java:94)
16:30:29 [2026-10-30T15:30:29.008Z] at java.instrument/java.lang.instrument.ClassFileTransformer.transform(ClassFileTransformer.java:244)
16:30:29 [2026-10-30T15:30:29.008Z] at java.instrument/sun.instrument.TransformerManager.transform(TransformerManager.java:188)
16:30:29 [2026-10-30T15:30:29.008Z] at java.instrument/sun.instrument.InstrumentationImpl.transform(InstrumentationImpl.java:610)
16:30:29 [2026-10-30T15:30:29.008Z] at java.base/java.lang.ClassLoader.defineClass0(Native Method)
16:30:29 [2026-10-30T15:30:29.008Z] at java.base/java.lang.System$2.defineClass(System.java:2395)
16:30:29 [2026-10-30T15:30:29.008Z] at java.base/java.lang.invoke.MethodHandles$Lookup$ClassDefiner.defineClass(MethodHandles.java:2505)
16:30:29 [2026-10-30T15:30:29.008Z] at java.base/java.lang.invoke.MethodHandles$Lookup$ClassDefiner.defineClass(MethodHandles.java:2480)
16:30:29 [2026-10-30T15:30:29.008Z] at java.base/java.lang.invoke.MethodHandles$Lookup.defineClass(MethodHandles.java:1865)
16:30:29 [2026-10-30T15:30:29.008Z] at java.base/jdk.internal.reflect.DirectMethodHandleAccessor.invoke(DirectMethodHandleAccessor.java:103)
16:30:29 [2026-10-30T15:30:29.008Z] at java.base/java.lang.reflect.Method.invoke(Method.java:580)
16:30:29 [2026-10-30T15:30:29.008Z] at net.bytebuddy.utility.Invoker$Dispatcher.invoke(Unknown Source)
16:30:29 [2026-10-30T15:30:29.008Z] at net.bytebuddy.utility.dispatcher.JavaDispatcher$Dispatcher$ForNonStaticMethod.invoke(JavaDispatcher.java:1033)
16:30:29 [2026-10-30T15:30:29.008Z] at net.bytebuddy.utility.dispatcher.JavaDispatcher$ProxiedInvocationHandler.invoke(JavaDispatcher.java:1163)
16:30:29 [2026-10-30T15:30:29.008Z] at jdk.proxy2/jdk.proxy2.$Proxy75.defineClass(Unknown Source)
16:30:29 [2026-10-30T15:30:29.008Z] at net.bytebuddy.dynamic.loading.ClassInjector$UsingLookup.injectRaw(ClassInjector.java:1686)
16:30:29 [2026-10-30T15:30:29.008Z] at net.bytebuddy.dynamic.loading.ClassInjector$AbstractBase.injectRaw(ClassInjector.java:167)
16:30:29 [2026-10-30T15:30:29.008Z] at net.bytebuddy.dynamic.loading.ClassInjector$AbstractBase.inject(ClassInjector.java:155)
16:30:29 [2026-10-30T15:30:29.008Z] at net.bytebuddy.dynamic.loading.ClassLoadingStrategy$UsingLookup.load(ClassLoadingStrategy.java:519)
16:30:29 [2026-10-30T15:30:29.008Z] at net.bytebuddy.dynamic.TypeResolutionStrategy$Passive.initialize(TypeResolutionStrategy.java:101)
16:30:29 [2026-10-30T15:30:29.008Z] at net.bytebuddy.dynamic.DynamicType$Default$Unloaded.load(DynamicType.java:6432)
16:30:29 [2026-10-30T15:30:29.008Z] at org.mockito.internal.creation.bytebuddy.SubclassBytecodeGenerator.mockClass(SubclassBytecodeGenerator.java:282)
16:30:29 [2026-10-30T15:30:29.008Z] at org.mockito.internal.creation.bytebuddy.TypeCachingBytecodeGenerator.lambda$mockClass$0(TypeCachingBytecodeGenerator.java:78)
16:30:29 [2026-10-30T15:30:29.008Z] at net.bytebuddy.TypeCache.findOrInsert(TypeCache.java:168)
16:30:29 [2026-10-30T15:30:29.009Z] at net.bytebuddy.TypeCache$WithInlineExpunction.findOrInsert(TypeCache.java:399)
16:30:29 [2026-10-30T15:30:29.009Z] at net.bytebuddy.TypeCache.findOrInsert(TypeCache.java:190)
16:30:29 [2026-10-30T15:30:29.009Z] at net.bytebuddy.TypeCache$WithInlineExpunction.findOrInsert(TypeCache.java:410)
16:30:29 [2026-10-30T15:30:29.009Z] at org.mockito.internal.creation.bytebuddy.TypeCachingBytecodeGenerator.mockClass(TypeCachingBytecodeGenerator.java:75)
16:30:29 [2026-10-30T15:30:29.009Z] at org.mockito.internal.creation.bytebuddy.InlineBytecodeGenerator.mockClass(InlineBytecodeGenerator.java:223)
16:30:29 [2026-10-30T15:30:29.009Z] at org.mockito.internal.creation.bytebuddy.TypeCachingBytecodeGenerator.lambda$mockClass$0(TypeCachingBytecodeGenerator.java:78)
16:30:29 [2026-10-30T15:30:29.009Z] at net.bytebuddy.TypeCache.findOrInsert(TypeCache.java:168)
16:30:29 [2026-10-30T15:30:29.009Z] at net.bytebuddy.TypeCache$WithInlineExpunction.findOrInsert(TypeCache.java:399)
16:30:29 [2026-10-30T15:30:29.009Z] at net.bytebuddy.TypeCache.findOrInsert(TypeCache.java:190)
16:30:29 [2026-10-30T15:30:29.009Z] at net.bytebuddy.TypeCache$WithInlineExpunction.findOrInsert(TypeCache.java:410)
16:30:29 [2026-10-30T15:30:29.009Z] at org.mockito.internal.creation.bytebuddy.TypeCachingBytecodeGenerator.mockClass(TypeCachingBytecodeGenerator.java:75)
16:30:29 [2026-10-30T15:30:29.009Z] at org.mockito.internal.creation.bytebuddy.InlineDelegateByteBuddyMockMaker.createMockType(InlineDelegateByteBuddyMockMaker.java:429)
16:30:29 [2026-10-30T15:30:29.009Z] at org.mockito.internal.creation.bytebuddy.InlineDelegateByteBuddyMockMaker.doCreateMock(InlineDelegateByteBuddyMockMaker.java:388)
16:30:29 [2026-10-30T15:30:29.009Z] at org.mockito.internal.creation.bytebuddy.InlineDelegateByteBuddyMockMaker.createMock(InlineDelegateByteBuddyMockMaker.java:367)
16:30:29 [2026-10-30T15:30:29.009Z] at org.mockito.internal.creation.bytebuddy.InlineByteBuddyMockMaker.createMock(InlineByteBuddyMockMaker.java:56)
16:30:29 [2026-10-30T15:30:29.009Z] at org.mockito.internal.util.MockUtil.createMock(MockUtil.java:99)
16:30:29 [2026-10-30T15:30:29.009Z] at org.mockito.internal.MockitoCore.mock(MockitoCore.java:84)
16:30:29 [2026-10-30T15:30:29.009Z] at org.mockito.Mockito.mock(Mockito.java:2198)
16:30:29 [2026-10-30T15:30:29.009Z] at org.mockito.Mockito.mock(Mockito.java:2113)
16:30:29 [2026-10-30T15:30:29.009Z] at org.silverpeas.kernel.test.DependencyResolver.resolveDependency(DependencyResolver.java:155)
16:30:29 [2026-10-30T15:30:29.009Z] at org.silverpeas.kernel.test.DependencyResolver.lambda$resolve$1(DependencyResolver.java:105)
16:30:29 [2026-10-30T15:30:29.009Z] at java.base/java.util.Optional.orElseGet(Optional.java:364)
16:30:29 [2026-10-30T15:30:29.009Z] at org.silverpeas.kernel.test.DependencyResolver.lambda$resolve$2(DependencyResolver.java:105)
16:30:29 [2026-10-30T15:30:29.009Z] at java.base/java.util.stream.ForEachOps$ForEachOp$OfRef.accept(ForEachOps.java:184)
16:30:29 [2026-10-30T15:30:29.009Z] at java.base/java.util.stream.ReferencePipeline$2$1.accept(ReferencePipeline.java:179)
16:30:29 [2026-10-30T15:30:29.009Z] at java.base/java.util.Spliterators$ArraySpliterator.forEachRemaining(Spliterators.java:1024)
16:30:29 [2026-10-30T15:30:29.009Z] at java.base/java.util.stream.AbstractPipeline.copyInto(AbstractPipeline.java:509)
16:30:29 [2026-10-30T15:30:29.009Z] at java.base/java.util.stream.AbstractPipeline.wrapAndCopyInto(AbstractPipeline.java:499)
16:30:29 [2026-10-30T15:30:29.009Z] at java.base/java.util.stream.ForEachOps$ForEachOp.evaluateSequential(ForEachOps.java:151)
16:30:29 [2026-10-30T15:30:29.009Z] at java.base/java.util.stream.ForEachOps$ForEachOp$OfRef.evaluateSequential(ForEachOps.java:174)
16:30:29 [2026-10-30T15:30:29.009Z] at java.base/java.util.stream.AbstractPipeline.evaluate(AbstractPipeline.java:234)
16:30:29 [2026-10-30T15:30:29.009Z] at java.base/java.util.stream.ReferencePipeline.forEach(ReferencePipeline.java:596)
16:30:29 [2026-10-30T15:30:29.009Z] at org.silverpeas.kernel.test.DependencyResolver.lambda$resolve$3(DependencyResolver.java:102)
16:30:29 [2026-10-30T15:30:29.009Z] at org.silverpeas.kernel.test.util.Reflections.loopInheritance(Reflections.java:68)
16:30:29 [2026-10-30T15:30:29.009Z] at org.silverpeas.kernel.test.DependencyResolver.resolve(DependencyResolver.java:98)
16:30:29 [2026-10-30T15:30:29.009Z] at org.silverpeas.kernel.test.DependencyResolverTest.genericInjectionIsMockedWhenNoManagedBeanIsAvailable(DependencyResolverTest.java:67)
16:30:29 [2026-10-30T15:30:29.009Z] at java.base/jdk.internal.reflect.DirectMethodHandleAccessor.invoke(DirectMethodHandleAccessor.java:103)
16:30:29 [2026-10-30T15:30:29.009Z] at java.base/java.lang.reflect.Method.invoke(Method.java:580)
16:30:29 [2026-10-30T15:30:29.009Z] at org.junit.platform.commons.util.ReflectionUtils.invokeMethod(ReflectionUtils.java:787)
16:30:29 [2026-10-30T15:30:29.009Z] at org.junit.platform.commons.support.ReflectionSupport.invokeMethod(ReflectionSupport.java:478)
16:30:29 [2026-10-30T15:30:29.009Z] at org.junit.jupiter.engine.execution.MethodInvocation.proceed(MethodInvocation.java:60)
16:30:29 [2026-10-30T15:30:29.009Z] at org.junit.jupiter.engine.execution.InvocationInterceptorChain$ValidatingInvocation.proceed(InvocationInterceptorChain.java:131)
16:30:29 [2026-10-30T15:30:29.009Z] at org.junit.jupiter.engine.extension.TimeoutExtension.intercept(TimeoutExtension.java:161)
16:30:29 [2026-10-30T15:30:29.009Z] at org.junit.jupiter.engine.extension.TimeoutExtension.interceptTestableMethod(TimeoutExtension.java:152)
16:30:29 [2026-10-30T15:30:29.009Z] at org.junit.jupiter.engine.extension.TimeoutExtension.interceptTestMethod(TimeoutExtension.java:91)
16:30:29 [2026-10-30T15:30:29.009Z] at org.junit.jupiter.engine.execution.InterceptingExecutableInvoker$ReflectiveInterceptorCall.lambda$ofVoidMethod$0(InterceptingExecutableInvoker.java:112)
16:30:29 [2026-10-30T15:30:29.009Z] at org.junit.jupiter.engine.execution.InterceptingExecutableInvoker.lambda$invoke$0(InterceptingExecutableInvoker.java:94)
16:30:29 [2026-10-30T15:30:29.009Z] at org.junit.jupiter.engine.execution.InvocationInterceptorChain$InterceptedInvocation.proceed(InvocationInterceptorChain.java:106)
16:30:29 [2026-10-30T15:30:29.009Z] at org.junit.jupiter.engine.execution.InvocationInterceptorChain.proceed(InvocationInterceptorChain.java:64)
16:30:29 [2026-10-30T15:30:29.009Z] at org.junit.jupiter.engine.execution.InvocationInterceptorChain.chainAndInvoke(InvocationInterceptorChain.java:45)
16:30:29 [2026-10-30T15:30:29.009Z] at org.junit.jupiter.engine.execution.InvocationInterceptorChain.invoke(InvocationInterceptorChain.java:37)
16:30:29 [2026-10-30T15:30:29.009Z] at org.junit.jupiter.engine.execution.InterceptingExecutableInvoker.invoke(InterceptingExecutableInvoker.java:93)
16:30:29 [2026-10-30T15:30:29.009Z] at org.junit.jupiter.engine.execution.InterceptingExecutableInvoker.invoke(InterceptingExecutableInvoker.java:87)
16:30:29 [2026-10-30T15:30:29.009Z] at org.junit.jupiter.engine.descriptor.TestMethodTestDescriptor.lambda$invokeTestMethod$4(TestMethodTestDescriptor.java:221)
16:30:29 [2026-10-30T15:30:29.009Z] at org.junit.platform.engine.support.hierarchical.ThrowableCollector.execute(ThrowableCollector.java:73)
16:30:29 [2026-10-30T15:30:29.009Z] at org.junit.jupiter.engine.descriptor.TestMethodTestDescriptor.invokeTestMethod(TestMethodTestDescriptor.java:217)
16:30:29 [2026-10-30T15:30:29.009Z] at org.junit.jupiter.engine.descriptor.TestMethodTestDescriptor.execute(TestMethodTestDescriptor.java:159)
16:30:29 [2026-10-30T15:30:29.009Z] at org.junit.jupiter.engine.descriptor.TestMethodTestDescriptor.execute(TestMethodTestDescriptor.java:70)
16:30:29 [2026-10-30T15:30:29.009Z] at org.junit.platform.engine.support.hierarchical.NodeTestTask.lambda$executeRecursively$6(NodeTestTask.java:157)
16:30:29 [2026-10-30T15:30:29.009Z] at org.junit.platform.engine.support.hierarchical.ThrowableCollector.execute(ThrowableCollector.java:73)
16:30:29 [2026-10-30T15:30:29.009Z] at org.junit.platform.engine.support.hierarchical.NodeTestTask.lambda$executeRecursively$8(NodeTestTask.java:147)
16:30:29 [2026-10-30T15:30:29.009Z] at org.junit.platform.engine.support.hierarchical.Node.around(Node.java:137)
16:30:29 [2026-10-30T15:30:29.009Z] at org.junit.platform.engine.support.hierarchical.NodeTestTask.lambda$executeRecursively$9(NodeTestTask.java:145)
16:30:29 [2026-10-30T15:30:29.009Z] at org.junit.platform.engine.support.hierarchical.ThrowableCollector.execute(ThrowableCollector.java:73)
16:30:29 [2026-10-30T15:30:29.009Z] at org.junit.platform.engine.support.hierarchical.NodeTestTask.executeRecursively(NodeTestTask.java:144)
16:30:29 [2026-10-30T15:30:29.009Z] at org.junit.platform.engine.support.hierarchical.NodeTestTask.execute(NodeTestTask.java:101)
16:30:29 [2026-10-30T15:30:29.009Z] at org.junit.platform.engine.support.hierarchical.ForkJoinPoolHierarchicalTestExecutorService$ExclusiveTask.exec(ForkJoinPoolHierarchicalTestExecutorService.java:274)
16:30:29 [2026-10-30T15:30:29.009Z] at org.junit.platform.engine.support.hierarchical.ForkJoinPoolHierarchicalTestExecutorService$ExclusiveTask.execSync(ForkJoinPoolHierarchicalTestExecutorService.java:247)
16:30:29 [2026-10-30T15:30:29.009Z] at org.junit.platform.engine.support.hierarchical.ForkJoinPoolHierarchicalTestExecutorService.executeSync(ForkJoinPoolHierarchicalTestExecutorService.java:194)
16:30:29 [2026-10-30T15:30:29.009Z] at org.junit.platform.engine.support.hierarchical.ForkJoinPoolHierarchicalTestExecutorService.invokeAll(ForkJoinPoolHierarchicalTestExecutorService.java:166)
16:30:29 [2026-10-30T15:30:29.009Z] at org.junit.platform.engine.support.hierarchical.NodeTestTask.lambda$executeRecursively$6(NodeTestTask.java:161)
16:30:29 [2026-10-30T15:30:29.009Z] at org.junit.platform.engine.support.hierarchical.ThrowableCollector.execute(ThrowableCollector.java:73)
16:30:29 [2026-10-30T15:30:29.009Z] at org.junit.platform.engine.support.hierarchical.NodeTestTask.lambda$executeRecursively$8(NodeTestTask.java:147)
16:30:29 [2026-10-30T15:30:29.009Z] at org.junit.platform.engine.support.hierarchical.Node.around(Node.java:137)
16:30:29 [2026-10-30T15:30:29.009Z] at org.junit.platform.engine.support.hierarchical.NodeTestTask.lambda$executeRecursively$9(NodeTestTask.java:145)
16:30:29 [2026-10-30T15:30:29.009Z] at org.junit.platform.engine.support.hierarchical.ThrowableCollector.execute(ThrowableCollector.java:73)
16:30:29 [2026-10-30T15:30:29.009Z] at org.junit.platform.engine.support.hierarchical.NodeTestTask.executeRecursively(NodeTestTask.java:144)
16:30:29 [2026-10-30T15:30:29.009Z] at org.junit.platform.engine.support.hierarchical.NodeTestTask.execute(NodeTestTask.java:101)
16:30:29 [2026-10-30T15:30:29.009Z] at org.junit.platform.engine.support.hierarchical.ForkJoinPoolHierarchicalTestExecutorService$ExclusiveTask.exec(ForkJoinPoolHierarchicalTestExecutorService.java:274)
16:30:29 [2026-10-30T15:30:29.009Z] at org.junit.platform.engine.support.hierarchical.ForkJoinPoolHierarchicalTestExecutorService$ExclusiveTask.execSync(ForkJoinPoolHierarchicalTestExecutorService.java:247)
16:30:29 [2026-10-30T15:30:29.009Z] at org.junit.platform.engine.support.hierarchical.ForkJoinPoolHierarchicalTestExecutorService.executeSync(ForkJoinPoolHierarchicalTestExecutorService.java:194)
16:30:29 [2026-10-30T15:30:29.010Z] at org.junit.platform.engine.support.hierarchical.ForkJoinPoolHierarchicalTestExecutorService.invokeAll(ForkJoinPoolHierarchicalTestExecutorService.java:166)
16:30:29 [2026-10-30T15:30:29.010Z] at org.junit.platform.engine.support.hierarchical.NodeTestTask.lambda$executeRecursively$6(NodeTestTask.java:161)
16:30:29 [2026-10-30T15:30:29.010Z] at org.junit.platform.engine.support.hierarchical.ThrowableCollector.execute(ThrowableCollector.java:73)
16:30:29 [2026-10-30T15:30:29.010Z] at org.junit.platform.engine.support.hierarchical.NodeTestTask.lambda$executeRecursively$8(NodeTestTask.java:147)
16:30:29 [2026-10-30T15:30:29.010Z] at org.junit.platform.engine.support.hierarchical.Node.around(Node.java:137)
16:30:29 [2026-10-30T15:30:29.010Z] at org.junit.platform.engine.support.hierarchical.NodeTestTask.lambda$executeRecursively$9(NodeTestTask.java:145)
16:30:29 [2026-10-30T15:30:29.010Z] at org.junit.platform.engine.support.hierarchical.ThrowableCollector.execute(ThrowableCollector.java:73)
16:30:29 [2026-10-30T15:30:29.010Z] at org.junit.platform.engine.support.hierarchical.NodeTestTask.executeRecursively(NodeTestTask.java:144)
16:30:29 [2026-10-30T15:30:29.010Z] at org.junit.platform.engine.support.hierarchical.NodeTestTask.execute(NodeTestTask.java:101)
16:30:29 [2026-10-30T15:30:29.010Z] at org.junit.platform.engine.support.hierarchical.ForkJoinPoolHierarchicalTestExecutorService$ExclusiveTask.exec(ForkJoinPoolHierarchicalTestExecutorService.java:274)
16:30:29 [2026-10-30T15:30:29.010Z] at java.base/java.util.concurrent.ForkJoinTask.doExec(ForkJoinTask.java:387)
16:30:29 [2026-10-30T15:30:29.010Z] at java.base/java.util.concurrent.ForkJoinPool$WorkQueue.topLevelExec(ForkJoinPool.java:1312)
16:30:29 [2026-10-30T15:30:29.010Z] at java.base/java.util.concurrent.ForkJoinPool.scan(ForkJoinPool.java:1843)
16:30:29 [2026-10-30T15:30:29.010Z] at java.base/java.util.concurrent.ForkJoinPool.runWorker(ForkJoinPool.java:1808)
16:30:29 [2026-10-30T15:30:29.010Z] at java.base/java.util.concurrent.ForkJoinWorkerThread.run(ForkJoinWorkerThread.java:188)
16:30:29 [2026-10-30T15:30:29.010Z] Caused by: java.io.IOException: Error while instrumenting org/silverpeas/kernel/test/MyBean$MockitoMock$0n3lNhWJ$auxiliary$KmNhBtY9 with JaCoCo 0.8.8.202204050719/5dcf34a.
16:30:29 [2026-10-30T15:30:29.010Z] at org.jacoco.agent.rt.internal_b6258fc.core.instr.Instrumenter.instrumentError(Instrumenter.java:161)
16:30:29 [2026-10-30T15:30:29.010Z] at org.jacoco.agent.rt.internal_b6258fc.core.instr.Instrumenter.instrument(Instrumenter.java:111)
16:30:29 [2026-10-30T15:30:29.010Z] at org.jacoco.agent.rt.internal_b6258fc.CoverageTransformer.transform(CoverageTransformer.java:92)
16:30:29 [2026-10-30T15:30:29.010Z] ... 119 more
16:30:29 [2026-10-30T15:30:29.010Z] Caused by: java.lang.IllegalArgumentException: Unsupported class file major version 65
16:30:29 [2026-10-30T15:30:29.010Z] at org.jacoco.agent.rt.internal_b6258fc.asm.ClassReader.<init>(ClassReader.java:199)
16:30:29 [2026-10-30T15:30:29.010Z] at org.jacoco.agent.rt.internal_b6258fc.asm.ClassReader.<init>(ClassReader.java:180)
16:30:29 [2026-10-30T15:30:29.010Z] at org.jacoco.agent.rt.internal_b6258fc.asm.ClassReader.<init>(ClassReader.java:166)
16:30:29 [2026-10-30T15:30:29.010Z] at org.jacoco.agent.rt.internal_b6258fc.core.internal.instr.InstrSupport.classReaderFor(InstrSupport.java:280)
16:30:29 [2026-10-30T15:30:29.010Z] at org.jacoco.agent.rt.internal_b6258fc.core.instr.Instrumenter.instrument(Instrumenter.java:77)
16:30:29 [2026-10-30T15:30:29.010Z] at org.jacoco.agent.rt.internal_b6258fc.core.instr.Instrumenter.instrument(Instrumenter.java:109)
16:30:29 [2026-10-30T15:30:29.010Z] ... 120 more
16:30:29 [2026-10-30T15:30:29.010Z] [INFO] Tests run: 5, Failures: 0, Errors: 0, Skipped: 0, Time elapsed: 0.185 s - in org.silverpeas.kernel.test.DependencyResolverTest
16:30:29 [2026-10-30T15:30:29.561Z] [INFO]
16:30:29 [2026-10-30T15:30:29.561Z] [INFO] Results:
16:30:29 [2026-10-30T15:30:29.561Z] [INFO]
16:30:29 [2026-10-30T15:30:29.561Z] [INFO] Tests run: 41, Failures: 0, Errors: 0, Skipped: 0
16:30:29 [2026-10-30T15:30:29.561Z] [INFO]
16:30:29 [2026-10-30T15:30:29.561Z] [INFO]
16:30:29 [2026-10-30T15:30:29.561Z] [INFO] --- jar:3.3.0:jar (default-jar) @ silverpeas-kernel-test ---
16:30:29 [2026-10-30T15:30:29.561Z] [INFO] Building jar: /var/lib/jenkins/workspace/Silverpeas_Kernel_AutoDeploy/kernel-test/target/silverpeas-kernel-test-2.0-build261030.jar
16:30:29 [2026-10-30T15:30:29.561Z] [INFO]
16:30:29 [2026-10-30T15:30:29.561Z] [INFO] --- site:3.12.1:attach-descriptor (attach-descriptor) @ silverpeas-kernel-test ---
16:30:29 [2026-10-30T15:30:29.561Z] [INFO] Skipping because packaging 'jar' is not pom.
16:30:29 [2026-10-30T15:30:29.561Z] [INFO]
16:30:29 [2026-10-30T15:30:29.561Z] [INFO] --- source:3.2.1:jar-no-fork (bundle-source) @ silverpeas-kernel-test ---
16:30:29 [2026-10-30T15:30:29.561Z] [INFO] Building jar: /var/lib/jenkins/workspace/Silverpeas_Kernel_AutoDeploy/kernel-test/target/silverpeas-kernel-test-2.0-build261030-sources.jar
16:30:29 [2026-10-30T15:30:29.561Z] [INFO]
16:30:29 [2026-10-30T15:30:29.561Z] [INFO] --- javadoc:3.4.1:jar (attach-javadocs) @ silverpeas-kernel-test ---
16:30:29 [2026-10-30T15:30:29.561Z] [INFO] No previous run data found, generating javadoc.
16:30:32 [2026-10-30T15:30:32.043Z] [ERROR] MavenReportException: Error while generating Javadoc:
16:30:32 [2026-10-30T15:30:32.043Z] Exit code: 1 - warning: unknown enum constant When.ALWAYS
16:30:32 [2026-10-30T15:30:32.043Z] reason: class file for javax.annotation.meta.When not found
16:30:32 [2026-10-30T15:30:32.043Z] warning: unknown enum constant When.UNKNOWN
16:30:32 [2026-10-30T15:30:32.043Z] /var/lib/jenkins/workspace/Silverpeas_Kernel_AutoDeploy/kernel-test/src/main/java/org/silverpeas/kernel/test/DependencyResolver.java:57: warning: use of default constructor, which does not provide a comment
16:30:32 [2026-10-30T15:30:32.044Z] public class DependencyResolver {
16:30:32 [2026-10-30T15:30:32.044Z] ^
16:30:32 [2026-10-30T15:30:32.044Z] /var/lib/jenkins/workspace/Silverpeas_Kernel_AutoDeploy/kernel-test/src/main/java/org/silverpeas/kernel/test/extension/LocalizationBundleStub.java:79: warning: no comment
16:30:32 [2026-10-30T15:30:32.044Z] public LocalizationBundleStub(final String bundleName, String ...languages) {
16:30:32 [2026-10-30T15:30:32.044Z] ^
16:30:32 [2026-10-30T15:30:32.044Z] /var/lib/jenkins/workspace/Silverpeas_Kernel_AutoDeploy/kernel-test/src/main/java/org/silverpeas/kernel/test/extension/LocalizationBundleStub.java:139: warning: no comment
16:30:32 [2026-10-30T15:30:32.044Z] protected void clear() {
16:30:32 [2026-10-30T15:30:32.044Z] ^
16:30:32 [2026-10-30T15:30:32.044Z] /var/lib/jenkins/workspace/Silverpeas_Kernel_AutoDeploy/kernel-test/src/main/java/org/silverpeas/kernel/test/extension/LoggerExtension.java:44: warning: use of default constructor, which does not provide a comment
16:30:32 [2026-10-30T15:30:32.044Z] public class LoggerExtension implements BeforeEachCallback {
16:30:32 [2026-10-30T15:30:32.044Z] ^
16:30:32 [2026-10-30T15:30:32.044Z] /var/lib/jenkins/workspace/Silverpeas_Kernel_AutoDeploy/kernel-test/src/main/java/org/silverpeas/kernel/test/extension/LoggerLevel.java:46: warning: no comment
16:30:32 [2026-10-30T15:30:32.044Z] Level value();
16:30:32 [2026-10-30T15:30:32.044Z] ^
16:30:32 [2026-10-30T15:30:32.044Z] /var/lib/jenkins/workspace/Silverpeas_Kernel_AutoDeploy/kernel-test/src/main/java/org/silverpeas/kernel/test/util/Reflections.java:255: warning: no comment
16:30:32 [2026-10-30T15:30:32.044Z] void consume(final Class<?> type) throws ReflectiveOperationException;
16:30:32 [2026-10-30T15:30:32.044Z] ^
16:30:32 [2026-10-30T15:30:32.044Z] /var/lib/jenkins/workspace/Silverpeas_Kernel_AutoDeploy/kernel-test/src/main/java/org/silverpeas/kernel/test/extension/SettingBundleStub.java:64: warning: no main description
16:30:32 [2026-10-30T15:30:32.044Z] * @param cls the static class containing the setting attribute.
16:30:32 [2026-10-30T15:30:32.044Z] ^
16:30:32 [2026-10-30T15:30:32.044Z] /var/lib/jenkins/workspace/Silverpeas_Kernel_AutoDeploy/kernel-test/src/main/java/org/silverpeas/kernel/test/extension/SettingBundleStub.java:153: warning: no comment
16:30:32 [2026-10-30T15:30:32.044Z] protected void clear() throws IllegalAccessException {
16:30:32 [2026-10-30T15:30:32.044Z] ^
16:30:32 [2026-10-30T15:30:32.044Z] /var/lib/jenkins/workspace/Silverpeas_Kernel_AutoDeploy/kernel-test/src/main/java/org/silverpeas/kernel/test/util/SilverpeasReflectionException.java:34: warning: no comment
16:30:32 [2026-10-30T15:30:32.044Z] public SilverpeasReflectionException(String message) {
16:30:32 [2026-10-30T15:30:32.044Z] ^
16:30:32 [2026-10-30T15:30:32.044Z] /var/lib/jenkins/workspace/Silverpeas_Kernel_AutoDeploy/kernel-test/src/main/java/org/silverpeas/kernel/test/util/SilverpeasReflectionException.java:38: warning: no comment
16:30:32 [2026-10-30T15:30:32.044Z] public SilverpeasReflectionException(String message, Throwable cause) {
16:30:32 [2026-10-30T15:30:32.044Z] ^
16:30:32 [2026-10-30T15:30:32.044Z] /var/lib/jenkins/workspace/Silverpeas_Kernel_AutoDeploy/kernel-test/src/main/java/org/silverpeas/kernel/test/util/SilverpeasReflectionException.java:42: warning: no comment
16:30:32 [2026-10-30T15:30:32.044Z] public SilverpeasReflectionException(Throwable t) {
16:30:32 [2026-10-30T15:30:32.044Z] ^
16:30:32 [2026-10-30T15:30:32.044Z] /var/lib/jenkins/workspace/Silverpeas_Kernel_AutoDeploy/kernel-test/src/main/java/org/silverpeas/kernel/test/extension/SilverTestEnv.java:133: error: unexpected end tag: </p>
16:30:32 [2026-10-30T15:30:32.044Z] * </p>
16:30:32 [2026-10-30T15:30:32.044Z] ^
16:30:32 [2026-10-30T15:30:32.044Z] /var/lib/jenkins/workspace/Silverpeas_Kernel_AutoDeploy/kernel-test/src/main/java/org/silverpeas/kernel/test/extension/SilverTestEnv.java:89: warning: use of default constructor, which does not provide a comment
16:30:32 [2026-10-30T15:30:32.044Z] public class SilverTestEnv
16:30:32 [2026-10-30T15:30:32.044Z] ^
16:30:32 [2026-10-30T15:30:32.044Z] /var/lib/jenkins/workspace/Silverpeas_Kernel_AutoDeploy/kernel-test/src/main/java/org/silverpeas/kernel/test/extension/SilverTestEnvContext.java:42: warning: use of default constructor, which does not provide a comment
16:30:32 [2026-10-30T15:30:32.044Z] public abstract class SilverTestEnvContext {
16:30:32 [2026-10-30T15:30:32.044Z] ^
16:30:32 [2026-10-30T15:30:32.044Z] /var/lib/jenkins/workspace/Silverpeas_Kernel_AutoDeploy/kernel-test/src/main/java/org/silverpeas/kernel/test/annotations/SystemProperties.java:42: warning: no comment
16:30:32 [2026-10-30T15:30:32.044Z] SystemProperty[] value();
16:30:32 [2026-10-30T15:30:32.044Z] ^
16:30:32 [2026-10-30T15:30:32.044Z] /var/lib/jenkins/workspace/Silverpeas_Kernel_AutoDeploy/kernel-test/src/main/java/org/silverpeas/kernel/test/annotations/SystemProperty.java:43: warning: no comment
16:30:32 [2026-10-30T15:30:32.044Z] String key();
16:30:32 [2026-10-30T15:30:32.044Z] ^
16:30:32 [2026-10-30T15:30:32.044Z] /var/lib/jenkins/workspace/Silverpeas_Kernel_AutoDeploy/kernel-test/src/main/java/org/silverpeas/kernel/test/annotations/SystemProperty.java:45: warning: no comment
16:30:32 [2026-10-30T15:30:32.044Z] String value();
16:30:32 [2026-10-30T15:30:32.044Z] ^
16:30:32 [2026-10-30T15:30:32.044Z] /var/lib/jenkins/workspace/Silverpeas_Kernel_AutoDeploy/kernel-test/src/main/java/org/silverpeas/kernel/test/TestBeanContainer.java:164: warning: no @param for <T>
16:30:32 [2026-10-30T15:30:32.044Z] public <T> void putBean(Class<T> beanType, Class<? super T> type, Annotation... qualifiers) {
16:30:32 [2026-10-30T15:30:32.044Z] ^
16:30:32 [2026-10-30T15:30:32.044Z] /var/lib/jenkins/workspace/Silverpeas_Kernel_AutoDeploy/kernel-test/src/main/java/org/silverpeas/kernel/test/TestBeanContainer.java:74: warning: use of default constructor, which does not provide a comment
16:30:32 [2026-10-30T15:30:32.044Z] public class TestBeanContainer implements BeanContainer {
16:30:32 [2026-10-30T15:30:32.044Z] ^
16:30:32 [2026-10-30T15:30:32.044Z] /var/lib/jenkins/workspace/Silverpeas_Kernel_AutoDeploy/kernel-test/src/main/java/org/silverpeas/kernel/test/TestContext.java:45: warning: no comment
16:30:32 [2026-10-30T15:30:32.044Z] public static TestContext getInstance() {
16:30:32 [2026-10-30T15:30:32.044Z] ^
16:30:32 [2026-10-30T15:30:32.044Z] /var/lib/jenkins/workspace/Silverpeas_Kernel_AutoDeploy/kernel-test/src/main/java/org/silverpeas/kernel/TestManagedBeanFeeder.java:42: warning: use of default constructor, which does not provide a comment
16:30:32 [2026-10-30T15:30:32.044Z] public final class TestManagedBeanFeeder {
16:30:32 [2026-10-30T15:30:32.044Z] ^
16:30:32 [2026-10-30T15:30:32.044Z] /var/lib/jenkins/workspace/Silverpeas_Kernel_AutoDeploy/kernel-test/src/main/java/org/silverpeas/kernel/test/annotations/TestManagedBeans.java:43: warning: no comment
16:30:32 [2026-10-30T15:30:32.044Z] Class<?>[] value();
16:30:32 [2026-10-30T15:30:32.044Z] ^
16:30:32 [2026-10-30T15:30:32.044Z] /var/lib/jenkins/workspace/Silverpeas_Kernel_AutoDeploy/kernel-test/src/main/java/org/silverpeas/kernel/test/annotations/TestManagedMock.java:65: warning: no @return
16:30:32 [2026-10-30T15:30:32.044Z] boolean stubbed() default true;
16:30:32 [2026-10-30T15:30:32.044Z] ^
16:30:32 [2026-10-30T15:30:32.044Z] /var/lib/jenkins/workspace/Silverpeas_Kernel_AutoDeploy/kernel-test/src/main/java/org/silverpeas/kernel/test/annotations/TestManagedMocks.java:43: warning: no comment
16:30:32 [2026-10-30T15:30:32.044Z] Class<?>[] value();
16:30:32 [2026-10-30T15:30:32.044Z] ^
16:30:32 [2026-10-30T15:30:32.044Z] /var/lib/jenkins/workspace/Silverpeas_Kernel_AutoDeploy/kernel-test/src/main/java/org/silverpeas/kernel/test/TestResourcesLocation.java:39: warning: use of default constructor, which does not provide a comment
16:30:32 [2026-10-30T15:30:32.044Z] public class TestResourcesLocation implements SilverpeasResourcesLocation {
16:30:32 [2026-10-30T15:30:32.044Z] ^
16:30:32 [2026-10-30T15:30:32.044Z] /var/lib/jenkins/workspace/Silverpeas_Kernel_AutoDeploy/kernel-test/src/main/java/org/silverpeas/kernel/test/TestSystemWrapper.java:45: warning: no comment
16:30:32 [2026-10-30T15:30:32.044Z] public TestSystemWrapper() {
16:30:32 [2026-10-30T15:30:32.044Z] ^
16:30:32 [2026-10-30T15:30:32.044Z] 1 error
16:30:32 [2026-10-30T15:30:32.044Z] 27 warnings
16:30:32 [2026-10-30T15:30:32.044Z]
16:30:32 [2026-10-30T15:30:32.044Z] Command line was: /usr/lib/jvm/java-21-openjdk-amd64/bin/javadoc @options @packages
16:30:32 [2026-10-30T15:30:32.044Z]
16:30:32 [2026-10-30T15:30:32.044Z] Refer to the generated Javadoc files in '/var/lib/jenkins/workspace/Silverpeas_Kernel_AutoDeploy/kernel-test/target/apidocs' dir.
16:30:32 [2026-10-30T15:30:32.044Z]
16:30:32 [2026-10-30T15:30:32.044Z] org.apache.maven.reporting.MavenReportException:
16:30:32 [2026-10-30T15:30:32.044Z] Exit code: 1 - warning: unknown enum constant When.ALWAYS
16:30:32 [2026-10-30T15:30:32.044Z] reason: class file for javax.annotation.meta.When not found
16:30:32 [2026-10-30T15:30:32.044Z] warning: unknown enum constant When.UNKNOWN
16:30:32 [2026-10-30T15:30:32.044Z] /var/lib/jenkins/workspace/Silverpeas_Kernel_AutoDeploy/kernel-test/src/main/java/org/silverpeas/kernel/test/DependencyResolver.java:57: warning: use of default constructor, which does not provide a comment
16:30:32 [2026-10-30T15:30:32.044Z] public class DependencyResolver {
16:30:32 [2026-10-30T15:30:32.044Z] ^
16:30:32 [2026-10-30T15:30:32.044Z] /var/lib/jenkins/workspace/Silverpeas_Kernel_AutoDeploy/kernel-test/src/main/java/org/silverpeas/kernel/test/extension/LocalizationBundleStub.java:79: warning: no comment
16:30:32 [2026-10-30T15:30:32.044Z] public LocalizationBundleStub(final String bundleName, String ...languages) {
16:30:32 [2026-10-30T15:30:32.044Z] ^
16:30:32 [2026-10-30T15:30:32.044Z] /var/lib/jenkins/workspace/Silverpeas_Kernel_AutoDeploy/kernel-test/src/main/java/org/silverpeas/kernel/test/extension/LocalizationBundleStub.java:139: warning: no comment
16:30:32 [2026-10-30T15:30:32.044Z] protected void clear() {
16:30:32 [2026-10-30T15:30:32.044Z] ^
16:30:32 [2026-10-30T15:30:32.044Z] /var/lib/jenkins/workspace/Silverpeas_Kernel_AutoDeploy/kernel-test/src/main/java/org/silverpeas/kernel/test/extension/LoggerExtension.java:44: warning: use of default constructor, which does not provide a comment
16:30:32 [2026-10-30T15:30:32.044Z] public class LoggerExtension implements BeforeEachCallback {
16:30:32 [2026-10-30T15:30:32.044Z] ^
16:30:32 [2026-10-30T15:30:32.044Z] /var/lib/jenkins/workspace/Silverpeas_Kernel_AutoDeploy/kernel-test/src/main/java/org/silverpeas/kernel/test/extension/LoggerLevel.java:46: warning: no comment
16:30:32 [2026-10-30T15:30:32.044Z] Level value();
16:30:32 [2026-10-30T15:30:32.044Z] ^
16:30:32 [2026-10-30T15:30:32.044Z] /var/lib/jenkins/workspace/Silverpeas_Kernel_AutoDeploy/kernel-test/src/main/java/org/silverpeas/kernel/test/util/Reflections.java:255: warning: no comment
16:30:32 [2026-10-30T15:30:32.044Z] void consume(final Class<?> type) throws ReflectiveOperationException;
16:30:32 [2026-10-30T15:30:32.044Z] ^
16:30:32 [2026-10-30T15:30:32.044Z] /var/lib/jenkins/workspace/Silverpeas_Kernel_AutoDeploy/kernel-test/src/main/java/org/silverpeas/kernel/test/extension/SettingBundleStub.java:64: warning: no main description
16:30:32 [2026-10-30T15:30:32.044Z] * @param cls the static class containing the setting attribute.
16:30:32 [2026-10-30T15:30:32.044Z] ^
16:30:32 [2026-10-30T15:30:32.044Z] /var/lib/jenkins/workspace/Silverpeas_Kernel_AutoDeploy/kernel-test/src/main/java/org/silverpeas/kernel/test/extension/SettingBundleStub.java:153: warning: no comment
16:30:32 [2026-10-30T15:30:32.044Z] protected void clear() throws IllegalAccessException {
16:30:32 [2026-10-30T15:30:32.044Z] ^
16:30:32 [2026-10-30T15:30:32.044Z] /var/lib/jenkins/workspace/Silverpeas_Kernel_AutoDeploy/kernel-test/src/main/java/org/silverpeas/kernel/test/util/SilverpeasReflectionException.java:34: warning: no comment
16:30:32 [2026-10-30T15:30:32.044Z] public SilverpeasReflectionException(String message) {
16:30:32 [2026-10-30T15:30:32.044Z] ^
16:30:32 [2026-10-30T15:30:32.044Z] /var/lib/jenkins/workspace/Silverpeas_Kernel_AutoDeploy/kernel-test/src/main/java/org/silverpeas/kernel/test/util/SilverpeasReflectionException.java:38: warning: no comment
16:30:32 [2026-10-30T15:30:32.044Z] public SilverpeasReflectionException(String message, Throwable cause) {
16:30:32 [2026-10-30T15:30:32.044Z] ^
16:30:32 [2026-10-30T15:30:32.044Z] /var/lib/jenkins/workspace/Silverpeas_Kernel_AutoDeploy/kernel-test/src/main/java/org/silverpeas/kernel/test/util/SilverpeasReflectionException.java:42: warning: no comment
16:30:32 [2026-10-30T15:30:32.044Z] public SilverpeasReflectionException(Throwable t) {
16:30:32 [2026-10-30T15:30:32.044Z] ^
16:30:32 [2026-10-30T15:30:32.044Z] /var/lib/jenkins/workspace/Silverpeas_Kernel_AutoDeploy/kernel-test/src/main/java/org/silverpeas/kernel/test/extension/SilverTestEnv.java:133: error: unexpected end tag: </p>
16:30:32 [2026-10-30T15:30:32.044Z] * </p>
16:30:32 [2026-10-30T15:30:32.044Z] ^
16:30:32 [2026-10-30T15:30:32.044Z] /var/lib/jenkins/workspace/Silverpeas_Kernel_AutoDeploy/kernel-test/src/main/java/org/silverpeas/kernel/test/extension/SilverTestEnv.java:89: warning: use of default constructor, which does not provide a comment
16:30:32 [2026-10-30T15:30:32.044Z] public class SilverTestEnv
16:30:32 [2026-10-30T15:30:32.044Z] ^
16:30:32 [2026-10-30T15:30:32.044Z] /var/lib/jenkins/workspace/Silverpeas_Kernel_AutoDeploy/kernel-test/src/main/java/org/silverpeas/kernel/test/extension/SilverTestEnvContext.java:42: warning: use of default constructor, which does not provide a comment
16:30:32 [2026-10-30T15:30:32.044Z] public abstract class SilverTestEnvContext {
16:30:32 [2026-10-30T15:30:32.044Z] ^
16:30:32 [2026-10-30T15:30:32.044Z] /var/lib/jenkins/workspace/Silverpeas_Kernel_AutoDeploy/kernel-test/src/main/java/org/silverpeas/kernel/test/annotations/SystemProperties.java:42: warning: no comment
16:30:32 [2026-10-30T15:30:32.044Z] SystemProperty[] value();
16:30:32 [2026-10-30T15:30:32.044Z] ^
16:30:32 [2026-10-30T15:30:32.044Z] /var/lib/jenkins/workspace/Silverpeas_Kernel_AutoDeploy/kernel-test/src/main/java/org/silverpeas/kernel/test/annotations/SystemProperty.java:43: warning: no comment
16:30:32 [2026-10-30T15:30:32.044Z] String key();
16:30:32 [2026-10-30T15:30:32.044Z] ^
16:30:32 [2026-10-30T15:30:32.044Z] /var/lib/jenkins/workspace/Silverpeas_Kernel_AutoDeploy/kernel-test/src/main/java/org/silverpeas/kernel/test/annotations/SystemProperty.java:45: warning: no comment
16:30:32 [2026-10-30T15:30:32.044Z] String value();
16:30:32 [2026-10-30T15:30:32.044Z] ^
16:30:32 [2026-10-30T15:30:32.044Z] /var/lib/jenkins/workspace/Silverpeas_Kernel_AutoDeploy/kernel-test/src/main/java/org/silverpeas/kernel/test/TestBeanContainer.java:164: warning: no @param for <T>
16:30:32 [2026-10-30T15:30:32.044Z] public <T> void putBean(Class<T> beanType, Class<? super T> type, Annotation... qualifiers) {
16:30:32 [2026-10-30T15:30:32.044Z] ^
16:30:32 [2026-10-30T15:30:32.044Z] /var/lib/jenkins/workspace/Silverpeas_Kernel_AutoDeploy/kernel-test/src/main/java/org/silverpeas/kernel/test/TestBeanContainer.java:74: warning: use of default constructor, which does not provide a comment
16:30:32 [2026-10-30T15:30:32.044Z] public class TestBeanContainer implements BeanContainer {
16:30:32 [2026-10-30T15:30:32.044Z] ^
16:30:32 [2026-10-30T15:30:32.044Z] /var/lib/jenkins/workspace/Silverpeas_Kernel_AutoDeploy/kernel-test/src/main/java/org/silverpeas/kernel/test/TestContext.java:45: warning: no comment
16:30:32 [2026-10-30T15:30:32.044Z] public static TestContext getInstance() {
16:30:32 [2026-10-30T15:30:32.044Z] ^
16:30:32 [2026-10-30T15:30:32.044Z] /var/lib/jenkins/workspace/Silverpeas_Kernel_AutoDeploy/kernel-test/src/main/java/org/silverpeas/kernel/TestManagedBeanFeeder.java:42: warning: use of default constructor, which does not provide a comment
16:30:32 [2026-10-30T15:30:32.044Z] public final class TestManagedBeanFeeder {
16:30:32 [2026-10-30T15:30:32.044Z] ^
16:30:32 [2026-10-30T15:30:32.044Z] /var/lib/jenkins/workspace/Silverpeas_Kernel_AutoDeploy/kernel-test/src/main/java/org/silverpeas/kernel/test/annotations/TestManagedBeans.java:43: warning: no comment
16:30:32 [2026-10-30T15:30:32.044Z] Class<?>[] value();
16:30:32 [2026-10-30T15:30:32.044Z] ^
16:30:32 [2026-10-30T15:30:32.044Z] /var/lib/jenkins/workspace/Silverpeas_Kernel_AutoDeploy/kernel-test/src/main/java/org/silverpeas/kernel/test/annotations/TestManagedMock.java:65: warning: no @return
16:30:32 [2026-10-30T15:30:32.044Z] boolean stubbed() default true;
16:30:32 [2026-10-30T15:30:32.044Z] ^
16:30:32 [2026-10-30T15:30:32.044Z] /var/lib/jenkins/workspace/Silverpeas_Kernel_AutoDeploy/kernel-test/src/main/java/org/silverpeas/kernel/test/annotations/TestManagedMocks.java:43: warning: no comment
16:30:32 [2026-10-30T15:30:32.044Z] Class<?>[] value();
16:30:32 [2026-10-30T15:30:32.044Z] ^
16:30:32 [2026-10-30T15:30:32.044Z] /var/lib/jenkins/workspace/Silverpeas_Kernel_AutoDeploy/kernel-test/src/main/java/org/silverpeas/kernel/test/TestResourcesLocation.java:39: warning: use of default constructor, which does not provide a comment
16:30:32 [2026-10-30T15:30:32.044Z] public class TestResourcesLocation implements SilverpeasResourcesLocation {
16:30:32 [2026-10-30T15:30:32.044Z] ^
16:30:32 [2026-10-30T15:30:32.045Z] /var/lib/jenkins/workspace/Silverpeas_Kernel_AutoDeploy/kernel-test/src/main/java/org/silverpeas/kernel/test/TestSystemWrapper.java:45: warning: no comment
16:30:32 [2026-10-30T15:30:32.045Z] public TestSystemWrapper() {
16:30:32 [2026-10-30T15:30:32.045Z] ^
16:30:32 [2026-10-30T15:30:32.045Z] 1 error
16:30:32 [2026-10-30T15:30:32.045Z] 27 warnings
16:30:32 [2026-10-30T15:30:32.045Z]
16:30:32 [2026-10-30T15:30:32.045Z] Command line was: /usr/lib/jvm/java-21-openjdk-amd64/bin/javadoc @options @packages
16:30:32 [2026-10-30T15:30:32.045Z]
16:30:32 [2026-10-30T15:30:32.045Z] Refer to the generated Javadoc files in '/var/lib/jenkins/workspace/Silverpeas_Kernel_AutoDeploy/kernel-test/target/apidocs' dir.
16:30:32 [2026-10-30T15:30:32.045Z]
16:30:32 [2026-10-30T15:30:32.045Z] at org.apache.maven.plugins.javadoc.AbstractJavadocMojo.doExecuteJavadocCommandLine (AbstractJavadocMojo.java:6092)
16:30:32 [2026-10-30T15:30:32.045Z] at org.apache.maven.plugins.javadoc.AbstractJavadocMojo.executeJavadocCommandLine (AbstractJavadocMojo.java:5968)
16:30:32 [2026-10-30T15:30:32.045Z] at org.apache.maven.plugins.javadoc.AbstractJavadocMojo.executeReport (AbstractJavadocMojo.java:2277)
16:30:32 [2026-10-30T15:30:32.045Z] at org.apache.maven.plugins.javadoc.JavadocJar.doExecute (JavadocJar.java:189)
16:30:32 [2026-10-30T15:30:32.045Z] at org.apache.maven.plugins.javadoc.AbstractJavadocMojo.execute (AbstractJavadocMojo.java:2034)
16:30:32 [2026-10-30T15:30:32.045Z] at org.apache.maven.plugin.DefaultBuildPluginManager.executeMojo (DefaultBuildPluginManager.java:126)
16:30:32 [2026-10-30T15:30:32.045Z] at org.apache.maven.lifecycle.internal.MojoExecutor.doExecute2 (MojoExecutor.java:328)
16:30:32 [2026-10-30T15:30:32.045Z] at org.apache.maven.lifecycle.internal.MojoExecutor.doExecute (MojoExecutor.java:316)
16:30:32 [2026-10-30T15:30:32.045Z] at org.apache.maven.lifecycle.internal.MojoExecutor.execute (MojoExecutor.java:212)
16:30:32 [2026-10-30T15:30:32.045Z] at org.apache.maven.lifecycle.internal.MojoExecutor.execute (MojoExecutor.java:174)
16:30:32 [2026-10-30T15:30:32.045Z] at org.apache.maven.lifecycle.internal.MojoExecutor.access$000 (MojoExecutor.java:75)
16:30:32 [2026-10-30T15:30:32.045Z] at org.apache.maven.lifecycle.internal.MojoExecutor$1.run (MojoExecutor.java:162)
16:30:32 [2026-10-30T15:30:32.045Z] at org.apache.maven.plugin.DefaultMojosExecutionStrategy.execute (DefaultMojosExecutionStrategy.java:39)
16:30:32 [2026-10-30T15:30:32.045Z] at org.apache.maven.lifecycle.internal.MojoExecutor.execute (MojoExecutor.java:159)
16:30:32 [2026-10-30T15:30:32.045Z] at org.apache.maven.lifecycle.internal.LifecycleModuleBuilder.buildProject (LifecycleModuleBuilder.java:105)
16:30:32 [2026-10-30T15:30:32.045Z] at org.apache.maven.lifecycle.internal.LifecycleModuleBuilder.buildProject (LifecycleModuleBuilder.java:73)
16:30:32 [2026-10-30T15:30:32.045Z] at org.apache.maven.lifecycle.internal.builder.singlethreaded.SingleThreadedBuilder.build (SingleThreadedBuilder.java:53)
16:30:32 [2026-10-30T15:30:32.045Z] at org.apache.maven.lifecycle.internal.LifecycleStarter.execute (LifecycleStarter.java:118)
16:30:32 [2026-10-30T15:30:32.045Z] at org.apache.maven.DefaultMaven.doExecute (DefaultMaven.java:261)
16:30:32 [2026-10-30T15:30:32.045Z] at org.apache.maven.DefaultMaven.doExecute (DefaultMaven.java:173)
16:30:32 [2026-10-30T15:30:32.045Z] at org.apache.maven.DefaultMaven.execute (DefaultMaven.java:101)
16:30:32 [2026-10-30T15:30:32.045Z] at org.apache.maven.cli.MavenCli.execute (MavenCli.java:919)
16:30:32 [2026-10-30T15:30:32.045Z] at org.apache.maven.cli.MavenCli.doMain (MavenCli.java:285)
16:30:32 [2026-10-30T15:30:32.045Z] at org.apache.maven.cli.MavenCli.main (MavenCli.java:207)
16:30:32 [2026-10-30T15:30:32.045Z] at jdk.internal.reflect.DirectMethodHandleAccessor.invoke (DirectMethodHandleAccessor.java:103)
16:30:32 [2026-10-30T15:30:32.045Z] at java.lang.reflect.Method.invoke (Method.java:580)
16:30:32 [2026-10-30T15:30:32.045Z] at org.codehaus.plexus.classworlds.launcher.Launcher.launchEnhanced (Launcher.java:255)
16:30:32 [2026-10-30T15:30:32.045Z] at org.codehaus.plexus.classworlds.launcher.Launcher.launch (Launcher.java:201)
16:30:32 [2026-10-30T15:30:32.045Z] at org.codehaus.plexus.classworlds.launcher.Launcher.mainWithExitCode (Launcher.java:362)
16:30:32 [2026-10-30T15:30:32.045Z] at org.codehaus.plexus.classworlds.launcher.Launcher.main (Launcher.java:314)
16:30:32 [2026-10-30T15:30:32.045Z] [INFO] Building jar: /var/lib/jenkins/workspace/Silverpeas_Kernel_AutoDeploy/kernel-test/target/silverpeas-kernel-test-2.0-build261030-javadoc.jar
16:30:32 [2026-10-30T15:30:32.045Z] [INFO]
16:30:32 [2026-10-30T15:30:32.045Z] [INFO] --- jacoco:0.8.8:report (tests-coverage) @ silverpeas-kernel-test ---
16:30:32 [2026-10-30T15:30:32.045Z] [INFO] Loading execution data file /var/lib/jenkins/workspace/Silverpeas_Kernel_AutoDeploy/kernel-test/target/jacoco.exec
16:30:32 [2026-10-30T15:30:32.045Z] [INFO] Analyzed bundle 'Silverpeas Kernel Test Library' with 19 classes
16:30:32 [2026-10-30T15:30:32.296Z] [INFO]
16:30:32 [2026-10-30T15:30:32.296Z] [INFO] --- install:3.0.1:install (default-install) @ silverpeas-kernel-test ---
16:30:32 [2026-10-30T15:30:32.296Z] [INFO] Installing /var/lib/jenkins/workspace/Silverpeas_Kernel_AutoDeploy/kernel-test/pom.xml to /home/silverbuild/.m2/repository/org/silverpeas/kernel/silverpeas-kernel-test/2.0-build261030/silverpeas-kernel-test-2.0-build261030.pom
16:30:32 [2026-10-30T15:30:32.296Z] [INFO] Installing /var/lib/jenkins/workspace/Silverpeas_Kernel_AutoDeploy/kernel-test/target/silverpeas-kernel-test-2.0-build261030.jar to /home/silverbuild/.m2/repository/org/silverpeas/kernel/silverpeas-kernel-test/2.0-build261030/silverpeas-kernel-test-2.0-build261030.jar
16:30:32 [2026-10-30T15:30:32.296Z] [INFO] Installing /var/lib/jenkins/workspace/Silverpeas_Kernel_AutoDeploy/kernel-test/target/silverpeas-kernel-test-2.0-build261030-sources.jar to /home/silverbuild/.m2/repository/org/silverpeas/kernel/silverpeas-kernel-test/2.0-build261030/silverpeas-kernel-test-2.0-build261030-sources.jar
16:30:32 [2026-10-30T15:30:32.296Z] [INFO] Installing /var/lib/jenkins/workspace/Silverpeas_Kernel_AutoDeploy/kernel-test/target/silverpeas-kernel-test-2.0-build261030-javadoc.jar to /home/silverbuild/.m2/repository/org/silverpeas/kernel/silverpeas-kernel-test/2.0-build261030/silverpeas-kernel-test-2.0-build261030-javadoc.jar
16:30:32 [2026-10-30T15:30:32.296Z] [INFO] ------------------------------------------------------------------------
16:30:32 [2026-10-30T15:30:32.296Z] [INFO] Reactor Summary for Silverpeas Kernel 2.0-build261030:
16:30:32 [2026-10-30T15:30:32.296Z] [INFO]
16:30:32 [2026-10-30T15:30:32.296Z] [INFO] Silverpeas Kernel .................................. SUCCESS [ 22.664 s]
16:30:32 [2026-10-30T15:30:32.296Z] [INFO] Silverpeas Kernel Library .......................... SUCCESS [ 20.320 s]
16:30:32 [2026-10-30T15:30:32.296Z] [INFO] Silverpeas Kernel Test Library ..................... SUCCESS [ 8.761 s]
16:30:32 [2026-10-30T15:30:32.296Z] [INFO] ------------------------------------------------------------------------
16:30:32 [2026-10-30T15:30:32.296Z] [INFO] BUILD SUCCESS
16:30:32 [2026-10-30T15:30:32.296Z] [INFO] ------------------------------------------------------------------------
16:30:32 [2026-10-30T15:30:32.296Z] [INFO] Total time: 51.956 s
16:30:32 [2026-10-30T15:30:32.296Z] [INFO] Finished at: 2026-10-30T16:30:32+01:00
16:30:32 [2026-10-30T15:30:32.296Z] [INFO] ------------------------------------------------------------------------