Console Output
08:57:40 [2025-11-27T07:57:40.045Z] + mvn deploy -DaltDeploymentRepository=silverpeas::default::https://nexus3.silverpeas.org/repository/builds -Pdeployment -Djava.awt.headless=true -Dmaven.test.skip=true
08:57:41 [2025-11-27T07:57:41.389Z] [INFO] Scanning for projects...
08:57:41 [2025-11-27T07:57:41.639Z] [INFO] ------------------------------------------------------------------------
08:57:41 [2025-11-27T07:57:41.639Z] [INFO] Reactor Build Order:
08:57:41 [2025-11-27T07:57:41.639Z] [INFO]
08:57:41 [2025-11-27T07:57:41.639Z] [INFO] Silverpeas Core [pom]
08:57:41 [2025-11-27T07:57:41.639Z] [INFO] Silverpeas Core Configuration 6.4.5-build251127 [jar]
08:57:41 [2025-11-27T07:57:41.639Z] [INFO] Silverpeas Core Api 6.4.5-build251127 [jar]
08:57:41 [2025-11-27T07:57:41.639Z] [INFO] Silverpeas Core Test 6.4.5-build251127 [jar]
08:57:41 [2025-11-27T07:57:41.639Z] [INFO] Silverpeas Core JCR Provider 6.4.5-build251127 [jar]
08:57:41 [2025-11-27T07:57:41.639Z] [INFO] Silverpeas Core Library 6.4.5-build251127 [jar]
08:57:41 [2025-11-27T07:57:41.639Z] [INFO] Silverpeas Core Services 6.4.5-build251127 [pom]
08:57:41 [2025-11-27T07:57:41.639Z] [INFO] Silverpeas Tagcloud EJB 6.4.5-build251127 [jar]
08:57:41 [2025-11-27T07:57:41.639Z] [INFO] Silverpeas Statistics Service 6.4.5-build251127 [jar]
08:57:41 [2025-11-27T07:57:41.639Z] [INFO] Silverpeas Contact Service 6.4.5-build251127 [jar]
08:57:41 [2025-11-27T07:57:41.639Z] [INFO] Silverpeas Calendar Service 6.4.5-build251127 [jar]
08:57:41 [2025-11-27T07:57:41.639Z] [INFO] Silverpeas Comment Service 6.4.5-build251127 [jar]
08:57:41 [2025-11-27T07:57:41.639Z] [INFO] Silverpeas PdC Service 6.4.5-build251127 [jar]
08:57:41 [2025-11-27T07:57:41.639Z] [INFO] Silverpeas My Links Service 6.4.5-build251127 [jar]
08:57:41 [2025-11-27T07:57:41.639Z] [INFO] Silverpeas Question Container Service 6.4.5-build251127 [jar]
08:57:41 [2025-11-27T07:57:41.639Z] [INFO] Silverpeas ImportExport Service 6.4.5-build251127 [jar]
08:57:41 [2025-11-27T07:57:41.639Z] [INFO] Silverpeas Document Viewer Service 6.4.5-build251127 [jar]
08:57:41 [2025-11-27T07:57:41.639Z] [INFO] Silverpeas Workflow Engine Service 6.4.5-build251127 [jar]
08:57:41 [2025-11-27T07:57:41.639Z] [INFO] Silverpeas Sharing Service 6.4.5-build251127 [jar]
08:57:41 [2025-11-27T07:57:41.639Z] [INFO] Silverpeas Search Service 6.4.5-build251127 [jar]
08:57:41 [2025-11-27T07:57:41.639Z] [INFO] Silverpeas Chat Service 6.4.5-build251127 [jar]
08:57:41 [2025-11-27T07:57:41.639Z] [INFO] Silverpeas Document Template Service 6.4.5-build251127 [jar]
08:57:41 [2025-11-27T07:57:41.639Z] [INFO] Silverpeas Core JAX-RS API 6.4.5-build251127 [jar]
08:57:41 [2025-11-27T07:57:41.639Z] [INFO] Silverpeas Core Web Test 6.4.5-build251127 [jar]
08:57:41 [2025-11-27T07:57:41.639Z] [INFO] Silverpeas Core Web 6.4.5-build251127 [jar]
08:57:41 [2025-11-27T07:57:41.639Z] [INFO] Silverpeas Core Web Archive 6.4.5-build251127 [war]
08:57:41 [2025-11-27T07:57:41.639Z] [INFO]
08:57:41 [2025-11-27T07:57:41.639Z] [INFO] ------------------------< org.silverpeas:core >-------------------------
08:57:41 [2025-11-27T07:57:41.639Z] [INFO] Building Silverpeas Core 6.4.5-build251127 [1/26]
08:57:41 [2025-11-27T07:57:41.639Z] [INFO] from pom.xml
08:57:41 [2025-11-27T07:57:41.639Z] [INFO] --------------------------------[ pom ]---------------------------------
08:57:41 [2025-11-27T07:57:41.890Z] [INFO]
08:57:41 [2025-11-27T07:57:41.890Z] [INFO] --- git-commit-id-plugin:4.9.10:revision (default) @ core ---
08:57:42 [2025-11-27T07:57:42.140Z] [INFO]
08:57:42 [2025-11-27T07:57:42.140Z] [INFO] --- maven-site-plugin:3.12.1:attach-descriptor (attach-descriptor) @ core ---
08:57:43 [2025-11-27T07:57:43.051Z] [INFO] Attaching 'src/site/site.xml' site descriptor with classifier 'site'.
08:57:43 [2025-11-27T07:57:43.051Z] [INFO]
08:57:43 [2025-11-27T07:57:43.051Z] [INFO] --- maven-source-plugin:3.2.1:jar-no-fork (bundle-source) @ core ---
08:57:43 [2025-11-27T07:57:43.051Z] [INFO]
08:57:43 [2025-11-27T07:57:43.051Z] [INFO] --- maven-javadoc-plugin:3.4.1:jar (attach-javadocs) @ core ---
08:57:43 [2025-11-27T07:57:43.602Z] [INFO] Not executing Javadoc as the project is not a Java classpath-capable package
08:57:43 [2025-11-27T07:57:43.602Z] [INFO]
08:57:43 [2025-11-27T07:57:43.602Z] [INFO] --- maven-source-plugin:3.2.1:jar-no-fork (attach-sources) @ core ---
08:57:43 [2025-11-27T07:57:43.602Z] [INFO]
08:57:43 [2025-11-27T07:57:43.602Z] [INFO] --- maven-install-plugin:3.0.1:install (default-install) @ core ---
08:57:43 [2025-11-27T07:57:43.602Z] [INFO] Installing /var/lib/jenkins/workspace/Silverpeas_Stable_AutoDeploy/Silverpeas-Core/pom.xml to /home/silverbuild/.m2/repository/org/silverpeas/core/6.4.5-build251127/core-6.4.5-build251127.pom
08:57:43 [2025-11-27T07:57:43.602Z] [INFO] Installing /var/lib/jenkins/workspace/Silverpeas_Stable_AutoDeploy/Silverpeas-Core/target/core-6.4.5-build251127-site.xml to /home/silverbuild/.m2/repository/org/silverpeas/core/6.4.5-build251127/core-6.4.5-build251127-site.xml
08:57:43 [2025-11-27T07:57:43.602Z] [INFO]
08:57:43 [2025-11-27T07:57:43.602Z] [INFO] --- maven-deploy-plugin:3.0.0:deploy (default-deploy) @ core ---
08:57:43 [2025-11-27T07:57:43.853Z] Downloading from Silverpeas Nexus: https://nexus3.silverpeas.org/repository/silverpeas/org/codehaus/plexus/plexus-utils/3.3.1/plexus-utils-3.3.1.jar
08:57:44 [2025-11-27T07:57:44.103Z] Progress (1): 4.1/262 kB
08:57:44 [2025-11-27T07:57:44.103Z] Progress (1): 7.6/262 kB
08:57:44 [2025-11-27T07:57:44.103Z] Progress (1): 12/262 kB
08:57:44 [2025-11-27T07:57:44.103Z] Progress (1): 16/262 kB
08:57:44 [2025-11-27T07:57:44.103Z] Progress (1): 20/262 kB
08:57:44 [2025-11-27T07:57:44.103Z] Progress (1): 23/262 kB
08:57:44 [2025-11-27T07:57:44.103Z] Progress (1): 28/262 kB
08:57:44 [2025-11-27T07:57:44.103Z] Progress (1): 32/262 kB
08:57:44 [2025-11-27T07:57:44.103Z] Progress (1): 36/262 kB
08:57:44 [2025-11-27T07:57:44.103Z] Progress (1): 39/262 kB
08:57:44 [2025-11-27T07:57:44.103Z] Progress (1): 44/262 kB
08:57:44 [2025-11-27T07:57:44.103Z] Progress (1): 48/262 kB
08:57:44 [2025-11-27T07:57:44.103Z] Progress (1): 52/262 kB
08:57:44 [2025-11-27T07:57:44.103Z] Progress (1): 55/262 kB
08:57:44 [2025-11-27T07:57:44.103Z] Progress (1): 60/262 kB
08:57:44 [2025-11-27T07:57:44.103Z] Progress (1): 64/262 kB
08:57:44 [2025-11-27T07:57:44.103Z] Progress (1): 68/262 kB
08:57:44 [2025-11-27T07:57:44.103Z] Progress (1): 71/262 kB
08:57:44 [2025-11-27T07:57:44.103Z] Progress (1): 74/262 kB
08:57:44 [2025-11-27T07:57:44.103Z] Progress (1): 78/262 kB
08:57:44 [2025-11-27T07:57:44.103Z] Progress (1): 82/262 kB
08:57:44 [2025-11-27T07:57:44.103Z] Progress (1): 86/262 kB
08:57:44 [2025-11-27T07:57:44.103Z] Progress (1): 90/262 kB
08:57:44 [2025-11-27T07:57:44.103Z] Progress (1): 94/262 kB
08:57:44 [2025-11-27T07:57:44.103Z] Progress (1): 98/262 kB
08:57:44 [2025-11-27T07:57:44.103Z] Progress (1): 102/262 kB
08:57:44 [2025-11-27T07:57:44.103Z] Progress (1): 106/262 kB
08:57:44 [2025-11-27T07:57:44.103Z] Progress (1): 111/262 kB
08:57:44 [2025-11-27T07:57:44.103Z] Progress (1): 115/262 kB
08:57:44 [2025-11-27T07:57:44.103Z] Progress (1): 119/262 kB
08:57:44 [2025-11-27T07:57:44.103Z] Progress (1): 123/262 kB
08:57:44 [2025-11-27T07:57:44.103Z] Progress (1): 127/262 kB
08:57:44 [2025-11-27T07:57:44.103Z] Progress (1): 131/262 kB
08:57:44 [2025-11-27T07:57:44.103Z] Progress (1): 135/262 kB
08:57:44 [2025-11-27T07:57:44.103Z] Progress (1): 139/262 kB
08:57:44 [2025-11-27T07:57:44.103Z] Progress (1): 143/262 kB
08:57:44 [2025-11-27T07:57:44.103Z] Progress (1): 147/262 kB
08:57:44 [2025-11-27T07:57:44.103Z] Progress (1): 152/262 kB
08:57:44 [2025-11-27T07:57:44.103Z] Progress (1): 154/262 kB
08:57:44 [2025-11-27T07:57:44.103Z] Progress (1): 158/262 kB
08:57:44 [2025-11-27T07:57:44.103Z] Progress (1): 162/262 kB
08:57:44 [2025-11-27T07:57:44.103Z] Progress (1): 166/262 kB
08:57:44 [2025-11-27T07:57:44.103Z] Progress (1): 170/262 kB
08:57:44 [2025-11-27T07:57:44.103Z] Progress (1): 172/262 kB
08:57:44 [2025-11-27T07:57:44.104Z] Progress (1): 176/262 kB
08:57:44 [2025-11-27T07:57:44.104Z] Progress (1): 180/262 kB
08:57:44 [2025-11-27T07:57:44.104Z] Progress (1): 184/262 kB
08:57:44 [2025-11-27T07:57:44.104Z] Progress (1): 188/262 kB
08:57:44 [2025-11-27T07:57:44.104Z] Progress (1): 193/262 kB
08:57:44 [2025-11-27T07:57:44.104Z] Progress (1): 197/262 kB
08:57:44 [2025-11-27T07:57:44.104Z] Progress (1): 201/262 kB
08:57:44 [2025-11-27T07:57:44.104Z] Progress (1): 205/262 kB
08:57:44 [2025-11-27T07:57:44.104Z] Progress (1): 209/262 kB
08:57:44 [2025-11-27T07:57:44.104Z] Progress (1): 213/262 kB
08:57:44 [2025-11-27T07:57:44.104Z] Progress (1): 217/262 kB
08:57:44 [2025-11-27T07:57:44.104Z] Progress (1): 221/262 kB
08:57:44 [2025-11-27T07:57:44.104Z] Progress (1): 225/262 kB
08:57:44 [2025-11-27T07:57:44.104Z] Progress (1): 229/262 kB
08:57:44 [2025-11-27T07:57:44.104Z] Progress (1): 233/262 kB
08:57:44 [2025-11-27T07:57:44.104Z] Progress (1): 238/262 kB
08:57:44 [2025-11-27T07:57:44.104Z] Progress (1): 242/262 kB
08:57:44 [2025-11-27T07:57:44.104Z] Progress (1): 246/262 kB
08:57:44 [2025-11-27T07:57:44.104Z] Progress (1): 250/262 kB
08:57:44 [2025-11-27T07:57:44.104Z] Progress (1): 254/262 kB
08:57:44 [2025-11-27T07:57:44.104Z] Progress (1): 258/262 kB
08:57:44 [2025-11-27T07:57:44.104Z] Progress (1): 262/262 kB
08:57:44 [2025-11-27T07:57:44.104Z] Progress (1): 262 kB
08:57:44 [2025-11-27T07:57:44.104Z]
08:57:44 [2025-11-27T07:57:44.104Z] Downloaded from Silverpeas Nexus: https://nexus3.silverpeas.org/repository/silverpeas/org/codehaus/plexus/plexus-utils/3.3.1/plexus-utils-3.3.1.jar (262 kB at 848 kB/s)
08:57:44 [2025-11-27T07:57:44.104Z] [INFO] Using alternate deployment repository silverpeas::default::https://nexus3.silverpeas.org/repository/builds
08:57:44 [2025-11-27T07:57:44.104Z] [WARNING] Using legacy syntax for alternative repository. Use "silverpeas::https://nexus3.silverpeas.org/repository/builds" instead.
08:57:44 [2025-11-27T07:57:44.104Z] Uploading to silverpeas: https://nexus3.silverpeas.org/repository/builds/org/silverpeas/core/6.4.5-build251127/core-6.4.5-build251127.pom
08:57:44 [2025-11-27T07:57:44.104Z] Uploading to silverpeas: https://nexus3.silverpeas.org/repository/builds/org/silverpeas/core/6.4.5-build251127/core-6.4.5-build251127-site.xml
08:57:44 [2025-11-27T07:57:44.104Z] [INFO] ------------------------------------------------------------------------
08:57:44 [2025-11-27T07:57:44.104Z] [INFO] Reactor Summary for Silverpeas Core 6.4.5-build251127:
08:57:44 [2025-11-27T07:57:44.104Z] [INFO]
08:57:44 [2025-11-27T07:57:44.104Z] [INFO] Silverpeas Core .................................... FAILURE [ 2.640 s]
08:57:44 [2025-11-27T07:57:44.104Z] [INFO] Silverpeas Core Configuration 6.4.5-build251127 .... SKIPPED
08:57:44 [2025-11-27T07:57:44.104Z] [INFO] Silverpeas Core Api 6.4.5-build251127 .............. SKIPPED
08:57:44 [2025-11-27T07:57:44.104Z] [INFO] Silverpeas Core Test 6.4.5-build251127 ............. SKIPPED
08:57:44 [2025-11-27T07:57:44.104Z] [INFO] Silverpeas Core JCR Provider 6.4.5-build251127 ..... SKIPPED
08:57:44 [2025-11-27T07:57:44.104Z] [INFO] Silverpeas Core Library 6.4.5-build251127 .......... SKIPPED
08:57:44 [2025-11-27T07:57:44.104Z] [INFO] Silverpeas Core Services 6.4.5-build251127 ......... SKIPPED
08:57:44 [2025-11-27T07:57:44.104Z] [INFO] Silverpeas Tagcloud EJB 6.4.5-build251127 .......... SKIPPED
08:57:44 [2025-11-27T07:57:44.104Z] [INFO] Silverpeas Statistics Service 6.4.5-build251127 .... SKIPPED
08:57:44 [2025-11-27T07:57:44.104Z] [INFO] Silverpeas Contact Service 6.4.5-build251127 ....... SKIPPED
08:57:44 [2025-11-27T07:57:44.104Z] [INFO] Silverpeas Calendar Service 6.4.5-build251127 ...... SKIPPED
08:57:44 [2025-11-27T07:57:44.104Z] [INFO] Silverpeas Comment Service 6.4.5-build251127 ....... SKIPPED
08:57:44 [2025-11-27T07:57:44.104Z] [INFO] Silverpeas PdC Service 6.4.5-build251127 ........... SKIPPED
08:57:44 [2025-11-27T07:57:44.104Z] [INFO] Silverpeas My Links Service 6.4.5-build251127 ...... SKIPPED
08:57:44 [2025-11-27T07:57:44.104Z] [INFO] Silverpeas Question Container Service 6.4.5-build251127 SKIPPED
08:57:44 [2025-11-27T07:57:44.104Z] [INFO] Silverpeas ImportExport Service 6.4.5-build251127 .. SKIPPED
08:57:44 [2025-11-27T07:57:44.104Z] [INFO] Silverpeas Document Viewer Service 6.4.5-build251127 SKIPPED
08:57:44 [2025-11-27T07:57:44.104Z] [INFO] Silverpeas Workflow Engine Service 6.4.5-build251127 SKIPPED
08:57:44 [2025-11-27T07:57:44.104Z] [INFO] Silverpeas Sharing Service 6.4.5-build251127 ....... SKIPPED
08:57:44 [2025-11-27T07:57:44.104Z] [INFO] Silverpeas Search Service 6.4.5-build251127 ........ SKIPPED
08:57:44 [2025-11-27T07:57:44.104Z] [INFO] Silverpeas Chat Service 6.4.5-build251127 .......... SKIPPED
08:57:44 [2025-11-27T07:57:44.104Z] [INFO] Silverpeas Document Template Service 6.4.5-build251127 SKIPPED
08:57:44 [2025-11-27T07:57:44.104Z] [INFO] Silverpeas Core JAX-RS API 6.4.5-build251127 ....... SKIPPED
08:57:44 [2025-11-27T07:57:44.104Z] [INFO] Silverpeas Core Web Test 6.4.5-build251127 ......... SKIPPED
08:57:44 [2025-11-27T07:57:44.104Z] [INFO] Silverpeas Core Web 6.4.5-build251127 .............. SKIPPED
08:57:44 [2025-11-27T07:57:44.104Z] [INFO] Silverpeas Core Web Archive 6.4.5-build251127 ...... SKIPPED
08:57:44 [2025-11-27T07:57:44.104Z] [INFO] ------------------------------------------------------------------------
08:57:44 [2025-11-27T07:57:44.104Z] [INFO] BUILD FAILURE
08:57:44 [2025-11-27T07:57:44.104Z] [INFO] ------------------------------------------------------------------------
08:57:44 [2025-11-27T07:57:44.104Z] [INFO] Total time: 3.001 s
08:57:44 [2025-11-27T07:57:44.104Z] [INFO] Finished at: 2025-11-27T08:57:44+01:00
08:57:44 [2025-11-27T07:57:44.104Z] [INFO] ------------------------------------------------------------------------
08:57:44 [2025-11-27T07:57:44.104Z] [ERROR] Failed to execute goal org.apache.maven.plugins:maven-deploy-plugin:3.0.0:deploy (default-deploy) on project core: Failed to deploy artifacts: Could not transfer artifact org.silverpeas:core:pom:6.4.5-build251127 from/to silverpeas (https://nexus3.silverpeas.org/repository/builds): authorization failed for https://nexus3.silverpeas.org/repository/builds/org/silverpeas/core/6.4.5-build251127/core-6.4.5-build251127.pom, status: 403 Forbidden -> [Help 1]
08:57:44 [2025-11-27T07:57:44.104Z] [ERROR]
08:57:44 [2025-11-27T07:57:44.104Z] [ERROR] To see the full stack trace of the errors, re-run Maven with the -e switch.
08:57:44 [2025-11-27T07:57:44.104Z] [ERROR] Re-run Maven using the -X switch to enable full debug logging.
08:57:44 [2025-11-27T07:57:44.104Z] [ERROR]
08:57:44 [2025-11-27T07:57:44.104Z] [ERROR] For more information about the errors and possible solutions, please read the following articles:
08:57:44 [2025-11-27T07:57:44.104Z] [ERROR] [Help 1] http://cwiki.apache.org/confluence/display/MAVEN/MojoExecutionException