Skip to content
Ignore 73 743 Ko. Log complet
08:56:26 [2025-11-27T07:56:26.419Z] Downloaded from Silverpeas Nexus: https://nexus3.silverpeas.org/repository/silverpeas/org/tukaani/xz/1.5/xz-1.5.jar (100 kB at 1.1 MB/s)
08:56:26 [2025-11-27T07:56:26.419Z] Downloaded from Silverpeas Nexus: https://nexus3.silverpeas.org/repository/silverpeas/org/apache/commons/commons-compress/1.11/commons-compress-1.11.jar (426 kB at 4.3 MB/s)
08:56:26 [2025-11-27T07:56:26.969Z] [INFO] Uploading org.apache.maven.shared.model.fileset.FileSet@5534e6f1
08:56:26 [2025-11-27T07:56:26.969Z] [INFO] Creating /tmp/wagon6621940630088484277.zip ...
08:56:26 [2025-11-27T07:56:26.969Z] [INFO] Building zip: /tmp/wagon6621940630088484277.zip
08:56:27 [2025-11-27T07:56:27.220Z] [INFO] Uploading /tmp/wagon6621940630088484277.zip to scp://www.silverpeas.org//var/www/files/wagon6621940630088484277.zip ...
08:56:27 [2025-11-27T07:56:27.470Z] [INFO] Remote: unzip -o -qq -d /var/www/files /var/www/files/wagon6621940630088484277.zip
08:56:27 [2025-11-27T07:56:27.471Z] [INFO] Remote: rm -f /var/www/files/wagon6621940630088484277.zip
08:56:27 [2025-11-27T07:56:27.471Z] [INFO] ------------------------------------------------------------------------
08:56:27 [2025-11-27T07:56:27.471Z] [INFO] BUILD SUCCESS
08:56:27 [2025-11-27T07:56:27.471Z] [INFO] ------------------------------------------------------------------------
08:56:27 [2025-11-27T07:56:27.471Z] [INFO] Total time:  11.685 s
08:56:27 [2025-11-27T07:56:27.471Z] [INFO] Finished at: 2025-11-27T08:56:27+01:00
08:56:27 [2025-11-27T07:56:27.471Z] [INFO] ------------------------------------------------------------------------
08:56:27 [2025-11-27T07:56:27.471Z] [WARNING] The requested profile "deployment" could not be activated because it does not exist.
08:56:27 [2025-11-27T07:56:27.471Z] [WARNING] The requested profile "coverage" could not be activated because it does not exist.
08:56:27 [2025-11-27T07:56:27.471Z] + /opt/wildfly-for-tests/wildfly-26.1.3.Final/bin/jboss-cli.sh --connect :shutdown
08:56:29 [2025-11-27T07:56:29.954Z] {
08:56:29 [2025-11-27T07:56:29.954Z]     "outcome" => "success",
08:56:29 [2025-11-27T07:56:29.954Z]     "result" => undefined
08:56:29 [2025-11-27T07:56:29.954Z] }
08:56:29 [2025-11-27T07:56:29.954Z] 08:56:29,881 INFO  [org.jboss.as.server] (management-handler-thread - 1) WFLYSRV0272: Suspending server
08:56:29 [2025-11-27T07:56:29.954Z] 08:56:29,885 INFO  [org.jboss.as.ejb3] (management-handler-thread - 1) WFLYEJB0493: Jakarta Enterprise Beans subsystem suspension complete
08:56:29 [2025-11-27T07:56:29.954Z] 08:56:29,886 INFO  [org.jboss.as.server] (Management Triggered Shutdown) WFLYSRV0241: Shutting down in response to management operation 'shutdown'
08:56:29 [2025-11-27T07:56:29.954Z] 08:56:29,905 INFO  [org.jboss.as.connector.deployment] (MSC service thread 1-7) WFLYJCA0119: Unbinding connection factory named java:/JmsXA to alias java:jboss/DefaultJMSConnectionFactory
08:56:29 [2025-11-27T07:56:29.954Z] 08:56:29,905 INFO  [org.jboss.as.connector.subsystems.datasources] (MSC service thread 1-4) WFLYJCA0010: Unbound data source [java:/datasources/silverpeas]
08:56:29 [2025-11-27T07:56:29.954Z] 08:56:29,906 INFO  [org.jboss.as.connector.subsystems.datasources] (MSC service thread 1-3) WFLYJCA0010: Unbound data source [java:jboss/datasources/ExampleDS]
08:56:29 [2025-11-27T07:56:29.954Z] 08:56:29,908 INFO  [org.jboss.as.mail.extension] (MSC service thread 1-7) WFLYMAIL0002: Unbound mail session [java:jboss/mail/Default]
08:56:29 [2025-11-27T07:56:29.954Z] 08:56:29,910 INFO  [org.jboss.as.connector.deployment] (MSC service thread 1-7) WFLYJCA0011: Unbound Jakarta Connectors ConnectionFactory [java:/JmsXA]
08:56:29 [2025-11-27T07:56:29.954Z] 08:56:29,911 INFO  [org.wildfly.extension.undertow] (MSC service thread 1-8) WFLYUT0019: Host default-host stopping
08:56:29 [2025-11-27T07:56:29.954Z] 08:56:29,912 INFO  [org.wildfly.extension.messaging-activemq] (MSC service thread 1-3) WFLYMSGAMQ0006: Unbound messaging object to jndi name java:jboss/exported/jms/RemoteConnectionFactory
08:56:29 [2025-11-27T07:56:29.954Z] 08:56:29,912 INFO  [org.wildfly.extension.undertow] (MSC service thread 1-4) WFLYUT0008: Undertow HTTPS listener https suspending
08:56:29 [2025-11-27T07:56:29.954Z] 08:56:29,913 INFO  [org.jboss.as.connector.deployers.jdbc] (MSC service thread 1-2) WFLYJCA0019: Stopped Driver service with driver-name = h2
08:56:29 [2025-11-27T07:56:29.954Z] 08:56:29,915 INFO  [org.wildfly.extension.undertow] (MSC service thread 1-4) WFLYUT0007: Undertow HTTPS listener https stopped, was bound to 127.0.0.1:8443
08:56:29 [2025-11-27T07:56:29.954Z] 08:56:29,932 INFO  [org.apache.activemq.artemis.ra.ActiveMQRALogger] (ServerService Thread Pool -- 29) AMQ151003: resource adaptor stopped
08:56:30 [2025-11-27T07:56:30.204Z] 08:56:30,093 INFO  [org.apache.activemq.artemis.core.server] (ServerService Thread Pool -- 29) AMQ221002: Apache ActiveMQ Artemis Message Broker version 2.19.1 [6be163c1-cb54-11f0-b941-c63219f04646] stopped, uptime 11.785 seconds
08:56:30 [2025-11-27T07:56:30.204Z] 08:56:30,094 INFO  [org.wildfly.extension.undertow] (MSC service thread 1-3) WFLYUT0008: Undertow HTTP listener default suspending
08:56:30 [2025-11-27T07:56:30.204Z] 08:56:30,095 INFO  [org.wildfly.extension.undertow] (MSC service thread 1-3) WFLYUT0007: Undertow HTTP listener default stopped, was bound to 127.0.0.1:8080
08:56:30 [2025-11-27T07:56:30.204Z] 08:56:30,096 INFO  [org.wildfly.extension.undertow] (MSC service thread 1-3) WFLYUT0004: Undertow 2.2.19.Final stopping
08:56:30 [2025-11-27T07:56:30.204Z] 08:56:30,106 INFO  [org.jboss.as] (MSC service thread 1-5) WFLYSRV0050: WildFly Full 26.1.3.Final (WildFly Core 18.1.2.Final) stopped in 211ms
08:56:30 [2025-11-27T07:56:30.205Z] 
08:56:30 [2025-11-27T07:56:30.206Z] [Pipeline] }
08:56:30 [2025-11-27T07:56:30.224Z] [Pipeline] // dir
08:56:30 [2025-11-27T07:56:30.243Z] [Pipeline] }
08:56:30 [2025-11-27T07:56:30.260Z] [Pipeline] // stage
08:56:30 [2025-11-27T07:56:30.280Z] [Pipeline] stage
08:56:30 [2025-11-27T07:56:30.281Z] [Pipeline] { (Build Silverpeas-Looks)
08:56:30 [2025-11-27T07:56:30.309Z] [Pipeline] dir
08:56:30 [2025-11-27T07:56:30.309Z] Running in /var/lib/jenkins/workspace/Silverpeas_Stable_AutoDeploy/Silverpeas-Looks
08:56:30 [2025-11-27T07:56:30.310Z] [Pipeline] {
08:56:30 [2025-11-27T07:56:30.331Z] [Pipeline] sh
08:56:30 [2025-11-27T07:56:30.589Z] + sed -i -e s/<core.version>[0-9a-zA-Z.-]\+/<core.version>6.4.5-build251127/g pom.xml
08:56:30 [2025-11-27T07:56:30.589Z] + sed -i -e s/<silverpeas.version>[0-9a-zA-Z.-]\+/<silverpeas.version>6.4.5-build251127/g pom.xml
08:56:30 [2025-11-27T07:56:30.589Z] + mvn -U versions:set -DgenerateBackupPoms=false -DnewVersion=6.4.5-build251127
08:56:31 [2025-11-27T07:56:31.932Z] [INFO] Scanning for projects...
08:56:31 [2025-11-27T07:56:31.932Z] [INFO] ------------------------------------------------------------------------
08:56:31 [2025-11-27T07:56:31.932Z] [INFO] Reactor Build Order:
08:56:31 [2025-11-27T07:56:31.932Z] [INFO] 
08:56:31 [2025-11-27T07:56:31.932Z] [INFO] Silverpeas Looks                                                   [pom]
08:56:31 [2025-11-27T07:56:31.932Z] [INFO] Silverpeas Aurora Look                                             [pom]
08:56:31 [2025-11-27T07:56:31.932Z] [INFO] Look Aurora Configuration                                          [jar]
08:56:31 [2025-11-27T07:56:31.932Z] [INFO] Look Aurora Web Application                                        [war]
08:56:32 [2025-11-27T07:56:32.483Z] Downloading from Silverpeas Nexus: https://nexus3.silverpeas.org/repository/silverpeas/org/apache/maven/plugins/maven-metadata.xml
08:56:32 [2025-11-27T07:56:32.483Z] Downloading from Silverpeas Nexus: https://nexus3.silverpeas.org/repository/silverpeas/org/codehaus/mojo/maven-metadata.xml
08:56:33 [2025-11-27T07:56:33.034Z] Progress (1): 4.1 kB
08:56:33 [2025-11-27T07:56:33.034Z] Progress (2): 4.1 kB | 4.1 kB
08:56:33 [2025-11-27T07:56:33.034Z] Progress (2): 8.2 kB | 4.1 kB
08:56:33 [2025-11-27T07:56:33.034Z] Progress (2): 11 kB | 4.1 kB 
08:56:33 [2025-11-27T07:56:33.034Z] Progress (2): 11 kB | 8.2 kB
08:56:33 [2025-11-27T07:56:33.034Z] Progress (2): 11 kB | 12 kB 
08:56:33 [2025-11-27T07:56:33.034Z] Progress (2): 11 kB | 16 kB
08:56:33 [2025-11-27T07:56:33.034Z] Progress (2): 11 kB | 20 kB
08:56:33 [2025-11-27T07:56:33.034Z] Progress (2): 11 kB | 22 kB
08:56:33 [2025-11-27T07:56:33.034Z]                            
08:56:33 [2025-11-27T07:56:33.034Z] Downloaded from Silverpeas Nexus: https://nexus3.silverpeas.org/repository/silverpeas/org/codehaus/mojo/maven-metadata.xml (22 kB at 52 kB/s)
08:56:33 [2025-11-27T07:56:33.034Z] Downloaded from Silverpeas Nexus: https://nexus3.silverpeas.org/repository/silverpeas/org/apache/maven/plugins/maven-metadata.xml (11 kB at 26 kB/s)
08:56:33 [2025-11-27T07:56:33.034Z] Downloading from Silverpeas Nexus: https://nexus3.silverpeas.org/repository/silverpeas/org/codehaus/mojo/versions-maven-plugin/maven-metadata.xml
08:56:33 [2025-11-27T07:56:33.034Z] Progress (1): 1.7 kB
08:56:33 [2025-11-27T07:56:33.034Z]                     
08:56:33 [2025-11-27T07:56:33.034Z] Downloaded from Silverpeas Nexus: https://nexus3.silverpeas.org/repository/silverpeas/org/codehaus/mojo/versions-maven-plugin/maven-metadata.xml (1.7 kB at 44 kB/s)
08:56:33 [2025-11-27T07:56:33.034Z] [INFO] 
08:56:33 [2025-11-27T07:56:33.034Z] [INFO] ------------------------< org.silverpeas:looks >------------------------
08:56:33 [2025-11-27T07:56:33.034Z] [INFO] Building Silverpeas Looks 6.4.5-SNAPSHOT                           [1/4]
08:56:33 [2025-11-27T07:56:33.034Z] [INFO]   from pom.xml
08:56:33 [2025-11-27T07:56:33.034Z] [INFO] --------------------------------[ pom ]---------------------------------
08:56:33 [2025-11-27T07:56:33.034Z] [INFO] 
08:56:33 [2025-11-27T07:56:33.034Z] [INFO] --- versions-maven-plugin:2.20.1:set (default-cli) @ looks ---
08:56:33 [2025-11-27T07:56:33.945Z] [INFO] Searching for local aggregator root...
08:56:33 [2025-11-27T07:56:33.945Z] [INFO] Local aggregation root: /var/lib/jenkins/workspace/Silverpeas_Stable_AutoDeploy/Silverpeas-Looks
08:56:33 [2025-11-27T07:56:33.945Z] [INFO] Processing change of org.silverpeas:looks:6.4.5-SNAPSHOT -> 6.4.5-build251127
08:56:33 [2025-11-27T07:56:33.945Z] [INFO] Processing org.silverpeas:looks
08:56:33 [2025-11-27T07:56:33.945Z] [INFO]     Updating project org.silverpeas:looks
08:56:33 [2025-11-27T07:56:33.945Z] [INFO]         from version 6.4.5-SNAPSHOT to 6.4.5-build251127
08:56:33 [2025-11-27T07:56:33.945Z] [INFO] 
08:56:33 [2025-11-27T07:56:33.945Z] [INFO] Processing org.silverpeas.looks:aurora
08:56:33 [2025-11-27T07:56:33.945Z] [INFO]     Updating parent org.silverpeas:looks
08:56:33 [2025-11-27T07:56:33.945Z] [INFO]         from version 6.4.5-SNAPSHOT to 6.4.5-build251127
08:56:33 [2025-11-27T07:56:33.945Z] [INFO] 
08:56:33 [2025-11-27T07:56:33.945Z] [INFO] Processing org.silverpeas.looks.aurora:silverpeas-aurora-configuration
08:56:33 [2025-11-27T07:56:33.945Z] [INFO]     Updating parent org.silverpeas.looks:aurora
08:56:33 [2025-11-27T07:56:33.945Z] [INFO]         from version 6.4.5-SNAPSHOT to 6.4.5-build251127
08:56:33 [2025-11-27T07:56:33.945Z] [INFO] 
08:56:33 [2025-11-27T07:56:33.945Z] [INFO] Processing org.silverpeas.looks.aurora:silverpeas-aurora-war
08:56:33 [2025-11-27T07:56:33.945Z] [INFO]     Updating parent org.silverpeas.looks:aurora
08:56:33 [2025-11-27T07:56:33.945Z] [INFO]         from version 6.4.5-SNAPSHOT to 6.4.5-build251127
08:56:33 [2025-11-27T07:56:33.945Z] [INFO] 
08:56:33 [2025-11-27T07:56:33.945Z] [INFO] ------------------------------------------------------------------------
08:56:33 [2025-11-27T07:56:33.945Z] [INFO] Reactor Summary for Silverpeas Looks 6.4.5-SNAPSHOT:
08:56:33 [2025-11-27T07:56:33.945Z] [INFO] 
08:56:33 [2025-11-27T07:56:33.945Z] [INFO] Silverpeas Looks ................................... SUCCESS [  0.842 s]
08:56:33 [2025-11-27T07:56:33.945Z] [INFO] Silverpeas Aurora Look ............................. SKIPPED
08:56:33 [2025-11-27T07:56:33.945Z] [INFO] Look Aurora Configuration .......................... SKIPPED
08:56:33 [2025-11-27T07:56:33.945Z] [INFO] Look Aurora Web Application ........................ SKIPPED
08:56:33 [2025-11-27T07:56:33.945Z] [INFO] ------------------------------------------------------------------------
08:56:33 [2025-11-27T07:56:33.945Z] [INFO] BUILD SUCCESS
08:56:33 [2025-11-27T07:56:33.945Z] [INFO] ------------------------------------------------------------------------
08:56:33 [2025-11-27T07:56:33.945Z] [INFO] Total time:  2.175 s
08:56:33 [2025-11-27T07:56:33.945Z] [INFO] Finished at: 2025-11-27T08:56:33+01:00
08:56:33 [2025-11-27T07:56:33.945Z] [INFO] ------------------------------------------------------------------------
08:56:33 [2025-11-27T07:56:33.950Z] [Pipeline] sh
08:56:34 [2025-11-27T07:56:34.207Z] + mvn clean install -Pdeployment -Pcoverage -Djava.awt.headless=true -Dcontext=ci
08:56:34 [2025-11-27T07:56:34.207Z] + 
08:56:34 [2025-11-27T07:56:34.207Z] + /opt/wildfly-for-tests/wildfly-26.1.3.Final/bin/standalone.sh -c standalone-full.xml
08:56:34 [2025-11-27T07:56:34.458Z] =========================================================================
08:56:34 [2025-11-27T07:56:34.458Z] 
08:56:34 [2025-11-27T07:56:34.458Z]   JBoss Bootstrap Environment
08:56:34 [2025-11-27T07:56:34.458Z] 
08:56:34 [2025-11-27T07:56:34.458Z]   JBOSS_HOME: /opt/wildfly-for-tests/wildfly-26.1.3.Final
08:56:34 [2025-11-27T07:56:34.458Z] 
08:56:34 [2025-11-27T07:56:34.458Z]   JAVA: /usr/lib/jvm/java-11-openjdk-amd64/bin/java
08:56:34 [2025-11-27T07:56:34.458Z] 
08:56:34 [2025-11-27T07:56:34.458Z]   JAVA_OPTS:  -server -Xms512m -Xmx4G -XX:MetaspaceSize=128m -XX:MaxMetaspaceSize=3G -Djava.net.preferIPv4Stack=true -XX:+UseG1GC -XX:+UseStringDeduplication -XX:+UseCompressedOops -Djboss.modules.system.pkgs=org.jboss.byteman -Djava.awt.headless=true  --add-exports=java.desktop/sun.awt=ALL-UNNAMED --add-exports=java.naming/com.sun.jndi.ldap=ALL-UNNAMED --add-exports=java.naming/com.sun.jndi.url.ldap=ALL-UNNAMED --add-exports=java.naming/com.sun.jndi.url.ldaps=ALL-UNNAMED --add-opens=java.base/java.lang=ALL-UNNAMED --add-opens=java.base/java.lang.invoke=ALL-UNNAMED --add-opens=java.base/java.lang.reflect=ALL-UNNAMED --add-opens=java.base/java.io=ALL-UNNAMED --add-opens=java.base/java.security=ALL-UNNAMED --add-opens=java.base/java.util=ALL-UNNAMED --add-opens=java.base/java.util.concurrent=ALL-UNNAMED --add-opens=java.management/javax.management=ALL-UNNAMED --add-opens=java.naming/javax.naming=ALL-UNNAMED 
08:56:34 [2025-11-27T07:56:34.458Z] 
08:56:34 [2025-11-27T07:56:34.458Z] =========================================================================
08:56:34 [2025-11-27T07:56:34.458Z] 
08:56:35 [2025-11-27T07:56:35.008Z] 08:56:34,846 INFO  [org.jboss.modules] (main) JBoss Modules version 2.0.2.Final
08:56:35 [2025-11-27T07:56:35.559Z] [INFO] Scanning for projects...
08:56:35 [2025-11-27T07:56:35.559Z] 08:56:35,456 INFO  [org.jboss.msc] (main) JBoss MSC version 1.4.13.Final
08:56:35 [2025-11-27T07:56:35.559Z] 08:56:35,469 INFO  [org.jboss.threads] (main) JBoss Threads version 2.4.0.Final
08:56:35 [2025-11-27T07:56:35.559Z] [INFO] ------------------------------------------------------------------------
08:56:35 [2025-11-27T07:56:35.559Z] [INFO] Reactor Build Order:
08:56:35 [2025-11-27T07:56:35.559Z] [INFO] 
08:56:35 [2025-11-27T07:56:35.559Z] [INFO] Silverpeas Looks                                                   [pom]
08:56:35 [2025-11-27T07:56:35.559Z] [INFO] Silverpeas Aurora Look                                             [pom]
08:56:35 [2025-11-27T07:56:35.559Z] [INFO] Look Aurora Configuration                                          [jar]
08:56:35 [2025-11-27T07:56:35.559Z] [INFO] Look Aurora Web Application                                        [war]
08:56:35 [2025-11-27T07:56:35.559Z] [INFO] 
08:56:35 [2025-11-27T07:56:35.559Z] [INFO] ------------------------< org.silverpeas:looks >------------------------
08:56:35 [2025-11-27T07:56:35.559Z] [INFO] Building Silverpeas Looks 6.4.5-build251127                        [1/4]
08:56:35 [2025-11-27T07:56:35.559Z] [INFO]   from pom.xml
08:56:35 [2025-11-27T07:56:35.559Z] [INFO] --------------------------------[ pom ]---------------------------------
08:56:35 [2025-11-27T07:56:35.809Z] 08:56:35,642 INFO  [org.jboss.as] (MSC service thread 1-2) WFLYSRV0049: WildFly Full 26.1.3.Final (WildFly Core 18.1.2.Final) starting
08:56:36 [2025-11-27T07:56:36.720Z] WARNING: An illegal reflective access operation has occurred
08:56:36 [2025-11-27T07:56:36.720Z] WARNING: Illegal reflective access by org.wildfly.extension.elytron.SSLDefinitions (jar:file:/opt/wildfly-for-tests/wildfly-26.1.3.Final/modules/system/layers/base/org/wildfly/extension/elytron/main/wildfly-elytron-integration-18.1.2.Final.jar!/) to method com.sun.net.ssl.internal.ssl.Provider.isFIPS()
08:56:36 [2025-11-27T07:56:36.720Z] WARNING: Please consider reporting this to the maintainers of org.wildfly.extension.elytron.SSLDefinitions
08:56:36 [2025-11-27T07:56:36.720Z] WARNING: Use --illegal-access=warn to enable warnings of further illegal reflective access operations
08:56:36 [2025-11-27T07:56:36.720Z] WARNING: All illegal access operations will be denied in a future release
08:56:36 [2025-11-27T07:56:36.721Z] 08:56:36,602 INFO  [org.wildfly.security] (ServerService Thread Pool -- 27) ELY00001: WildFly Elytron version 1.19.1.Final
08:56:37 [2025-11-27T07:56:37.631Z] 08:56:37,422 INFO  [org.jboss.as.server] (Controller Boot Thread) WFLYSRV0039: Creating http management service using socket-binding (management-http)
08:56:37 [2025-11-27T07:56:37.631Z] 08:56:37,445 INFO  [org.xnio] (MSC service thread 1-2) XNIO version 3.8.7.Final
08:56:37 [2025-11-27T07:56:37.631Z] 08:56:37,454 INFO  [org.xnio.nio] (MSC service thread 1-2) XNIO NIO Implementation Version 3.8.7.Final
08:56:37 [2025-11-27T07:56:37.631Z] 08:56:37,507 INFO  [org.wildfly.extension.elytron.oidc._private] (ServerService Thread Pool -- 55) WFLYOIDC0001: Activating WildFly Elytron OIDC Subsystem
08:56:37 [2025-11-27T07:56:37.631Z] 08:56:37,507 INFO  [org.jboss.as.clustering.infinispan] (ServerService Thread Pool -- 58) WFLYCLINF0001: Activating Infinispan subsystem.
08:56:37 [2025-11-27T07:56:37.631Z] 08:56:37,517 INFO  [org.wildfly.iiop.openjdk] (ServerService Thread Pool -- 57) WFLYIIOP0001: Activating IIOP Subsystem
08:56:37 [2025-11-27T07:56:37.631Z] 08:56:37,524 INFO  [org.wildfly.extension.health] (ServerService Thread Pool -- 56) WFLYHEALTH0001: Activating Base Health Subsystem
08:56:37 [2025-11-27T07:56:37.631Z] 08:56:37,542 INFO  [org.jboss.remoting] (MSC service thread 1-2) JBoss Remoting version 5.0.25.Final
08:56:37 [2025-11-27T07:56:37.631Z] 08:56:37,554 INFO  [org.jboss.as.jsf] (ServerService Thread Pool -- 65) WFLYJSF0007: Activated the following Jakarta Server Faces Implementations: [main]
08:56:37 [2025-11-27T07:56:37.631Z] 08:56:37,537 INFO  [org.wildfly.extension.microprofile.jwt.smallrye] (ServerService Thread Pool -- 71) WFLYJWT0001: Activating MicroProfile JWT Subsystem
08:56:37 [2025-11-27T07:56:37.631Z] 08:56:37,557 INFO  [org.jboss.as.webservices] (ServerService Thread Pool -- 82) WFLYWS0002: Activating WebServices Extension
08:56:37 [2025-11-27T07:56:37.631Z] 08:56:37,514 INFO  [org.jboss.as.jaxrs] (ServerService Thread Pool -- 60) WFLYRS0016: RESTEasy version 4.7.7.Final
08:56:37 [2025-11-27T07:56:37.631Z] 08:56:37,561 WARN  [org.jboss.as.txn] (ServerService Thread Pool -- 80) WFLYTX0013: The node-identifier attribute on the /subsystem=transactions is set to the default value. This is a danger for environments running multiple servers. Please make sure the attribute value is unique.
08:56:37 [2025-11-27T07:56:37.631Z] 08:56:37,568 INFO  [org.wildfly.extension.io] (ServerService Thread Pool -- 59) WFLYIO001: Worker 'default' has auto-configured to 24 IO threads with 192 max task threads based on your 12 available processors
08:56:37 [2025-11-27T07:56:37.631Z] 08:56:37,581 INFO  [org.wildfly.extension.metrics] (ServerService Thread Pool -- 69) WFLYMETRICS0001: Activating Base Metrics Subsystem
08:56:37 [2025-11-27T07:56:37.631Z] 08:56:37,560 INFO  [org.wildfly.extension.microprofile.config.smallrye] (ServerService Thread Pool -- 70) WFLYCONF0001: Activating MicroProfile Config Subsystem
08:56:37 [2025-11-27T07:56:37.631Z] 08:56:37,595 INFO  [org.jboss.as.naming] (ServerService Thread Pool -- 73) WFLYNAM0001: Activating Naming Subsystem
08:56:37 [2025-11-27T07:56:37.632Z] 08:56:37,609 INFO  [org.wildfly.extension.microprofile.opentracing] (ServerService Thread Pool -- 72) WFLYTRACEXT0001: Activating MicroProfile OpenTracing Subsystem
08:56:37 [2025-11-27T07:56:37.632Z] 08:56:37,628 INFO  [org.jboss.as.connector.subsystems.datasources] (ServerService Thread Pool -- 47) WFLYJCA0004: Deploying JDBC-compliant driver class org.h2.Driver (version 1.4)
08:56:37 [2025-11-27T07:56:37.882Z] 08:56:37,647 INFO  [org.jboss.as.connector] (MSC service thread 1-1) WFLYJCA0009: Starting Jakarta Connectors Subsystem (WildFly/IronJacamar 1.5.3.Final)
08:56:37 [2025-11-27T07:56:37.882Z] 08:56:37,674 INFO  [org.jboss.as.connector.deployers.jdbc] (MSC service thread 1-1) WFLYJCA0018: Started Driver service with driver-name = h2
08:56:37 [2025-11-27T07:56:37.882Z] 08:56:37,677 INFO  [org.jboss.as.mail.extension] (MSC service thread 1-2) WFLYMAIL0001: Bound mail session [java:jboss/mail/Default]
08:56:37 [2025-11-27T07:56:37.882Z] 08:56:37,686 INFO  [org.jboss.as.naming] (MSC service thread 1-2) WFLYNAM0003: Starting Naming Service
08:56:37 [2025-11-27T07:56:37.882Z] 08:56:37,726 WARN  [org.wildfly.extension.elytron] (MSC service thread 1-1) WFLYELY00023: KeyStore file '/opt/wildfly-for-tests/wildfly-26.1.3.Final/standalone/configuration/application.keystore' does not exist. Used blank.
08:56:37 [2025-11-27T07:56:37.882Z] 08:56:37,737 INFO  [org.wildfly.extension.undertow] (MSC service thread 1-8) WFLYUT0003: Undertow 2.2.19.Final starting
08:56:37 [2025-11-27T07:56:37.882Z] 08:56:37,761 WARN  [org.wildfly.extension.elytron] (MSC service thread 1-5) WFLYELY01084: KeyStore /opt/wildfly-for-tests/wildfly-26.1.3.Final/standalone/configuration/application.keystore not found, it will be auto generated on first use with a self-signed certificate for host localhost
08:56:37 [2025-11-27T07:56:37.882Z] [INFO] 
08:56:37 [2025-11-27T07:56:37.882Z] [INFO] --- maven-clean-plugin:3.2.0:clean (default-clean) @ looks ---
08:56:37 [2025-11-27T07:56:37.882Z] 08:56:37,801 INFO  [org.jboss.as.ejb3] (MSC service thread 1-7) WFLYEJB0481: Strict pool slsb-strict-max-pool is using a max instance size of 192 (per class), which is derived from thread worker pool sizing.
08:56:37 [2025-11-27T07:56:37.882Z] 08:56:37,804 INFO  [org.jboss.as.ejb3] (MSC service thread 1-8) WFLYEJB0482: Strict pool mdb-strict-max-pool is using a max instance size of 48 (per class), which is derived from the number of CPUs on this host.
08:56:37 [2025-11-27T07:56:37.882Z] [INFO] Deleting /var/lib/jenkins/workspace/Silverpeas_Stable_AutoDeploy/Silverpeas-Looks/target
08:56:38 [2025-11-27T07:56:38.132Z] [INFO] 
08:56:38 [2025-11-27T07:56:38.132Z] [INFO] --- git-commit-id-plugin:4.9.10:revision (default) @ looks ---
08:56:38 [2025-11-27T07:56:38.132Z] 08:56:37,919 INFO  [org.wildfly.extension.undertow] (MSC service thread 1-5) WFLYUT0012: Started server default-server.
08:56:38 [2025-11-27T07:56:38.132Z] 08:56:37,925 INFO  [org.wildfly.extension.undertow] (ServerService Thread Pool -- 81) WFLYUT0014: Creating file handler for path '/opt/wildfly-for-tests/wildfly-26.1.3.Final/welcome-content' with options [directory-listing: 'false', follow-symlink: 'false', case-sensitive: 'true', safe-symlink-paths: '[]']
08:56:38 [2025-11-27T07:56:38.132Z] 08:56:37,931 INFO  [org.wildfly.extension.undertow] (MSC service thread 1-1) Queuing requests.
08:56:38 [2025-11-27T07:56:38.132Z] 08:56:37,932 INFO  [org.wildfly.extension.undertow] (MSC service thread 1-1) WFLYUT0018: Host default-host starting
08:56:38 [2025-11-27T07:56:38.132Z] 08:56:38,008 INFO  [org.wildfly.extension.undertow] (MSC service thread 1-6) WFLYUT0006: Undertow HTTP listener default listening on 127.0.0.1:8080
08:56:38 [2025-11-27T07:56:38.132Z] [INFO] 
08:56:38 [2025-11-27T07:56:38.132Z] [INFO] --- jacoco-maven-plugin:0.8.8:prepare-agent (default) @ looks ---
08:56:38 [2025-11-27T07:56:38.132Z] 08:56:38,115 INFO  [org.wildfly.extension.undertow] (MSC service thread 1-1) WFLYUT0006: Undertow HTTPS listener https listening on 127.0.0.1:8443
08:56:38 [2025-11-27T07:56:38.383Z] 08:56:38,166 INFO  [org.jboss.as.ejb3] (MSC service thread 1-6) WFLYEJB0493: Jakarta Enterprise Beans subsystem suspension complete
08:56:38 [2025-11-27T07:56:38.383Z] 08:56:38,208 INFO  [org.wildfly.iiop.openjdk] (MSC service thread 1-7) WFLYIIOP0009: CORBA ORB Service started
08:56:38 [2025-11-27T07:56:38.383Z] [INFO] argLine set to -javaagent:/home/silverbuild/.m2/repository/org/jacoco/org.jacoco.agent/0.8.8/org.jacoco.agent-0.8.8-runtime.jar=destfile=/var/lib/jenkins/workspace/Silverpeas_Stable_AutoDeploy/Silverpeas-Looks/target/jacoco.exec
08:56:38 [2025-11-27T07:56:38.383Z] [INFO] 
08:56:38 [2025-11-27T07:56:38.383Z] [INFO] --- build-helper-maven-plugin:3.3.0:add-test-source (add-integration-test-sources) @ looks ---
08:56:38 [2025-11-27T07:56:38.383Z] 08:56:38,242 INFO  [org.jboss.as.connector.subsystems.datasources] (MSC service thread 1-8) WFLYJCA0001: Bound data source [java:jboss/datasources/ExampleDS]
08:56:38 [2025-11-27T07:56:38.383Z] 08:56:38,242 INFO  [org.jboss.as.connector.subsystems.datasources] (MSC service thread 1-1) WFLYJCA0001: Bound data source [java:/datasources/silverpeas]
08:56:38 [2025-11-27T07:56:38.383Z] 08:56:38,358 INFO  [org.jboss.as.patching] (MSC service thread 1-2) WFLYPAT0050: WildFly Full cumulative patch ID is: base, one-off patches include: none
08:56:38 [2025-11-27T07:56:38.383Z] [INFO] Test Source directory: /var/lib/jenkins/workspace/Silverpeas_Stable_AutoDeploy/Silverpeas-Looks/src/integration-test/java added.
08:56:38 [2025-11-27T07:56:38.383Z] [INFO] 
08:56:38 [2025-11-27T07:56:38.383Z] 08:56:38,366 INFO  [org.jboss.as.server.deployment.scanner] (MSC service thread 1-2) WFLYDS0013: Started FileSystemDeploymentService for directory /opt/wildfly-for-tests/wildfly-26.1.3.Final/standalone/deployments
08:56:38 [2025-11-27T07:56:38.383Z] [INFO] --- build-helper-maven-plugin:3.3.0:add-test-resource (add-integration-test-sources) @ looks ---
08:56:38 [2025-11-27T07:56:38.383Z] [INFO] 
08:56:38 [2025-11-27T07:56:38.383Z] [INFO] --- maven-source-plugin:3.2.1:jar-no-fork (bundle-source) @ looks ---
08:56:38 [2025-11-27T07:56:38.383Z] 08:56:38,369 INFO  [org.wildfly.extension.messaging-activemq] (MSC service thread 1-4) WFLYMSGAMQ0075: AIO wasn't located on this platform, it will fall back to using pure Java NIO. Your platform is Linux, install LibAIO to enable the AIO journal and achieve optimal performance.
08:56:38 [2025-11-27T07:56:38.633Z] 08:56:38,447 INFO  [org.jboss.ws.common.management] (MSC service thread 1-7) JBWS022052: Starting JBossWS 5.5.0.Final (Apache CXF 3.4.10) 
08:56:38 [2025-11-27T07:56:38.633Z] 08:56:38,452 INFO  [org.apache.activemq.artemis.core.server] (ServerService Thread Pool -- 84) AMQ221000: live Message Broker is starting with configuration Broker Configuration (clustered=false,journalDirectory=/opt/wildfly-for-tests/wildfly-26.1.3.Final/standalone/data/activemq/journal,bindingsDirectory=/opt/wildfly-for-tests/wildfly-26.1.3.Final/standalone/data/activemq/bindings,largeMessagesDirectory=/opt/wildfly-for-tests/wildfly-26.1.3.Final/standalone/data/activemq/largemessages,pagingDirectory=/opt/wildfly-for-tests/wildfly-26.1.3.Final/standalone/data/activemq/paging)
08:56:38 [2025-11-27T07:56:38.633Z] 08:56:38,496 INFO  [org.apache.activemq.artemis.core.server] (ServerService Thread Pool -- 84) AMQ221013: Using NIO Journal
08:56:38 [2025-11-27T07:56:38.633Z] [INFO] 
08:56:38 [2025-11-27T07:56:38.633Z] [INFO] --- maven-failsafe-plugin:2.22.2:integration-test (default) @ looks ---
08:56:38 [2025-11-27T07:56:38.633Z] 08:56:38,590 INFO  [org.apache.activemq.artemis.core.server] (ServerService Thread Pool -- 84) AMQ221043: Protocol module found: [artemis-server]. Adding protocol support for: CORE
08:56:38 [2025-11-27T07:56:38.633Z] 08:56:38,592 INFO  [org.apache.activemq.artemis.core.server] (ServerService Thread Pool -- 84) AMQ221043: Protocol module found: [artemis-amqp-protocol]. Adding protocol support for: AMQP
08:56:38 [2025-11-27T07:56:38.633Z] 08:56:38,592 INFO  [org.apache.activemq.artemis.core.server] (ServerService Thread Pool -- 84) AMQ221043: Protocol module found: [artemis-hornetq-protocol]. Adding protocol support for: HORNETQ
08:56:38 [2025-11-27T07:56:38.633Z] 08:56:38,593 INFO  [org.apache.activemq.artemis.core.server] (ServerService Thread Pool -- 84) AMQ221043: Protocol module found: [artemis-stomp-protocol]. Adding protocol support for: STOMP
08:56:38 [2025-11-27T07:56:38.884Z] 08:56:38,691 INFO  [org.apache.activemq.artemis.core.server] (ServerService Thread Pool -- 84) AMQ221034: Waiting indefinitely to obtain live lock
08:56:38 [2025-11-27T07:56:38.884Z] 08:56:38,692 INFO  [org.apache.activemq.artemis.core.server] (ServerService Thread Pool -- 84) AMQ221035: Live Server Obtained live lock
08:56:38 [2025-11-27T07:56:38.884Z] [INFO] No tests to run.
08:56:38 [2025-11-27T07:56:38.884Z] [INFO] 
08:56:38 [2025-11-27T07:56:38.884Z] [INFO] --- maven-javadoc-plugin:3.4.1:jar (attach-javadocs) @ looks ---
08:56:39 [2025-11-27T07:56:39.134Z] 08:56:39,091 INFO  [org.apache.activemq.artemis.core.server] (ServerService Thread Pool -- 84) AMQ221003: Deploying ANYCAST queue jms.queue.ExpiryQueue on address jms.queue.ExpiryQueue
08:56:39 [2025-11-27T07:56:39.134Z] 08:56:39,101 INFO  [org.apache.activemq.artemis.core.server] (ServerService Thread Pool -- 84) AMQ221003: Deploying ANYCAST queue jms.queue.DLQ on address jms.queue.DLQ
08:56:39 [2025-11-27T07:56:39.134Z] 08:56:39,101 INFO  [org.apache.activemq.artemis.core.server] (ServerService Thread Pool -- 84) AMQ221003: Deploying ANYCAST queue jms.queue.notifications on address jms.queue.notifications
08:56:39 [2025-11-27T07:56:39.134Z] 08:56:39,102 INFO  [org.apache.activemq.artemis.core.server] (ServerService Thread Pool -- 84) AMQ221003: Deploying ANYCAST queue jms.queue.statistics on address jms.queue.statistics
08:56:39 [2025-11-27T07:56:39.134Z] 08:56:39,107 INFO  [org.wildfly.extension.messaging-activemq] (MSC service thread 1-4) WFLYMSGAMQ0016: Registered HTTP upgrade for activemq-remoting protocol handled by http-acceptor acceptor
08:56:39 [2025-11-27T07:56:39.134Z] 08:56:39,107 INFO  [org.wildfly.extension.messaging-activemq] (MSC service thread 1-6) WFLYMSGAMQ0016: Registered HTTP upgrade for activemq-remoting protocol handled by http-acceptor-throughput acceptor
08:56:39 [2025-11-27T07:56:39.134Z] 08:56:39,107 INFO  [org.wildfly.extension.messaging-activemq] (MSC service thread 1-5) WFLYMSGAMQ0016: Registered HTTP upgrade for activemq-remoting protocol handled by http-acceptor acceptor
08:56:39 [2025-11-27T07:56:39.134Z] 08:56:39,107 INFO  [org.wildfly.extension.messaging-activemq] (MSC service thread 1-2) WFLYMSGAMQ0016: Registered HTTP upgrade for activemq-remoting protocol handled by http-acceptor-throughput acceptor
08:56:39 [2025-11-27T07:56:39.384Z] 08:56:39,317 INFO  [org.apache.activemq.artemis.core.server] (ServerService Thread Pool -- 84) AMQ221007: Server is now live
08:56:39 [2025-11-27T07:56:39.384Z] 08:56:39,317 INFO  [org.apache.activemq.artemis.core.server] (ServerService Thread Pool -- 84) AMQ221001: Apache ActiveMQ Artemis Message Broker version 2.19.1 [default, nodeID=6be163c1-cb54-11f0-b941-c63219f04646] 
08:56:39 [2025-11-27T07:56:39.384Z] 08:56:39,335 INFO  [org.wildfly.extension.messaging-activemq] (ServerService Thread Pool -- 84) WFLYMSGAMQ0002: Bound messaging object to jndi name java:/ConnectionFactory
08:56:39 [2025-11-27T07:56:39.384Z] [INFO] Not executing Javadoc as the project is not a Java classpath-capable package
08:56:39 [2025-11-27T07:56:39.384Z] [INFO] 
08:56:39 [2025-11-27T07:56:39.384Z] [INFO] --- maven-source-plugin:3.2.1:jar-no-fork (attach-sources) @ looks ---
08:56:39 [2025-11-27T07:56:39.384Z] [INFO] 
08:56:39 [2025-11-27T07:56:39.384Z] [INFO] --- jacoco-maven-plugin:0.8.8:report (tests-coverage) @ looks ---
08:56:39 [2025-11-27T07:56:39.384Z] [INFO] Skipping JaCoCo execution due to missing execution data file.
08:56:39 [2025-11-27T07:56:39.384Z] [INFO] 
08:56:39 [2025-11-27T07:56:39.384Z] [INFO] --- maven-failsafe-plugin:2.22.2:verify (default) @ looks ---
08:56:39 [2025-11-27T07:56:39.384Z] 08:56:39,357 INFO  [org.wildfly.extension.messaging-activemq] (ServerService Thread Pool -- 86) WFLYMSGAMQ0002: Bound messaging object to jndi name java:jboss/exported/jms/RemoteConnectionFactory
08:56:39 [2025-11-27T07:56:39.635Z] 08:56:39,409 INFO  [org.jboss.as.connector.deployment] (MSC service thread 1-8) WFLYJCA0007: Registered connection factory java:/JmsXA
08:56:39 [2025-11-27T07:56:39.635Z] [INFO] 
08:56:39 [2025-11-27T07:56:39.635Z] [INFO] --- maven-install-plugin:3.0.1:install (default-install) @ looks ---
08:56:39 [2025-11-27T07:56:39.635Z] 08:56:39,505 INFO  [org.apache.activemq.artemis.ra.ActiveMQRALogger] (MSC service thread 1-8) AMQ151007: Resource adaptor started
08:56:39 [2025-11-27T07:56:39.635Z] 08:56:39,506 INFO  [org.jboss.as.connector.services.resourceadapters.ResourceAdapterActivatorService$ResourceAdapterActivator] (MSC service thread 1-8) IJ020002: Deployed: file://RaActivatoractivemq-ra
08:56:39 [2025-11-27T07:56:39.635Z] 08:56:39,509 INFO  [org.jboss.as.connector.deployment] (MSC service thread 1-1) WFLYJCA0118: Binding connection factory named java:/JmsXA to alias java:jboss/DefaultJMSConnectionFactory
08:56:39 [2025-11-27T07:56:39.635Z] 08:56:39,508 INFO  [org.jboss.as.connector.deployment] (MSC service thread 1-2) WFLYJCA0002: Bound Jakarta Connectors ConnectionFactory [java:/JmsXA]
08:56:39 [2025-11-27T07:56:39.635Z] [INFO] Installing /var/lib/jenkins/workspace/Silverpeas_Stable_AutoDeploy/Silverpeas-Looks/pom.xml to /home/silverbuild/.m2/repository/org/silverpeas/looks/6.4.5-build251127/looks-6.4.5-build251127.pom
08:56:39 [2025-11-27T07:56:39.635Z] [INFO] 
08:56:39 [2025-11-27T07:56:39.635Z] [INFO] --------------------< org.silverpeas.looks:aurora >---------------------
08:56:39 [2025-11-27T07:56:39.635Z] [INFO] Building Silverpeas Aurora Look 6.4.5-build251127                  [2/4]
08:56:39 [2025-11-27T07:56:39.635Z] [INFO]   from aurora/pom.xml
08:56:39 [2025-11-27T07:56:39.635Z] [INFO] --------------------------------[ pom ]---------------------------------
08:56:39 [2025-11-27T07:56:39.885Z] 08:56:39,675 INFO  [org.jboss.as.server] (Controller Boot Thread) WFLYSRV0212: Resuming server
08:56:39 [2025-11-27T07:56:39.885Z] 08:56:39,680 INFO  [org.jboss.as] (Controller Boot Thread) WFLYSRV0025: WildFly Full 26.1.3.Final (WildFly Core 18.1.2.Final) started in 5300ms - Started 349 of 590 services (358 services are lazy, passive or on-demand) - Server configuration file in use: standalone-full.xml
08:56:39 [2025-11-27T07:56:39.885Z] 08:56:39,682 INFO  [org.jboss.as] (Controller Boot Thread) WFLYSRV0060: Http management interface listening on http://127.0.0.1:9990/management
08:56:39 [2025-11-27T07:56:39.885Z] 08:56:39,683 INFO  [org.jboss.as] (Controller Boot Thread) WFLYSRV0051: Admin console listening on http://127.0.0.1:9990
08:56:39 [2025-11-27T07:56:39.885Z] [INFO] 
08:56:39 [2025-11-27T07:56:39.885Z] [INFO] --- maven-clean-plugin:3.2.0:clean (default-clean) @ aurora ---
08:56:39 [2025-11-27T07:56:39.885Z] [INFO] Deleting /var/lib/jenkins/workspace/Silverpeas_Stable_AutoDeploy/Silverpeas-Looks/aurora/target
08:56:39 [2025-11-27T07:56:39.885Z] [INFO] 
08:56:39 [2025-11-27T07:56:39.885Z] [INFO] --- git-commit-id-plugin:4.9.10:revision (default) @ aurora ---
08:56:39 [2025-11-27T07:56:39.885Z] [INFO] 
08:56:39 [2025-11-27T07:56:39.885Z] [INFO] --- jacoco-maven-plugin:0.8.8:prepare-agent (default) @ aurora ---
08:56:39 [2025-11-27T07:56:39.885Z] [INFO] argLine set to -javaagent:/home/silverbuild/.m2/repository/org/jacoco/org.jacoco.agent/0.8.8/org.jacoco.agent-0.8.8-runtime.jar=destfile=/var/lib/jenkins/workspace/Silverpeas_Stable_AutoDeploy/Silverpeas-Looks/aurora/target/jacoco.exec
08:56:39 [2025-11-27T07:56:39.885Z] [INFO] 
08:56:39 [2025-11-27T07:56:39.885Z] [INFO] --- build-helper-maven-plugin:3.3.0:add-test-source (add-integration-test-sources) @ aurora ---
08:56:39 [2025-11-27T07:56:39.885Z] [INFO] Test Source directory: /var/lib/jenkins/workspace/Silverpeas_Stable_AutoDeploy/Silverpeas-Looks/aurora/src/integration-test/java added.
08:56:39 [2025-11-27T07:56:39.885Z] [INFO] 
08:56:39 [2025-11-27T07:56:39.885Z] [INFO] --- build-helper-maven-plugin:3.3.0:add-test-resource (add-integration-test-sources) @ aurora ---
08:56:39 [2025-11-27T07:56:39.885Z] [INFO] 
08:56:39 [2025-11-27T07:56:39.885Z] [INFO] --- maven-source-plugin:3.2.1:jar-no-fork (bundle-source) @ aurora ---
08:56:39 [2025-11-27T07:56:39.885Z] [INFO] 
08:56:39 [2025-11-27T07:56:39.885Z] [INFO] --- maven-failsafe-plugin:2.22.2:integration-test (default) @ aurora ---
08:56:39 [2025-11-27T07:56:39.885Z] [INFO] No tests to run.
08:56:39 [2025-11-27T07:56:39.885Z] [INFO] 
08:56:39 [2025-11-27T07:56:39.885Z] [INFO] --- maven-javadoc-plugin:3.4.1:jar (attach-javadocs) @ aurora ---
08:56:39 [2025-11-27T07:56:39.885Z] [INFO] Not executing Javadoc as the project is not a Java classpath-capable package
08:56:39 [2025-11-27T07:56:39.885Z] [INFO] 
08:56:39 [2025-11-27T07:56:39.885Z] [INFO] --- maven-source-plugin:3.2.1:jar-no-fork (attach-sources) @ aurora ---
08:56:39 [2025-11-27T07:56:39.885Z] [INFO] 
08:56:39 [2025-11-27T07:56:39.885Z] [INFO] --- jacoco-maven-plugin:0.8.8:report (tests-coverage) @ aurora ---
08:56:39 [2025-11-27T07:56:39.885Z] [INFO] Skipping JaCoCo execution due to missing execution data file.
08:56:39 [2025-11-27T07:56:39.885Z] [INFO] 
08:56:39 [2025-11-27T07:56:39.885Z] [INFO] --- maven-failsafe-plugin:2.22.2:verify (default) @ aurora ---
08:56:39 [2025-11-27T07:56:39.885Z] [INFO] 
08:56:39 [2025-11-27T07:56:39.885Z] [INFO] --- maven-install-plugin:3.0.1:install (default-install) @ aurora ---
08:56:39 [2025-11-27T07:56:39.885Z] [INFO] Installing /var/lib/jenkins/workspace/Silverpeas_Stable_AutoDeploy/Silverpeas-Looks/aurora/pom.xml to /home/silverbuild/.m2/repository/org/silverpeas/looks/aurora/6.4.5-build251127/aurora-6.4.5-build251127.pom
08:56:39 [2025-11-27T07:56:39.885Z] [INFO] 
08:56:39 [2025-11-27T07:56:39.885Z] [INFO] ----< org.silverpeas.looks.aurora:silverpeas-aurora-configuration >-----
08:56:39 [2025-11-27T07:56:39.885Z] [INFO] Building Look Aurora Configuration 6.4.5-build251127               [3/4]
08:56:39 [2025-11-27T07:56:39.885Z] [INFO]   from aurora/aurora-configuration/pom.xml
08:56:39 [2025-11-27T07:56:39.885Z] [INFO] --------------------------------[ jar ]---------------------------------
08:56:39 [2025-11-27T07:56:39.885Z] [INFO] 
08:56:39 [2025-11-27T07:56:39.885Z] [INFO] --- maven-clean-plugin:3.2.0:clean (default-clean) @ silverpeas-aurora-configuration ---
08:56:39 [2025-11-27T07:56:39.885Z] [INFO] Deleting /var/lib/jenkins/workspace/Silverpeas_Stable_AutoDeploy/Silverpeas-Looks/aurora/aurora-configuration/target
08:56:39 [2025-11-27T07:56:39.885Z] [INFO] 
08:56:39 [2025-11-27T07:56:39.885Z] [INFO] --- git-commit-id-plugin:4.9.10:revision (default) @ silverpeas-aurora-configuration ---
08:56:41 [2025-11-27T07:56:41.229Z] [INFO] 
08:56:41 [2025-11-27T07:56:41.229Z] [INFO] --- jacoco-maven-plugin:0.8.8:prepare-agent (default) @ silverpeas-aurora-configuration ---
08:56:41 [2025-11-27T07:56:41.229Z] [INFO] argLine set to -javaagent:/home/silverbuild/.m2/repository/org/jacoco/org.jacoco.agent/0.8.8/org.jacoco.agent-0.8.8-runtime.jar=destfile=/var/lib/jenkins/workspace/Silverpeas_Stable_AutoDeploy/Silverpeas-Looks/aurora/aurora-configuration/target/jacoco.exec
08:56:41 [2025-11-27T07:56:41.229Z] [INFO] 
08:56:41 [2025-11-27T07:56:41.229Z] [INFO] --- maven-resources-plugin:3.3.0:resources (default-resources) @ silverpeas-aurora-configuration ---
08:56:41 [2025-11-27T07:56:41.229Z] [INFO] Copying 241 resources
08:56:41 [2025-11-27T07:56:41.229Z] [INFO] 
08:56:41 [2025-11-27T07:56:41.229Z] [INFO] --- silverpeas-ui-compressor-maven-plugin:1.7:jslint (default) @ silverpeas-aurora-configuration ---
08:56:41 [2025-11-27T07:56:41.229Z] [INFO] nb warnings: 0, nb errors: 0
08:56:41 [2025-11-27T07:56:41.229Z] [INFO] 
08:56:41 [2025-11-27T07:56:41.229Z] [INFO] --- silverpeas-ui-compressor-maven-plugin:1.7:compress (default) @ silverpeas-aurora-configuration ---
08:56:41 [2025-11-27T07:56:41.479Z] [INFO] main.css (42880b) -> main-min.css (34376b)[80%]
08:56:41 [2025-11-27T07:56:41.730Z] [INFO] stylesheet.css (33039b) -> stylesheet-min.css (27188b)[82%]
08:56:41 [2025-11-27T07:56:41.730Z] [INFO] main.css (53670b) -> main-min.css (44404b)[82%]
08:56:41 [2025-11-27T07:56:41.980Z] [INFO] stylesheet.css (57184b) -> stylesheet-min.css (46892b)[82%]
08:56:41 [2025-11-27T07:56:41.980Z] [INFO] custom.css (0b) -> custom-min.css (0b)[100%]
08:56:41 [2025-11-27T07:56:41.980Z] [INFO] login.css (11921b) -> login-min.css (8123b)[68%]
08:56:41 [2025-11-27T07:56:41.980Z] [INFO] main.css (25104b) -> main-min.css (19441b)[77%]
08:56:42 [2025-11-27T07:56:42.231Z] [INFO] stylesheet.css (33195b) -> stylesheet-min.css (27566b)[83%]
08:56:42 [2025-11-27T07:56:42.231Z] [INFO] login.css (6237b) -> login-min.css (3983b)[63%]
08:56:42 [2025-11-27T07:56:42.231Z] [INFO] main.css (24275b) -> main-min.css (18332b)[75%]
08:56:42 [2025-11-27T07:56:42.231Z] [INFO] basic.css (0b) -> basic-min.css (0b)[100%]
08:56:42 [2025-11-27T07:56:42.231Z] [INFO] ticker-style.css (2965b) -> ticker-style-min.css (2432b)[82%]
08:56:42 [2025-11-27T07:56:42.481Z] [INFO] stylesheet.css (27822b) -> stylesheet-min.css (22983b)[82%]
08:56:42 [2025-11-27T07:56:42.481Z] [INFO] total input (318292b) -> output (255720b)[80%]
08:56:42 [2025-11-27T07:56:42.481Z] [INFO] nb warnings: 0, nb errors: 0
08:56:42 [2025-11-27T07:56:42.481Z] [INFO] 
08:56:42 [2025-11-27T07:56:42.481Z] [INFO] --- maven-compiler-plugin:3.10.1:compile (default-compile) @ silverpeas-aurora-configuration ---
08:56:42 [2025-11-27T07:56:42.481Z] [INFO] No sources to compile
08:56:42 [2025-11-27T07:56:42.481Z] [INFO] 
08:56:42 [2025-11-27T07:56:42.481Z] [INFO] --- build-helper-maven-plugin:3.3.0:add-test-source (add-integration-test-sources) @ silverpeas-aurora-configuration ---
08:56:42 [2025-11-27T07:56:42.481Z] [INFO] Test Source directory: /var/lib/jenkins/workspace/Silverpeas_Stable_AutoDeploy/Silverpeas-Looks/aurora/aurora-configuration/src/integration-test/java added.
08:56:42 [2025-11-27T07:56:42.481Z] [INFO] 
08:56:42 [2025-11-27T07:56:42.481Z] [INFO] --- build-helper-maven-plugin:3.3.0:add-test-resource (add-integration-test-sources) @ silverpeas-aurora-configuration ---
08:56:42 [2025-11-27T07:56:42.481Z] [INFO] 
08:56:42 [2025-11-27T07:56:42.481Z] [INFO] --- maven-resources-plugin:3.3.0:testResources (default-testResources) @ silverpeas-aurora-configuration ---
08:56:42 [2025-11-27T07:56:42.481Z] [INFO] skip non existing resourceDirectory /var/lib/jenkins/workspace/Silverpeas_Stable_AutoDeploy/Silverpeas-Looks/aurora/aurora-configuration/src/test/resources
08:56:42 [2025-11-27T07:56:42.481Z] [INFO] skip non existing resourceDirectory /var/lib/jenkins/workspace/Silverpeas_Stable_AutoDeploy/Silverpeas-Looks/aurora/aurora-configuration/src/test/resources
08:56:42 [2025-11-27T07:56:42.481Z] [INFO] skip non existing resourceDirectory /var/lib/jenkins/workspace/Silverpeas_Stable_AutoDeploy/Silverpeas-Looks/aurora/aurora-configuration/src/test/resources
08:56:42 [2025-11-27T07:56:42.481Z] [INFO] skip non existing resourceDirectory /var/lib/jenkins/workspace/Silverpeas_Stable_AutoDeploy/Silverpeas-Looks/aurora/aurora-configuration/src/test/resources
08:56:42 [2025-11-27T07:56:42.481Z] [INFO] skip non existing resourceDirectory /var/lib/jenkins/workspace/Silverpeas_Stable_AutoDeploy/Silverpeas-Looks/aurora/aurora-configuration/src/integration-test/resources
08:56:42 [2025-11-27T07:56:42.481Z] [INFO] skip non existing resourceDirectory /var/lib/jenkins/workspace/Silverpeas_Stable_AutoDeploy/Silverpeas-Looks/aurora/aurora-configuration/src/integration-test/resources
08:56:42 [2025-11-27T07:56:42.481Z] [INFO] skip non existing resourceDirectory /var/lib/jenkins/workspace/Silverpeas_Stable_AutoDeploy/Silverpeas-Looks/aurora/aurora-configuration/src/integration-test/resources
08:56:42 [2025-11-27T07:56:42.481Z] [INFO] 
08:56:42 [2025-11-27T07:56:42.481Z] [INFO] --- maven-compiler-plugin:3.10.1:testCompile (default-testCompile) @ silverpeas-aurora-configuration ---
08:56:42 [2025-11-27T07:56:42.481Z] [INFO] No sources to compile
08:56:42 [2025-11-27T07:56:42.481Z] [INFO] 
08:56:42 [2025-11-27T07:56:42.481Z] [INFO] --- maven-surefire-plugin:2.22.2:test (default-test) @ silverpeas-aurora-configuration ---
08:56:42 [2025-11-27T07:56:42.481Z] [INFO] No tests to run.
08:56:42 [2025-11-27T07:56:42.481Z] [INFO] 
08:56:42 [2025-11-27T07:56:42.481Z] [INFO] --- maven-jar-plugin:3.3.0:jar (default-jar) @ silverpeas-aurora-configuration ---
08:56:42 [2025-11-27T07:56:42.732Z] [INFO] Building jar: /var/lib/jenkins/workspace/Silverpeas_Stable_AutoDeploy/Silverpeas-Looks/aurora/aurora-configuration/target/silverpeas-aurora-configuration-6.4.5-build251127.jar
08:56:42 [2025-11-27T07:56:42.982Z] [INFO] 
08:56:42 [2025-11-27T07:56:42.982Z] [INFO] --- maven-source-plugin:3.2.1:jar-no-fork (bundle-source) @ silverpeas-aurora-configuration ---
08:56:42 [2025-11-27T07:56:42.982Z] [INFO] Building jar: /var/lib/jenkins/workspace/Silverpeas_Stable_AutoDeploy/Silverpeas-Looks/aurora/aurora-configuration/target/silverpeas-aurora-configuration-6.4.5-build251127-sources.jar
08:56:42 [2025-11-27T07:56:42.982Z] [INFO] 
08:56:42 [2025-11-27T07:56:42.982Z] [INFO] --- maven-failsafe-plugin:2.22.2:integration-test (default) @ silverpeas-aurora-configuration ---
08:56:42 [2025-11-27T07:56:42.982Z] [INFO] No tests to run.
08:56:42 [2025-11-27T07:56:42.982Z] [INFO] 
08:56:42 [2025-11-27T07:56:42.982Z] [INFO] --- maven-javadoc-plugin:3.4.1:jar (attach-javadocs) @ silverpeas-aurora-configuration ---
08:56:42 [2025-11-27T07:56:42.982Z] [INFO] 
08:56:42 [2025-11-27T07:56:42.982Z] [INFO] --- maven-source-plugin:3.2.1:jar-no-fork (attach-sources) @ silverpeas-aurora-configuration ---
08:56:42 [2025-11-27T07:56:42.982Z] [WARNING] artifact org.silverpeas.looks.aurora:silverpeas-aurora-configuration:java-source:sources:6.4.5-build251127 already attached, replace previous instance
08:56:42 [2025-11-27T07:56:42.982Z] [INFO] 
08:56:42 [2025-11-27T07:56:42.982Z] [INFO] --- jacoco-maven-plugin:0.8.8:report (tests-coverage) @ silverpeas-aurora-configuration ---
08:56:42 [2025-11-27T07:56:42.982Z] [INFO] Skipping JaCoCo execution due to missing execution data file.
08:56:42 [2025-11-27T07:56:42.982Z] [INFO] 
08:56:42 [2025-11-27T07:56:42.982Z] [INFO] --- maven-failsafe-plugin:2.22.2:verify (default) @ silverpeas-aurora-configuration ---
08:56:42 [2025-11-27T07:56:42.982Z] [INFO] 
08:56:42 [2025-11-27T07:56:42.982Z] [INFO] --- maven-install-plugin:3.0.1:install (default-install) @ silverpeas-aurora-configuration ---
08:56:43 [2025-11-27T07:56:43.233Z] [INFO] Installing /var/lib/jenkins/workspace/Silverpeas_Stable_AutoDeploy/Silverpeas-Looks/aurora/aurora-configuration/pom.xml to /home/silverbuild/.m2/repository/org/silverpeas/looks/aurora/silverpeas-aurora-configuration/6.4.5-build251127/silverpeas-aurora-configuration-6.4.5-build251127.pom
08:56:43 [2025-11-27T07:56:43.233Z] [INFO] Installing /var/lib/jenkins/workspace/Silverpeas_Stable_AutoDeploy/Silverpeas-Looks/aurora/aurora-configuration/target/silverpeas-aurora-configuration-6.4.5-build251127.jar to /home/silverbuild/.m2/repository/org/silverpeas/looks/aurora/silverpeas-aurora-configuration/6.4.5-build251127/silverpeas-aurora-configuration-6.4.5-build251127.jar
08:56:43 [2025-11-27T07:56:43.233Z] [INFO] Installing /var/lib/jenkins/workspace/Silverpeas_Stable_AutoDeploy/Silverpeas-Looks/aurora/aurora-configuration/target/silverpeas-aurora-configuration-6.4.5-build251127-sources.jar to /home/silverbuild/.m2/repository/org/silverpeas/looks/aurora/silverpeas-aurora-configuration/6.4.5-build251127/silverpeas-aurora-configuration-6.4.5-build251127-sources.jar
08:56:43 [2025-11-27T07:56:43.233Z] [INFO] 
08:56:43 [2025-11-27T07:56:43.233Z] [INFO] ---------< org.silverpeas.looks.aurora:silverpeas-aurora-war >----------
08:56:43 [2025-11-27T07:56:43.233Z] [INFO] Building Look Aurora Web Application 6.4.5-build251127             [4/4]
08:56:43 [2025-11-27T07:56:43.233Z] [INFO]   from aurora/aurora-war/pom.xml
08:56:43 [2025-11-27T07:56:43.233Z] [INFO] --------------------------------[ war ]---------------------------------
08:56:43 [2025-11-27T07:56:43.233Z] [INFO] 
08:56:43 [2025-11-27T07:56:43.233Z] [INFO] --- maven-clean-plugin:3.2.0:clean (default-clean) @ silverpeas-aurora-war ---
08:56:43 [2025-11-27T07:56:43.233Z] [INFO] Deleting /var/lib/jenkins/workspace/Silverpeas_Stable_AutoDeploy/Silverpeas-Looks/aurora/aurora-war/target
08:56:43 [2025-11-27T07:56:43.233Z] [INFO] 
08:56:43 [2025-11-27T07:56:43.233Z] [INFO] --- git-commit-id-plugin:4.9.10:revision (default) @ silverpeas-aurora-war ---
08:56:43 [2025-11-27T07:56:43.783Z] [INFO] 
08:56:43 [2025-11-27T07:56:43.783Z] [INFO] --- jacoco-maven-plugin:0.8.8:prepare-agent (default) @ silverpeas-aurora-war ---
08:56:43 [2025-11-27T07:56:43.783Z] [INFO] argLine set to -javaagent:/home/silverbuild/.m2/repository/org/jacoco/org.jacoco.agent/0.8.8/org.jacoco.agent-0.8.8-runtime.jar=destfile=/var/lib/jenkins/workspace/Silverpeas_Stable_AutoDeploy/Silverpeas-Looks/aurora/aurora-war/target/jacoco.exec
08:56:43 [2025-11-27T07:56:43.783Z] [INFO] 
08:56:43 [2025-11-27T07:56:43.783Z] [INFO] --- maven-resources-plugin:3.3.0:resources (default-resources) @ silverpeas-aurora-war ---
08:56:43 [2025-11-27T07:56:43.783Z] [INFO] skip non existing resourceDirectory /var/lib/jenkins/workspace/Silverpeas_Stable_AutoDeploy/Silverpeas-Looks/aurora/aurora-war/src/main/resources
08:56:43 [2025-11-27T07:56:43.783Z] [INFO] 
08:56:43 [2025-11-27T07:56:43.783Z] [INFO] --- silverpeas-ui-compressor-maven-plugin:1.7:jslint (default) @ silverpeas-aurora-war ---
08:56:43 [2025-11-27T07:56:43.783Z] [INFO] check file :/var/lib/jenkins/workspace/Silverpeas_Stable_AutoDeploy/Silverpeas-Looks/aurora/aurora-war/src/main/webapp/look/jsp/js/jquery.cookie.js
08:56:44 [2025-11-27T07:56:44.034Z] [INFO] check file :/var/lib/jenkins/workspace/Silverpeas_Stable_AutoDeploy/Silverpeas-Looks/aurora/aurora-war/src/main/webapp/look/jsp/js/silverpeas-weather.js
08:56:44 [2025-11-27T07:56:44.034Z] [INFO] check file :/var/lib/jenkins/workspace/Silverpeas_Stable_AutoDeploy/Silverpeas-Looks/aurora/aurora-war/src/main/webapp/look/jsp/js/silverpeas-weather-openweathermap.js
08:56:44 [2025-11-27T07:56:44.284Z] [INFO] check file :/var/lib/jenkins/workspace/Silverpeas_Stable_AutoDeploy/Silverpeas-Looks/aurora/aurora-war/src/main/webapp/look/jsp/js/silverpeas-weather-yahoo.js
08:56:44 [2025-11-27T07:56:44.284Z] [INFO] check file :/var/lib/jenkins/workspace/Silverpeas_Stable_AutoDeploy/Silverpeas-Looks/aurora/aurora-war/src/main/webapp/look/jsp/js/silverpeas-weather-accuweather.js
08:56:44 [2025-11-27T07:56:44.284Z] [INFO] nb warnings: 0, nb errors: 0
08:56:44 [2025-11-27T07:56:44.284Z] [INFO] 
08:56:44 [2025-11-27T07:56:44.284Z] [INFO] --- silverpeas-ui-compressor-maven-plugin:1.7:compress (default) @ silverpeas-aurora-war ---
08:56:44 [2025-11-27T07:56:44.535Z] [INFO] jquery.cookie.js (3656b) -> jquery.cookie-min.js (635b)[17%]
08:56:44 [2025-11-27T07:56:44.535Z] [INFO] silverpeas-weather.js (3533b) -> silverpeas-weather-min.js (740b)[20%]
08:56:44 [2025-11-27T07:56:44.535Z] [INFO] silverpeas-weather-openweathermap.js (6865b) -> silverpeas-weather-openweathermap-min.js (2972b)[43%]
08:56:44 [2025-11-27T07:56:44.535Z] [INFO] silverpeas-weather-yahoo.js (1278b) -> silverpeas-weather-yahoo-min.js (577b)[45%]
08:56:44 [2025-11-27T07:56:44.535Z] [INFO] silverpeas-weather-accuweather.js (5222b) -> silverpeas-weather-accuweather-min.js (2097b)[40%]
08:56:44 [2025-11-27T07:56:44.535Z] [INFO] themes.css (1710b) -> themes-min.css (1388b)[81%]
08:56:44 [2025-11-27T07:56:44.535Z] [INFO] sm-core-css.css (953b) -> sm-core-css-min.css (661b)[69%]
08:56:44 [2025-11-27T07:56:44.785Z] [INFO] sm-silverpeas.css (6735b) -> sm-silverpeas-min.css (5460b)[81%]
08:56:44 [2025-11-27T07:56:44.785Z] [INFO] aurora.css (8827b) -> aurora-min.css (7170b)[81%]
08:56:44 [2025-11-27T07:56:44.785Z] [INFO] responsiveslides.css (490b) -> responsiveslides-min.css (381b)[77%]
08:56:44 [2025-11-27T07:56:44.785Z] [INFO] total input (39269b) -> output (22081b)[56%]
08:56:44 [2025-11-27T07:56:44.785Z] [INFO] nb warnings: 0, nb errors: 0
08:56:44 [2025-11-27T07:56:44.785Z] [INFO] 
08:56:44 [2025-11-27T07:56:44.785Z] [INFO] --- maven-compiler-plugin:3.10.1:compile (default-compile) @ silverpeas-aurora-war ---
08:56:44 [2025-11-27T07:56:44.785Z] [INFO] Changes detected - recompiling the module!
08:56:44 [2025-11-27T07:56:44.785Z] [INFO] Compiling 32 source files to /var/lib/jenkins/workspace/Silverpeas_Stable_AutoDeploy/Silverpeas-Looks/aurora/aurora-war/target/classes
08:56:47 [2025-11-27T07:56:47.268Z] [WARNING] /var/lib/jenkins/workspace/Silverpeas_Stable_AutoDeploy/Silverpeas-Looks/aurora/aurora-war/src/main/java/org/silverpeas/looks/aurora/LookAuroraHelper.java:[1116,71] non-varargs call of varargs method with inexact argument type for last parameter;
08:56:47 [2025-11-27T07:56:47.268Z]   cast to Object for a varargs call
08:56:47 [2025-11-27T07:56:47.268Z]   cast to Object[] for a non-varargs call and to suppress this warning
08:56:47 [2025-11-27T07:56:47.268Z] [INFO] 
08:56:47 [2025-11-27T07:56:47.268Z] [INFO] --- build-helper-maven-plugin:3.3.0:add-test-source (add-integration-test-sources) @ silverpeas-aurora-war ---
08:56:47 [2025-11-27T07:56:47.268Z] [INFO] Test Source directory: /var/lib/jenkins/workspace/Silverpeas_Stable_AutoDeploy/Silverpeas-Looks/aurora/aurora-war/src/integration-test/java added.
08:56:47 [2025-11-27T07:56:47.268Z] [INFO] 
08:56:47 [2025-11-27T07:56:47.268Z] [INFO] --- build-helper-maven-plugin:3.3.0:add-test-resource (add-integration-test-sources) @ silverpeas-aurora-war ---
08:56:47 [2025-11-27T07:56:47.268Z] [INFO] 
08:56:47 [2025-11-27T07:56:47.268Z] [INFO] --- maven-resources-plugin:3.3.0:testResources (default-testResources) @ silverpeas-aurora-war ---
08:56:47 [2025-11-27T07:56:47.268Z] [INFO] skip non existing resourceDirectory /var/lib/jenkins/workspace/Silverpeas_Stable_AutoDeploy/Silverpeas-Looks/aurora/aurora-war/src/test/resources
08:56:47 [2025-11-27T07:56:47.268Z] [INFO] skip non existing resourceDirectory /var/lib/jenkins/workspace/Silverpeas_Stable_AutoDeploy/Silverpeas-Looks/aurora/aurora-war/src/test/resources
08:56:47 [2025-11-27T07:56:47.268Z] [INFO] skip non existing resourceDirectory /var/lib/jenkins/workspace/Silverpeas_Stable_AutoDeploy/Silverpeas-Looks/aurora/aurora-war/src/test/resources
08:56:47 [2025-11-27T07:56:47.268Z] [INFO] skip non existing resourceDirectory /var/lib/jenkins/workspace/Silverpeas_Stable_AutoDeploy/Silverpeas-Looks/aurora/aurora-war/src/test/resources
08:56:47 [2025-11-27T07:56:47.268Z] [INFO] skip non existing resourceDirectory /var/lib/jenkins/workspace/Silverpeas_Stable_AutoDeploy/Silverpeas-Looks/aurora/aurora-war/src/integration-test/resources
08:56:47 [2025-11-27T07:56:47.268Z] [INFO] skip non existing resourceDirectory /var/lib/jenkins/workspace/Silverpeas_Stable_AutoDeploy/Silverpeas-Looks/aurora/aurora-war/src/integration-test/resources
08:56:47 [2025-11-27T07:56:47.268Z] [INFO] skip non existing resourceDirectory /var/lib/jenkins/workspace/Silverpeas_Stable_AutoDeploy/Silverpeas-Looks/aurora/aurora-war/src/integration-test/resources
08:56:47 [2025-11-27T07:56:47.268Z] [INFO] 
08:56:47 [2025-11-27T07:56:47.268Z] [INFO] --- maven-compiler-plugin:3.10.1:testCompile (default-testCompile) @ silverpeas-aurora-war ---
08:56:47 [2025-11-27T07:56:47.268Z] [INFO] No sources to compile
08:56:47 [2025-11-27T07:56:47.268Z] [INFO] 
08:56:47 [2025-11-27T07:56:47.268Z] [INFO] --- maven-surefire-plugin:2.22.2:test (default-test) @ silverpeas-aurora-war ---
08:56:47 [2025-11-27T07:56:47.268Z] [INFO] No tests to run.
08:56:47 [2025-11-27T07:56:47.268Z] [INFO] 
08:56:47 [2025-11-27T07:56:47.268Z] [INFO] --- maven-war-plugin:3.3.2:war (default-war) @ silverpeas-aurora-war ---
08:56:47 [2025-11-27T07:56:47.268Z] [INFO] Packaging webapp
08:56:47 [2025-11-27T07:56:47.268Z] [INFO] Assembling webapp [silverpeas-aurora-war] in [/var/lib/jenkins/workspace/Silverpeas_Stable_AutoDeploy/Silverpeas-Looks/aurora/aurora-war/target/silverpeas-aurora-war-6.4.5-build251127]
08:56:47 [2025-11-27T07:56:47.268Z] [INFO] Processing war project
08:56:47 [2025-11-27T07:56:47.268Z] [INFO] Copying webapp resources [/var/lib/jenkins/workspace/Silverpeas_Stable_AutoDeploy/Silverpeas-Looks/aurora/aurora-war/src/main/webapp]
08:56:47 [2025-11-27T07:56:47.268Z] [INFO] Building war: /var/lib/jenkins/workspace/Silverpeas_Stable_AutoDeploy/Silverpeas-Looks/aurora/aurora-war/target/silverpeas-aurora-war-6.4.5-build251127.war
08:56:47 [2025-11-27T07:56:47.518Z] [INFO] 
08:56:47 [2025-11-27T07:56:47.518Z] [INFO] --- maven-source-plugin:3.2.1:jar-no-fork (bundle-source) @ silverpeas-aurora-war ---
08:56:47 [2025-11-27T07:56:47.518Z] [INFO] Building jar: /var/lib/jenkins/workspace/Silverpeas_Stable_AutoDeploy/Silverpeas-Looks/aurora/aurora-war/target/silverpeas-aurora-war-6.4.5-build251127-sources.jar
08:56:47 [2025-11-27T07:56:47.518Z] [INFO] 
08:56:47 [2025-11-27T07:56:47.518Z] [INFO] --- maven-failsafe-plugin:2.22.2:integration-test (default) @ silverpeas-aurora-war ---
08:56:47 [2025-11-27T07:56:47.518Z] [INFO] No tests to run.
08:56:47 [2025-11-27T07:56:47.518Z] [INFO] 
08:56:47 [2025-11-27T07:56:47.518Z] [INFO] --- maven-javadoc-plugin:3.4.1:jar (attach-javadocs) @ silverpeas-aurora-war ---
08:56:48 [2025-11-27T07:56:48.069Z] [INFO] No previous run data found, generating javadoc.
08:56:51 [2025-11-27T07:56:51.297Z] [INFO] Building jar: /var/lib/jenkins/workspace/Silverpeas_Stable_AutoDeploy/Silverpeas-Looks/aurora/aurora-war/target/silverpeas-aurora-war-6.4.5-build251127-javadoc.jar
08:56:51 [2025-11-27T07:56:51.297Z] [INFO] 
08:56:51 [2025-11-27T07:56:51.297Z] [INFO] --- maven-source-plugin:3.2.1:jar-no-fork (attach-sources) @ silverpeas-aurora-war ---
08:56:51 [2025-11-27T07:56:51.297Z] [WARNING] artifact org.silverpeas.looks.aurora:silverpeas-aurora-war:java-source:sources:6.4.5-build251127 already attached, replace previous instance
08:56:51 [2025-11-27T07:56:51.297Z] [INFO] 
08:56:51 [2025-11-27T07:56:51.297Z] [INFO] --- jacoco-maven-plugin:0.8.8:report (tests-coverage) @ silverpeas-aurora-war ---
08:56:51 [2025-11-27T07:56:51.297Z] [INFO] Skipping JaCoCo execution due to missing execution data file.
08:56:51 [2025-11-27T07:56:51.297Z] [INFO] 
08:56:51 [2025-11-27T07:56:51.297Z] [INFO] --- maven-failsafe-plugin:2.22.2:verify (default) @ silverpeas-aurora-war ---
08:56:51 [2025-11-27T07:56:51.297Z] [INFO] 
08:56:51 [2025-11-27T07:56:51.297Z] [INFO] --- maven-install-plugin:3.0.1:install (default-install) @ silverpeas-aurora-war ---
08:56:51 [2025-11-27T07:56:51.297Z] [INFO] Installing /var/lib/jenkins/workspace/Silverpeas_Stable_AutoDeploy/Silverpeas-Looks/aurora/aurora-war/pom.xml to /home/silverbuild/.m2/repository/org/silverpeas/looks/aurora/silverpeas-aurora-war/6.4.5-build251127/silverpeas-aurora-war-6.4.5-build251127.pom
08:56:51 [2025-11-27T07:56:51.297Z] [INFO] Installing /var/lib/jenkins/workspace/Silverpeas_Stable_AutoDeploy/Silverpeas-Looks/aurora/aurora-war/target/silverpeas-aurora-war-6.4.5-build251127.war to /home/silverbuild/.m2/repository/org/silverpeas/looks/aurora/silverpeas-aurora-war/6.4.5-build251127/silverpeas-aurora-war-6.4.5-build251127.war
08:56:51 [2025-11-27T07:56:51.297Z] [INFO] Installing /var/lib/jenkins/workspace/Silverpeas_Stable_AutoDeploy/Silverpeas-Looks/aurora/aurora-war/target/silverpeas-aurora-war-6.4.5-build251127-sources.jar to /home/silverbuild/.m2/repository/org/silverpeas/looks/aurora/silverpeas-aurora-war/6.4.5-build251127/silverpeas-aurora-war-6.4.5-build251127-sources.jar
08:56:51 [2025-11-27T07:56:51.297Z] [INFO] Installing /var/lib/jenkins/workspace/Silverpeas_Stable_AutoDeploy/Silverpeas-Looks/aurora/aurora-war/target/silverpeas-aurora-war-6.4.5-build251127-javadoc.jar to /home/silverbuild/.m2/repository/org/silverpeas/looks/aurora/silverpeas-aurora-war/6.4.5-build251127/silverpeas-aurora-war-6.4.5-build251127-javadoc.jar
08:56:51 [2025-11-27T07:56:51.297Z] [INFO] ------------------------------------------------------------------------
08:56:51 [2025-11-27T07:56:51.297Z] [INFO] Reactor Summary for Silverpeas Looks 6.4.5-build251127:
08:56:51 [2025-11-27T07:56:51.297Z] [INFO] 
08:56:51 [2025-11-27T07:56:51.297Z] [INFO] Silverpeas Looks ................................... SUCCESS [  4.012 s]
08:56:51 [2025-11-27T07:56:51.297Z] [INFO] Silverpeas Aurora Look ............................. SUCCESS [  0.230 s]
08:56:51 [2025-11-27T07:56:51.297Z] [INFO] Look Aurora Configuration .......................... SUCCESS [  3.219 s]
08:56:51 [2025-11-27T07:56:51.297Z] [INFO] Look Aurora Web Application ........................ SUCCESS [  8.240 s]
08:56:51 [2025-11-27T07:56:51.297Z] [INFO] ------------------------------------------------------------------------
08:56:51 [2025-11-27T07:56:51.297Z] [INFO] BUILD SUCCESS
08:56:51 [2025-11-27T07:56:51.297Z] [INFO] ------------------------------------------------------------------------
08:56:51 [2025-11-27T07:56:51.297Z] [INFO] Total time:  15.978 s
08:56:51 [2025-11-27T07:56:51.297Z] [INFO] Finished at: 2025-11-27T08:56:51+01:00
08:56:51 [2025-11-27T07:56:51.297Z] [INFO] ------------------------------------------------------------------------
08:56:51 [2025-11-27T07:56:51.548Z] + /opt/wildfly-for-tests/wildfly-26.1.3.Final/bin/jboss-cli.sh --connect :shutdown
08:56:54 [2025-11-27T07:56:54.776Z] {
08:56:54 [2025-11-27T07:56:54.776Z]     "outcome" => "success",
08:56:54 [2025-11-27T07:56:54.776Z]     "result" => undefined
08:56:54 [2025-11-27T07:56:54.776Z] }
08:56:54 [2025-11-27T07:56:54.776Z] 08:56:54,075 INFO  [org.jboss.as.server] (management-handler-thread - 1) WFLYSRV0272: Suspending server
08:56:54 [2025-11-27T07:56:54.776Z] 08:56:54,078 INFO  [org.jboss.as.ejb3] (management-handler-thread - 1) WFLYEJB0493: Jakarta Enterprise Beans subsystem suspension complete
08:56:54 [2025-11-27T07:56:54.776Z] 08:56:54,079 INFO  [org.jboss.as.server] (Management Triggered Shutdown) WFLYSRV0241: Shutting down in response to management operation 'shutdown'
08:56:54 [2025-11-27T07:56:54.776Z] 08:56:54,119 INFO  [org.jboss.as.connector.deployment] (MSC service thread 1-6) WFLYJCA0119: Unbinding connection factory named java:/JmsXA to alias java:jboss/DefaultJMSConnectionFactory
08:56:54 [2025-11-27T07:56:54.776Z] 08:56:54,120 INFO  [org.jboss.as.connector.subsystems.datasources] (MSC service thread 1-1) WFLYJCA0010: Unbound data source [java:/datasources/silverpeas]
08:56:54 [2025-11-27T07:56:54.776Z] 08:56:54,122 INFO  [org.jboss.as.connector.subsystems.datasources] (MSC service thread 1-6) WFLYJCA0010: Unbound data source [java:jboss/datasources/ExampleDS]
08:56:54 [2025-11-27T07:56:54.776Z] 08:56:54,123 INFO  [org.jboss.as.mail.extension] (MSC service thread 1-6) WFLYMAIL0002: Unbound mail session [java:jboss/mail/Default]
08:56:54 [2025-11-27T07:56:54.776Z] 08:56:54,124 INFO  [org.jboss.as.connector.deployment] (MSC service thread 1-2) WFLYJCA0011: Unbound Jakarta Connectors ConnectionFactory [java:/JmsXA]
08:56:54 [2025-11-27T07:56:54.776Z] 08:56:54,126 INFO  [org.wildfly.extension.messaging-activemq] (MSC service thread 1-2) WFLYMSGAMQ0006: Unbound messaging object to jndi name java:jboss/exported/jms/RemoteConnectionFactory
08:56:54 [2025-11-27T07:56:54.776Z] 08:56:54,127 INFO  [org.wildfly.extension.undertow] (MSC service thread 1-7) WFLYUT0008: Undertow HTTPS listener https suspending
08:56:54 [2025-11-27T07:56:54.776Z] 08:56:54,126 INFO  [org.wildfly.extension.undertow] (MSC service thread 1-3) WFLYUT0019: Host default-host stopping
08:56:54 [2025-11-27T07:56:54.776Z] 08:56:54,128 INFO  [org.jboss.as.connector.deployers.jdbc] (MSC service thread 1-4) WFLYJCA0019: Stopped Driver service with driver-name = h2
08:56:54 [2025-11-27T07:56:54.776Z] 08:56:54,129 INFO  [org.wildfly.extension.undertow] (MSC service thread 1-7) WFLYUT0007: Undertow HTTPS listener https stopped, was bound to 127.0.0.1:8443
08:56:54 [2025-11-27T07:56:54.776Z] 08:56:54,151 INFO  [org.apache.activemq.artemis.ra.ActiveMQRALogger] (ServerService Thread Pool -- 21) AMQ151003: resource adaptor stopped
08:56:54 [2025-11-27T07:56:54.776Z] 08:56:54,320 INFO  [org.apache.activemq.artemis.core.server] (ServerService Thread Pool -- 21) AMQ221002: Apache ActiveMQ Artemis Message Broker version 2.19.1 [6be163c1-cb54-11f0-b941-c63219f04646] stopped, uptime 15.892 seconds
08:56:54 [2025-11-27T07:56:54.776Z] 08:56:54,321 INFO  [org.wildfly.extension.undertow] (MSC service thread 1-4) WFLYUT0008: Undertow HTTP listener default suspending
08:56:54 [2025-11-27T07:56:54.776Z] 08:56:54,322 INFO  [org.wildfly.extension.undertow] (MSC service thread 1-4) WFLYUT0007: Undertow HTTP listener default stopped, was bound to 127.0.0.1:8080
08:56:54 [2025-11-27T07:56:54.776Z] 08:56:54,323 INFO  [org.wildfly.extension.undertow] (MSC service thread 1-3) WFLYUT0004: Undertow 2.2.19.Final stopping
08:56:54 [2025-11-27T07:56:54.776Z] 08:56:54,334 INFO  [org.jboss.as] (MSC service thread 1-3) WFLYSRV0050: WildFly Full 26.1.3.Final (WildFly Core 18.1.2.Final) stopped in 223ms
08:56:54 [2025-11-27T07:56:54.777Z] 
08:56:54 [2025-11-27T07:56:54.785Z] [Pipeline] sh
08:56:55 [2025-11-27T07:56:55.044Z] + echo /usr/lib/jvm/java-17-openjdk-amd64
08:56:55 [2025-11-27T07:56:55.049Z] [Pipeline] withSonarQubeEnv
08:56:55 [2025-11-27T07:56:55.051Z] Injection des variables d'environnement SonarQube en utilisant la configuration: Silverpeas SonarCloud
08:56:55 [2025-11-27T07:56:55.068Z] [Pipeline] {
08:56:55 [2025-11-27T07:56:55.090Z] [Pipeline] sh
08:56:55 [2025-11-27T07:56:55.348Z] + JAVA_HOME=/usr/lib/jvm/java-17-openjdk-amd64 mvn org.codehaus.mojo:sonar-maven-plugin::sonar -Dsonar.projectKey=Silverpeas_Silverpeas-Looks -Dsonar.organization=silverpeas -Dsonar.branch.name=6.4.x
08:56:56 [2025-11-27T07:56:56.692Z] [INFO] Scanning for projects...
08:56:56 [2025-11-27T07:56:56.692Z] [INFO] ------------------------------------------------------------------------
08:56:56 [2025-11-27T07:56:56.692Z] [INFO] Reactor Build Order:
08:56:56 [2025-11-27T07:56:56.692Z] [INFO] 
08:56:56 [2025-11-27T07:56:56.692Z] [INFO] Silverpeas Looks                                                   [pom]
08:56:56 [2025-11-27T07:56:56.692Z] [INFO] Silverpeas Aurora Look                                             [pom]
08:56:56 [2025-11-27T07:56:56.692Z] [INFO] Look Aurora Configuration                                          [jar]
08:56:56 [2025-11-27T07:56:56.692Z] [INFO] Look Aurora Web Application                                        [war]
08:56:56 [2025-11-27T07:56:56.692Z] [WARNING] The artifact org.codehaus.mojo:sonar-maven-plugin:jar:4.0.0.4121 has been relocated to org.sonarsource.scanner.maven:sonar-maven-plugin:jar:4.0.0.4121: SonarQube plugin was moved to SonarSource organisation
08:56:56 [2025-11-27T07:56:56.692Z] [INFO] 
08:56:56 [2025-11-27T07:56:56.692Z] [INFO] ------------------------< org.silverpeas:looks >------------------------
08:56:56 [2025-11-27T07:56:56.692Z] [INFO] Building Silverpeas Looks 6.4.5-build251127                        [1/4]
08:56:56 [2025-11-27T07:56:56.692Z] [INFO]   from pom.xml
08:56:56 [2025-11-27T07:56:56.692Z] [INFO] --------------------------------[ pom ]---------------------------------
08:56:57 [2025-11-27T07:56:57.603Z] [INFO] 
08:56:57 [2025-11-27T07:56:57.603Z] [INFO] --- sonar-maven-plugin:4.0.0.4121:sonar (default-cli) @ looks ---
08:56:57 [2025-11-27T07:56:57.853Z] [INFO] 08:56:57.650 Java 17.0.11 Ubuntu (64-bit)
08:56:57 [2025-11-27T07:56:57.853Z] [INFO] 08:56:57.650 Linux 6.8.0-88-generic (amd64)
08:56:57 [2025-11-27T07:56:57.853Z] [INFO] 08:56:57.806 User cache: /home/silverbuild/.sonar/cache
08:56:58 [2025-11-27T07:56:58.404Z] [INFO] 08:56:58.177 Communicating with SonarCloud
08:56:58 [2025-11-27T07:56:58.404Z] [INFO] 08:56:58.251 Default locale: "fr_FR", source code encoding: "UTF-8"
08:56:58 [2025-11-27T07:56:58.655Z] [WARNING] 08:56:58.589 Property 'env.SONARQUBE_SCANNER_PARAMS' is encrypted. The encryption of scanner properties is deprecated and will soon be removed.
08:56:59 [2025-11-27T07:56:59.206Z] [INFO] 08:56:59.157 Load global settings
08:56:59 [2025-11-27T07:56:59.456Z] [INFO] 08:56:59.430 Load global settings (done) | time=274ms
08:56:59 [2025-11-27T07:56:59.707Z] [INFO] 08:56:59.505 Server id: 1BD809FA-AWHW8ct9-T_TB3XqouNu
08:56:59 [2025-11-27T07:56:59.707Z] [INFO] 08:56:59.694 Loading required plugins
08:56:59 [2025-11-27T07:56:59.707Z] [INFO] 08:56:59.695 Load plugins index
08:56:59 [2025-11-27T07:56:59.957Z] [INFO] 08:56:59.766 Load plugins index (done) | time=71ms
08:56:59 [2025-11-27T07:56:59.957Z] [INFO] 08:56:59.767 Load/download plugins
08:56:59 [2025-11-27T07:56:59.957Z] [INFO] 08:56:59.846 Load/download plugins (done) | time=79ms
08:57:00 [2025-11-27T07:57:00.207Z] [INFO] 08:56:59.996 Loaded core extensions: a3s, sca, architecture
08:57:00 [2025-11-27T07:57:00.458Z] [INFO] 08:57:00.325 Process project properties
08:57:00 [2025-11-27T07:57:00.458Z] [INFO] 08:57:00.345 Project key: Silverpeas_Silverpeas-Looks
08:57:00 [2025-11-27T07:57:00.458Z] [INFO] 08:57:00.345 Base dir: /var/lib/jenkins/workspace/Silverpeas_Stable_AutoDeploy/Silverpeas-Looks
08:57:00 [2025-11-27T07:57:00.458Z] [INFO] 08:57:00.345 Working dir: /var/lib/jenkins/workspace/Silverpeas_Stable_AutoDeploy/Silverpeas-Looks/target/sonar
08:57:00 [2025-11-27T07:57:00.458Z] [INFO] 08:57:00.362 Found an active CI vendor: 'Jenkins'
08:57:00 [2025-11-27T07:57:00.458Z] [INFO] 08:57:00.367 Load project branches
08:57:00 [2025-11-27T07:57:00.709Z] [INFO] 08:57:00.563 Load project branches (done) | time=196ms
08:57:00 [2025-11-27T07:57:00.709Z] [INFO] 08:57:00.569 Load project settings for component key: 'Silverpeas_Silverpeas-Looks'
08:57:00 [2025-11-27T07:57:00.959Z] [INFO] 08:57:00.855 Load project settings for component key: 'Silverpeas_Silverpeas-Looks' (done) | time=286ms
08:57:00 [2025-11-27T07:57:00.959Z] [INFO] 08:57:00.867 Inferred api base url 'https://api.sonarcloud.io' from host url 'https://sonarcloud.io'.
08:57:01 [2025-11-27T07:57:01.210Z] [INFO] 08:57:01.080 Inferred api base url 'https://api.sonarcloud.io' from host url 'https://sonarcloud.io'.
08:57:01 [2025-11-27T07:57:01.460Z] [INFO] 08:57:01.220 Check ALM binding of project 'Silverpeas_Silverpeas-Looks'
08:57:01 [2025-11-27T07:57:01.460Z] [INFO] 08:57:01.267 Detected project binding: BOUND
08:57:01 [2025-11-27T07:57:01.460Z] [INFO] 08:57:01.268 Check ALM binding of project 'Silverpeas_Silverpeas-Looks' (done) | time=48ms
08:57:01 [2025-11-27T07:57:01.460Z] [INFO] 08:57:01.275 Load project pull requests
08:57:01 [2025-11-27T07:57:01.460Z] [INFO] 08:57:01.320 Load project pull requests (done) | time=45ms
08:57:01 [2025-11-27T07:57:01.460Z] [INFO] 08:57:01.328 Load branch configuration
08:57:01 [2025-11-27T07:57:01.460Z] [INFO] 08:57:01.332 Load branch configuration (done) | time=4ms
08:57:01 [2025-11-27T07:57:01.460Z] [INFO] 08:57:01.360 Load quality profiles
08:57:01 [2025-11-27T07:57:01.711Z] [INFO] 08:57:01.700 Load quality profiles (done) | time=340ms
08:57:01 [2025-11-27T07:57:01.961Z] [INFO] 08:57:01.751 Inferred api base url 'https://api.sonarcloud.io' from host url 'https://sonarcloud.io'.
08:57:01 [2025-11-27T07:57:01.961Z] [INFO] 08:57:01.753 Create analysis
08:57:02 [2025-11-27T07:57:02.212Z] [INFO] 08:57:02.203 Create analysis (done) | time=450ms
08:57:02 [2025-11-27T07:57:02.212Z] [INFO] 08:57:02.208 Inferred api base url 'https://api.sonarcloud.io' from host url 'https://sonarcloud.io'.
08:57:02 [2025-11-27T07:57:02.462Z] [INFO] 08:57:02.380 Inferred api base url 'https://api.sonarcloud.io' from host url 'https://sonarcloud.io'.
08:57:02 [2025-11-27T07:57:02.462Z] [INFO] 08:57:02.381 Load active rules
08:57:03 [2025-11-27T07:57:03.373Z] [INFO] 08:57:03.328 Load active rules (done) | time=947ms
08:57:03 [2025-11-27T07:57:03.624Z] [INFO] 08:57:03.408 Organization key: silverpeas
08:57:03 [2025-11-27T07:57:03.624Z] [INFO] 08:57:03.409 Branch name: 6.4.x, type: long-lived
08:57:03 [2025-11-27T07:57:03.624Z] [INFO] 08:57:03.435 Preprocessing files...
08:57:03 [2025-11-27T07:57:03.874Z] [INFO] 08:57:03.767 5 languages detected in 152 preprocessed files (done) | time=332ms
08:57:03 [2025-11-27T07:57:03.874Z] [INFO] 08:57:03.768 0 files ignored because of inclusion/exclusion patterns
08:57:03 [2025-11-27T07:57:03.874Z] [INFO] 08:57:03.768 0 files ignored because of scm ignore settings
08:57:03 [2025-11-27T07:57:03.874Z] [INFO] 08:57:03.800 Loading plugins for detected languages
08:57:03 [2025-11-27T07:57:03.875Z] [INFO] 08:57:03.801 Load/download plugins
08:57:04 [2025-11-27T07:57:04.125Z] [INFO] 08:57:03.947 Load/download plugins (done) | time=146ms
08:57:04 [2025-11-27T07:57:04.375Z] [INFO] 08:57:04.367 Load project repositories
08:57:04 [2025-11-27T07:57:04.926Z] [INFO] 08:57:04.637 Load project repositories (done) | time=270ms
08:57:04 [2025-11-27T07:57:04.926Z] [INFO] 08:57:04.645 Indexing files...
08:57:04 [2025-11-27T07:57:04.926Z] [INFO] 08:57:04.645 Project configuration:
08:57:04 [2025-11-27T07:57:04.926Z] [INFO] 08:57:04.645   Excluded sources: **/build-wrapper-dump.json, **/src/integration-test/java/**, **/src/test/java/**
08:57:04 [2025-11-27T07:57:04.926Z] [INFO] 08:57:04.646   Included tests: **/src/integration-test/java/**, **/src/test/java/**
08:57:04 [2025-11-27T07:57:04.926Z] [INFO] 08:57:04.646   Excluded sources for coverage: **/*.js
08:57:04 [2025-11-27T07:57:04.926Z] [INFO] 08:57:04.648 Indexing files of module 'Look Aurora Configuration'
08:57:04 [2025-11-27T07:57:04.926Z] [INFO] 08:57:04.648   Base dir: /var/lib/jenkins/workspace/Silverpeas_Stable_AutoDeploy/Silverpeas-Looks/aurora/aurora-configuration
08:57:04 [2025-11-27T07:57:04.926Z] [INFO] 08:57:04.649   Source paths: pom.xml
08:57:04 [2025-11-27T07:57:04.926Z] [INFO] 08:57:04.649   Excluded sources: **/build-wrapper-dump.json, **/src/integration-test/java/**, **/src/test/java/**
08:57:04 [2025-11-27T07:57:04.926Z] [INFO] 08:57:04.650   Included tests: **/src/integration-test/java/**, **/src/test/java/**
08:57:04 [2025-11-27T07:57:04.927Z] [INFO] 08:57:04.650   Excluded sources for coverage: **/*.js
08:57:04 [2025-11-27T07:57:04.927Z] [INFO] 08:57:04.654 Indexing files of module 'Look Aurora Web Application'
08:57:04 [2025-11-27T07:57:04.927Z] [INFO] 08:57:04.654   Base dir: /var/lib/jenkins/workspace/Silverpeas_Stable_AutoDeploy/Silverpeas-Looks/aurora/aurora-war
08:57:04 [2025-11-27T07:57:04.927Z] [INFO] 08:57:04.654   Source paths: src/main/webapp, pom.xml, src/main/java
08:57:04 [2025-11-27T07:57:04.927Z] [INFO] 08:57:04.654   Excluded sources: **/build-wrapper-dump.json, **/src/integration-test/java/**, **/src/test/java/**
08:57:04 [2025-11-27T07:57:04.927Z] [INFO] 08:57:04.654   Included tests: **/src/integration-test/java/**, **/src/test/java/**
08:57:04 [2025-11-27T07:57:04.927Z] [INFO] 08:57:04.655   Excluded sources for coverage: **/*.js
08:57:04 [2025-11-27T07:57:04.927Z] [INFO] 08:57:04.724 Indexing files of module 'Silverpeas Aurora Look'
08:57:04 [2025-11-27T07:57:04.927Z] [INFO] 08:57:04.724   Base dir: /var/lib/jenkins/workspace/Silverpeas_Stable_AutoDeploy/Silverpeas-Looks/aurora
08:57:04 [2025-11-27T07:57:04.927Z] [INFO] 08:57:04.724   Source paths: pom.xml
08:57:04 [2025-11-27T07:57:04.927Z] [INFO] 08:57:04.725   Excluded sources: **/build-wrapper-dump.json, **/src/integration-test/java/**, **/src/test/java/**
08:57:04 [2025-11-27T07:57:04.927Z] [INFO] 08:57:04.725   Included tests: **/src/integration-test/java/**, **/src/test/java/**
08:57:04 [2025-11-27T07:57:04.927Z] [INFO] 08:57:04.725   Excluded sources for coverage: **/*.js
08:57:04 [2025-11-27T07:57:04.927Z] [INFO] 08:57:04.726 Indexing files of module 'Silverpeas Looks'
08:57:04 [2025-11-27T07:57:04.927Z] [INFO] 08:57:04.726   Base dir: /var/lib/jenkins/workspace/Silverpeas_Stable_AutoDeploy/Silverpeas-Looks
08:57:04 [2025-11-27T07:57:04.927Z] [INFO] 08:57:04.726   Source paths: pom.xml
08:57:04 [2025-11-27T07:57:04.927Z] [INFO] 08:57:04.727   Excluded sources: **/build-wrapper-dump.json, **/src/integration-test/java/**, **/src/test/java/**
08:57:04 [2025-11-27T07:57:04.927Z] [INFO] 08:57:04.727   Included tests: **/src/integration-test/java/**, **/src/test/java/**
08:57:04 [2025-11-27T07:57:04.927Z] [INFO] 08:57:04.727   Excluded sources for coverage: **/*.js
08:57:04 [2025-11-27T07:57:04.927Z] [INFO] 08:57:04.728 152 files indexed (done) | time=83ms
08:57:04 [2025-11-27T07:57:04.927Z] [INFO] 08:57:04.739 Quality profile for css: Sonar way
08:57:04 [2025-11-27T07:57:04.927Z] [INFO] 08:57:04.739 Quality profile for java: Silverpeas way
08:57:04 [2025-11-27T07:57:04.927Z] [INFO] 08:57:04.739 Quality profile for js: Sonar way
08:57:04 [2025-11-27T07:57:04.927Z] [INFO] 08:57:04.739 Quality profile for jsp: Sonar way
08:57:04 [2025-11-27T07:57:04.927Z] [INFO] 08:57:04.740 Quality profile for xml: Sonar way
08:57:04 [2025-11-27T07:57:04.927Z] [INFO] 08:57:04.740 ------------- Run sensors on module Look Aurora Web Application
08:57:04 [2025-11-27T07:57:04.927Z] [INFO] 08:57:04.854 Load metrics repository
08:57:04 [2025-11-27T07:57:04.927Z] [INFO] 08:57:04.924 Load metrics repository (done) | time=70ms
08:57:05 [2025-11-27T07:57:05.178Z] [INFO] 08:57:04.932 Sensor cache enabled
08:57:05 [2025-11-27T07:57:05.178Z] [INFO] 08:57:04.934 Inferred api base url 'https://api.sonarcloud.io' from host url 'https://sonarcloud.io'.
08:57:05 [2025-11-27T07:57:05.178Z] [INFO] 08:57:04.936 Load sensor cache
08:57:05 [2025-11-27T07:57:05.728Z] [INFO] 08:57:05.548 Load sensor cache (451 KB) | time=612ms
08:57:05 [2025-11-27T07:57:05.728Z] [INFO] 08:57:05.551 Inferred api base url 'https://api.sonarcloud.io' from host url 'https://sonarcloud.io'.
08:57:07 [2025-11-27T07:57:07.072Z] [INFO] 08:57:06.836 Reflections took 77 ms to scan 1 urls, producing 24 keys and 257 values
08:57:07 [2025-11-27T07:57:07.323Z] [INFO] 08:57:07.123 Sensor JavaSensor [java]
08:57:07 [2025-11-27T07:57:07.323Z] [INFO] 08:57:07.127 Configured Java source version (sonar.java.source): 11, preview features enabled (sonar.java.enablePreview): false
08:57:07 [2025-11-27T07:57:07.874Z] nov. 27, 2025 8:57:07 AM org.apache.jasper.servlet.TldScanner scanJars
08:57:07 [2025-11-27T07:57:07.874Z] INFOS: At least one JAR was scanned for TLDs yet contained no TLDs. Enable debug logging for this logger for a complete list of JARs that were scanned but no TLDs were found in them. Skipping unneeded JARs during scanning can improve startup time and JSP compilation time.
08:57:10 [2025-11-27T07:57:10.357Z] [WARNING] 08:57:10.146 Some JSP pages failed to transpile. Enable debug log for details.
08:57:10 [2025-11-27T07:57:10.357Z] [INFO] 08:57:10.184 Server-side caching is enabled. The Java analyzer will not try to leverage data from a previous analysis.
08:57:10 [2025-11-27T07:57:10.357Z] [INFO] 08:57:10.186 Using ECJ batch to parse 32 Main java source files with batch size 419 KB.
08:57:10 [2025-11-27T07:57:10.607Z] [INFO] 08:57:10.473 Starting batch processing.
08:57:10 [2025-11-27T07:57:10.858Z] [INFO] 08:57:10.812 The Java analyzer cannot skip unchanged files in this context. A full analysis is performed for all files.
08:57:18 [2025-11-27T07:57:18.882Z] [INFO] 08:57:17.919 100% analyzed
08:57:18 [2025-11-27T07:57:18.882Z] [INFO] 08:57:17.919 Batch processing: Done.
08:57:18 [2025-11-27T07:57:18.882Z] [INFO] 08:57:17.921 Did not optimize analysis for any files, performed a full analysis for all 32 files.
08:57:18 [2025-11-27T07:57:18.882Z] [INFO] 08:57:17.998 No "Test" source files to scan.
08:57:18 [2025-11-27T07:57:18.882Z] [INFO] 08:57:17.998 Using ECJ batch to parse 6 Generated java source files with batch size 419 KB.
08:57:18 [2025-11-27T07:57:18.882Z] [INFO] 08:57:18.002 Starting batch processing.
08:57:19 [2025-11-27T07:57:19.432Z] [INFO] 08:57:19.317 100% analyzed
08:57:19 [2025-11-27T07:57:19.432Z] [INFO] 08:57:19.318 Batch processing: Done.
08:57:19 [2025-11-27T07:57:19.432Z] [INFO] 08:57:19.318 Did not optimize analysis for any files, performed a full analysis for all 6 files.
08:57:19 [2025-11-27T07:57:19.432Z] [WARNING] 08:57:19.320 Unresolved imports/types have been detected during analysis. Enable DEBUG mode to see them.
08:57:19 [2025-11-27T07:57:19.432Z] [INFO] 08:57:19.326 Sensor JavaSensor [java] (done) | time=12203ms
08:57:19 [2025-11-27T07:57:19.432Z] [INFO] 08:57:19.326 Sensor JaCoCo XML Report Importer [jacoco]
08:57:19 [2025-11-27T07:57:19.433Z] [INFO] 08:57:19.327 'sonar.coverage.jacoco.xmlReportPaths' is not defined. Using default locations: target/site/jacoco/jacoco.xml,target/site/jacoco-it/jacoco.xml,build/reports/jacoco/test/jacocoTestReport.xml
08:57:19 [2025-11-27T07:57:19.433Z] [INFO] 08:57:19.328 No report imported, no coverage information will be imported by JaCoCo XML Report Importer
08:57:19 [2025-11-27T07:57:19.433Z] [INFO] 08:57:19.328 Sensor JaCoCo XML Report Importer [jacoco] (done) | time=2ms
08:57:19 [2025-11-27T07:57:19.433Z] [INFO] 08:57:19.328 Sensor IaC Docker Sensor [iac]
08:57:19 [2025-11-27T07:57:19.433Z] [INFO] 08:57:19.331 There are no files to be analyzed for the Docker language
08:57:19 [2025-11-27T07:57:19.433Z] [INFO] 08:57:19.331 Sensor IaC Docker Sensor [iac] (done) | time=3ms
08:57:19 [2025-11-27T07:57:19.433Z] [INFO] 08:57:19.331 Sensor IaC hadolint report Sensor [iac]
08:57:19 [2025-11-27T07:57:19.433Z] [INFO] 08:57:19.332 Sensor IaC hadolint report Sensor [iac] (done) | time=1ms
08:57:19 [2025-11-27T07:57:19.433Z] [INFO] 08:57:19.333 Sensor Java Config Sensor [iac]
08:57:19 [2025-11-27T07:57:19.433Z] [INFO] 08:57:19.341 There are no files to be analyzed for the Java language
08:57:19 [2025-11-27T07:57:19.433Z] [INFO] 08:57:19.341 Sensor Java Config Sensor [iac] (done) | time=8ms
08:57:19 [2025-11-27T07:57:19.433Z] [INFO] 08:57:19.341 Sensor IaC GitHub Actions Sensor [iac]
08:57:19 [2025-11-27T07:57:19.433Z] [INFO] 08:57:19.342 There are no files to be analyzed for the GitHub Actions language
08:57:19 [2025-11-27T07:57:19.433Z] [INFO] 08:57:19.342 Sensor IaC GitHub Actions Sensor [iac] (done) | time=1ms
08:57:19 [2025-11-27T07:57:19.433Z] [INFO] 08:57:19.342 Sensor IaC Shell Sensor [iac]
08:57:19 [2025-11-27T07:57:19.433Z] [INFO] 08:57:19.342 There are no files to be analyzed for the Shell language
08:57:19 [2025-11-27T07:57:19.433Z] [INFO] 08:57:19.342 Sensor IaC Shell Sensor [iac] (done) | time=0ms
08:57:19 [2025-11-27T07:57:19.433Z] [INFO] 08:57:19.343 Sensor JavaScript/TypeScript analysis [javascript]
08:57:19 [2025-11-27T07:57:19.983Z] [INFO] 08:57:19.716 Detected os: Linux arch: amd64 alpine: false. Platform: LINUX_X64
08:57:19 [2025-11-27T07:57:19.983Z] [INFO] 08:57:19.717 Deploy location /home/silverbuild/.sonar/js/node-runtime, tagetRuntime: /home/silverbuild/.sonar/js/node-runtime/node,  version: /home/silverbuild/.sonar/js/node-runtime/version.txt
08:57:19 [2025-11-27T07:57:19.983Z] [INFO] 08:57:19.731 Using embedded Node.js runtime.
08:57:19 [2025-11-27T07:57:19.984Z] [INFO] 08:57:19.732 Using Node.js executable: '/home/silverbuild/.sonar/js/node-runtime/node'.
08:57:22 [2025-11-27T07:57:22.467Z] [INFO] 08:57:22.347 Memory configuration: OS (31993 MB), Node.js (4288 MB).
08:57:22 [2025-11-27T07:57:22.467Z] [INFO] 08:57:22.444 WebSocket client connected on /ws
08:57:22 [2025-11-27T07:57:22.467Z] [INFO] 08:57:22.448 Plugin version: [11.6.0.36606]
08:57:24 [2025-11-27T07:57:24.950Z] [INFO] 08:57:24.823 Some of the project files were automatically excluded because they looked like generated code. Enable debug logging to see which files were excluded. You can disable bundle detection by setting sonar.javascript.detectBundles=false
08:57:25 [2025-11-27T07:57:25.201Z] [INFO] 08:57:25.007 Using generated tsconfig.json file using wildcards /tmp/tsconfig-4WB1su.json
08:57:27 [2025-11-27T07:57:27.063Z] [INFO] 08:57:26.806 Found 1 tsconfig.json file(s): [/tmp/tsconfig-4WB1su.json]
08:57:27 [2025-11-27T07:57:27.063Z] [INFO] 08:57:26.807 2 source files to be analyzed
08:57:27 [2025-11-27T07:57:27.063Z] [INFO] 08:57:26.807 Creating TypeScript program
08:57:27 [2025-11-27T07:57:27.063Z] [INFO] 08:57:26.808 TypeScript(5.9.3) configuration file /tmp/tsconfig-4WB1su.json
08:57:27 [2025-11-27T07:57:27.063Z] [INFO] 08:57:26.808 2/2 source files have been analyzed
08:57:27 [2025-11-27T07:57:27.063Z] [INFO] 08:57:26.976 JasminAstConsumer done
08:57:27 [2025-11-27T07:57:27.063Z] [INFO] 08:57:26.977 Hit the cache for 0 out of 8
08:57:27 [2025-11-27T07:57:27.063Z] [INFO] 08:57:26.978 Miss the cache for 8 out of 8: ANALYSIS_MODE_INELIGIBLE [8/8]
08:57:27 [2025-11-27T07:57:27.063Z] [INFO] 08:57:26.978 Sensor JavaScript/TypeScript analysis [javascript] (done) | time=7635ms
08:57:27 [2025-11-27T07:57:27.063Z] [INFO] 08:57:26.978 Sensor CSS Rules [javascript]
08:57:27 [2025-11-27T07:57:27.063Z] [INFO] 08:57:27.030 8 source files to be analyzed
08:57:27 [2025-11-27T07:57:27.614Z] [INFO] 08:57:27.352 8/8 source files have been analyzed
08:57:27 [2025-11-27T07:57:27.614Z] [INFO] 08:57:27.353 Hit the cache for 0 out of 0
08:57:27 [2025-11-27T07:57:27.614Z] [INFO] 08:57:27.353 Miss the cache for 0 out of 0
08:57:27 [2025-11-27T07:57:27.614Z] [INFO] 08:57:27.354 Sensor CSS Rules [javascript] (done) | time=376ms
08:57:27 [2025-11-27T07:57:27.614Z] [INFO] 08:57:27.354 Sensor CSS Metrics [javascript]
08:57:27 [2025-11-27T07:57:27.614Z] [INFO] 08:57:27.476 Sensor CSS Metrics [javascript] (done) | time=122ms
08:57:27 [2025-11-27T07:57:27.614Z] [INFO] 08:57:27.476 Sensor ThymeLeaf template sensor [securityjavafrontend]
08:57:27 [2025-11-27T07:57:27.614Z] [INFO] 08:57:27.477 Sensor ThymeLeaf template sensor [securityjavafrontend] (done) | time=1ms
08:57:27 [2025-11-27T07:57:27.614Z] [INFO] 08:57:27.477 Sensor JavaAndroidConfigurationSensor [securityjavafrontend]
08:57:27 [2025-11-27T07:57:27.614Z] [INFO] 08:57:27.478 Sensor JavaAndroidConfigurationSensor [securityjavafrontend] (done) | time=1ms
08:57:27 [2025-11-27T07:57:27.614Z] [INFO] 08:57:27.478 Sensor SurefireSensor [java]
08:57:27 [2025-11-27T07:57:27.614Z] [INFO] 08:57:27.479 parsing [/var/lib/jenkins/workspace/Silverpeas_Stable_AutoDeploy/Silverpeas-Looks/aurora/aurora-war/target/surefire-reports]
08:57:27 [2025-11-27T07:57:27.614Z] [INFO] 08:57:27.480 Sensor SurefireSensor [java] (done) | time=2ms
08:57:27 [2025-11-27T07:57:27.614Z] [INFO] 08:57:27.480 Sensor HTML [web]
08:57:27 [2025-11-27T07:57:27.864Z] [INFO] 08:57:27.764 Sensor HTML [web] (done) | time=284ms
08:57:27 [2025-11-27T07:57:27.864Z] [INFO] 08:57:27.765 Sensor XML Sensor [xml]
08:57:27 [2025-11-27T07:57:27.864Z] [INFO] 08:57:27.767 3 source files to be analyzed
08:57:28 [2025-11-27T07:57:28.115Z] [INFO] 08:57:27.928 3/3 source files have been analyzed
08:57:28 [2025-11-27T07:57:28.115Z] [INFO] 08:57:27.928 Sensor XML Sensor [xml] (done) | time=163ms
08:57:28 [2025-11-27T07:57:28.115Z] [INFO] 08:57:27.928 Sensor JasminFileCollectorSensor [jasmin]
08:57:28 [2025-11-27T07:57:28.115Z] [INFO] 08:57:27.930 Sensor JasminFileCollectorSensor [jasmin] (done) | time=2ms
08:57:28 [2025-11-27T07:57:28.115Z] [INFO] 08:57:27.935 ------------- Run sensors on module Look Aurora Configuration
08:57:28 [2025-11-27T07:57:28.115Z] [INFO] 08:57:28.091 Reflections took 22 ms to scan 1 urls, producing 24 keys and 257 values
08:57:28 [2025-11-27T07:57:28.366Z] [INFO] 08:57:28.116 Sensor JaCoCo XML Report Importer [jacoco]
08:57:28 [2025-11-27T07:57:28.366Z] [INFO] 08:57:28.116 'sonar.coverage.jacoco.xmlReportPaths' is not defined. Using default locations: target/site/jacoco/jacoco.xml,target/site/jacoco-it/jacoco.xml,build/reports/jacoco/test/jacocoTestReport.xml
08:57:28 [2025-11-27T07:57:28.366Z] [INFO] 08:57:28.116 No report imported, no coverage information will be imported by JaCoCo XML Report Importer
08:57:28 [2025-11-27T07:57:28.366Z] [INFO] 08:57:28.116 Sensor JaCoCo XML Report Importer [jacoco] (done) | time=0ms
08:57:28 [2025-11-27T07:57:28.366Z] [INFO] 08:57:28.117 Sensor IaC Docker Sensor [iac]
08:57:28 [2025-11-27T07:57:28.366Z] [INFO] 08:57:28.117 There are no files to be analyzed for the Docker language
08:57:28 [2025-11-27T07:57:28.366Z] [INFO] 08:57:28.117 Sensor IaC Docker Sensor [iac] (done) | time=0ms
08:57:28 [2025-11-27T07:57:28.366Z] [INFO] 08:57:28.117 Sensor IaC hadolint report Sensor [iac]
08:57:28 [2025-11-27T07:57:28.366Z] [INFO] 08:57:28.117 Sensor IaC hadolint report Sensor [iac] (done) | time=0ms
08:57:28 [2025-11-27T07:57:28.366Z] [INFO] 08:57:28.118 Sensor Java Config Sensor [iac]
08:57:28 [2025-11-27T07:57:28.366Z] [INFO] 08:57:28.118 There are no files to be analyzed for the Java language
08:57:28 [2025-11-27T07:57:28.366Z] [INFO] 08:57:28.118 Sensor Java Config Sensor [iac] (done) | time=0ms
08:57:28 [2025-11-27T07:57:28.366Z] [INFO] 08:57:28.118 Sensor IaC GitHub Actions Sensor [iac]
08:57:28 [2025-11-27T07:57:28.366Z] [INFO] 08:57:28.118 There are no files to be analyzed for the GitHub Actions language
08:57:28 [2025-11-27T07:57:28.366Z] [INFO] 08:57:28.119 Sensor IaC GitHub Actions Sensor [iac] (done) | time=1ms
08:57:28 [2025-11-27T07:57:28.366Z] [INFO] 08:57:28.119 Sensor IaC Shell Sensor [iac]
08:57:28 [2025-11-27T07:57:28.366Z] [INFO] 08:57:28.119 There are no files to be analyzed for the Shell language
08:57:28 [2025-11-27T07:57:28.366Z] [INFO] 08:57:28.119 Sensor IaC Shell Sensor [iac] (done) | time=0ms
08:57:28 [2025-11-27T07:57:28.366Z] [INFO] 08:57:28.119 Sensor CSS Rules [javascript]
08:57:28 [2025-11-27T07:57:28.366Z] [INFO] 08:57:28.119 No CSS, PHP, HTML or VueJS files are found in the project. CSS analysis is skipped.
08:57:28 [2025-11-27T07:57:28.366Z] [INFO] 08:57:28.119 Sensor CSS Rules [javascript] (done) | time=0ms
08:57:28 [2025-11-27T07:57:28.366Z] [INFO] 08:57:28.120 Sensor ThymeLeaf template sensor [securityjavafrontend]
08:57:28 [2025-11-27T07:57:28.366Z] [INFO] 08:57:28.120 Sensor ThymeLeaf template sensor [securityjavafrontend] (done) | time=0ms
08:57:28 [2025-11-27T07:57:28.366Z] [INFO] 08:57:28.120 Sensor JavaAndroidConfigurationSensor [securityjavafrontend]
08:57:28 [2025-11-27T07:57:28.366Z] [INFO] 08:57:28.120 Sensor JavaAndroidConfigurationSensor [securityjavafrontend] (done) | time=0ms
08:57:28 [2025-11-27T07:57:28.366Z] [INFO] 08:57:28.120 Sensor HTML [web]
08:57:28 [2025-11-27T07:57:28.366Z] [INFO] 08:57:28.120 Sensor HTML [web] (done) | time=0ms
08:57:28 [2025-11-27T07:57:28.366Z] [INFO] 08:57:28.121 Sensor XML Sensor [xml]
08:57:28 [2025-11-27T07:57:28.366Z] [INFO] 08:57:28.121 1 source file to be analyzed
08:57:28 [2025-11-27T07:57:28.366Z] [INFO] 08:57:28.137 1/1 source file has been analyzed
08:57:28 [2025-11-27T07:57:28.366Z] [INFO] 08:57:28.137 Sensor XML Sensor [xml] (done) | time=16ms
08:57:28 [2025-11-27T07:57:28.366Z] [INFO] 08:57:28.138 ------------- Run sensors on module Silverpeas Aurora Look
08:57:28 [2025-11-27T07:57:28.366Z] [WARNING] 08:57:28.206 Binary paths (sonar.java.binaries) are empty. .class files can not be looked up to facilitate caching.
08:57:28 [2025-11-27T07:57:28.366Z] [INFO] 08:57:28.264 Reflections took 19 ms to scan 1 urls, producing 24 keys and 257 values
08:57:28 [2025-11-27T07:57:28.366Z] [INFO] 08:57:28.288 Sensor JaCoCo XML Report Importer [jacoco]
08:57:28 [2025-11-27T07:57:28.367Z] [INFO] 08:57:28.289 'sonar.coverage.jacoco.xmlReportPaths' is not defined. Using default locations: target/site/jacoco/jacoco.xml,target/site/jacoco-it/jacoco.xml,build/reports/jacoco/test/jacocoTestReport.xml
08:57:28 [2025-11-27T07:57:28.367Z] [INFO] 08:57:28.289 No report imported, no coverage information will be imported by JaCoCo XML Report Importer
08:57:28 [2025-11-27T07:57:28.367Z] [INFO] 08:57:28.289 Sensor JaCoCo XML Report Importer [jacoco] (done) | time=1ms
08:57:28 [2025-11-27T07:57:28.367Z] [INFO] 08:57:28.289 Sensor IaC Docker Sensor [iac]
08:57:28 [2025-11-27T07:57:28.367Z] [INFO] 08:57:28.289 There are no files to be analyzed for the Docker language
08:57:28 [2025-11-27T07:57:28.367Z] [INFO] 08:57:28.289 Sensor IaC Docker Sensor [iac] (done) | time=0ms
08:57:28 [2025-11-27T07:57:28.367Z] [INFO] 08:57:28.290 Sensor IaC hadolint report Sensor [iac]
08:57:28 [2025-11-27T07:57:28.367Z] [INFO] 08:57:28.290 Sensor IaC hadolint report Sensor [iac] (done) | time=0ms
08:57:28 [2025-11-27T07:57:28.367Z] [INFO] 08:57:28.290 Sensor Java Config Sensor [iac]
08:57:28 [2025-11-27T07:57:28.367Z] [INFO] 08:57:28.290 There are no files to be analyzed for the Java language
08:57:28 [2025-11-27T07:57:28.367Z] [INFO] 08:57:28.290 Sensor Java Config Sensor [iac] (done) | time=0ms
08:57:28 [2025-11-27T07:57:28.367Z] [INFO] 08:57:28.290 Sensor IaC GitHub Actions Sensor [iac]
08:57:28 [2025-11-27T07:57:28.367Z] [INFO] 08:57:28.291 There are no files to be analyzed for the GitHub Actions language
08:57:28 [2025-11-27T07:57:28.367Z] [INFO] 08:57:28.291 Sensor IaC GitHub Actions Sensor [iac] (done) | time=1ms
08:57:28 [2025-11-27T07:57:28.367Z] [INFO] 08:57:28.291 Sensor IaC Shell Sensor [iac]
08:57:28 [2025-11-27T07:57:28.367Z] [INFO] 08:57:28.291 There are no files to be analyzed for the Shell language
08:57:28 [2025-11-27T07:57:28.367Z] [INFO] 08:57:28.291 Sensor IaC Shell Sensor [iac] (done) | time=0ms
08:57:28 [2025-11-27T07:57:28.367Z] [INFO] 08:57:28.291 Sensor CSS Rules [javascript]
08:57:28 [2025-11-27T07:57:28.367Z] [INFO] 08:57:28.291 No CSS, PHP, HTML or VueJS files are found in the project. CSS analysis is skipped.
08:57:28 [2025-11-27T07:57:28.367Z] [INFO] 08:57:28.291 Sensor CSS Rules [javascript] (done) | time=0ms
08:57:28 [2025-11-27T07:57:28.367Z] [INFO] 08:57:28.292 Sensor ThymeLeaf template sensor [securityjavafrontend]
08:57:28 [2025-11-27T07:57:28.367Z] [INFO] 08:57:28.292 Sensor ThymeLeaf template sensor [securityjavafrontend] (done) | time=0ms
08:57:28 [2025-11-27T07:57:28.367Z] [INFO] 08:57:28.292 Sensor JavaAndroidConfigurationSensor [securityjavafrontend]
08:57:28 [2025-11-27T07:57:28.367Z] [INFO] 08:57:28.292 Sensor JavaAndroidConfigurationSensor [securityjavafrontend] (done) | time=0ms
08:57:28 [2025-11-27T07:57:28.367Z] [INFO] 08:57:28.292 Sensor HTML [web]
08:57:28 [2025-11-27T07:57:28.367Z] [INFO] 08:57:28.293 Sensor HTML [web] (done) | time=1ms
08:57:28 [2025-11-27T07:57:28.367Z] [INFO] 08:57:28.293 Sensor XML Sensor [xml]
08:57:28 [2025-11-27T07:57:28.367Z] [INFO] 08:57:28.293 1 source file to be analyzed
08:57:28 [2025-11-27T07:57:28.367Z] [INFO] 08:57:28.302 1/1 source file has been analyzed
08:57:28 [2025-11-27T07:57:28.367Z] [INFO] 08:57:28.302 Sensor XML Sensor [xml] (done) | time=9ms
08:57:28 [2025-11-27T07:57:28.367Z] [INFO] 08:57:28.303 ------------- Run sensors on module Silverpeas Looks
08:57:28 [2025-11-27T07:57:28.367Z] [WARNING] 08:57:28.359 Binary paths (sonar.java.binaries) are empty. .class files can not be looked up to facilitate caching.
08:57:28 [2025-11-27T07:57:28.618Z] [INFO] 08:57:28.404 Reflections took 17 ms to scan 1 urls, producing 24 keys and 257 values
08:57:28 [2025-11-27T07:57:28.618Z] [INFO] 08:57:28.427 Sensor JaCoCo XML Report Importer [jacoco]
08:57:28 [2025-11-27T07:57:28.618Z] [INFO] 08:57:28.427 'sonar.coverage.jacoco.xmlReportPaths' is not defined. Using default locations: target/site/jacoco/jacoco.xml,target/site/jacoco-it/jacoco.xml,build/reports/jacoco/test/jacocoTestReport.xml
08:57:28 [2025-11-27T07:57:28.618Z] [INFO] 08:57:28.427 No report imported, no coverage information will be imported by JaCoCo XML Report Importer
08:57:28 [2025-11-27T07:57:28.618Z] [INFO] 08:57:28.427 Sensor JaCoCo XML Report Importer [jacoco] (done) | time=0ms
08:57:28 [2025-11-27T07:57:28.618Z] [INFO] 08:57:28.427 Sensor IaC Docker Sensor [iac]
08:57:28 [2025-11-27T07:57:28.618Z] [INFO] 08:57:28.427 There are no files to be analyzed for the Docker language
08:57:28 [2025-11-27T07:57:28.618Z] [INFO] 08:57:28.428 Sensor IaC Docker Sensor [iac] (done) | time=1ms
08:57:28 [2025-11-27T07:57:28.618Z] [INFO] 08:57:28.428 Sensor IaC hadolint report Sensor [iac]
08:57:28 [2025-11-27T07:57:28.618Z] [INFO] 08:57:28.428 Sensor IaC hadolint report Sensor [iac] (done) | time=0ms
08:57:28 [2025-11-27T07:57:28.618Z] [INFO] 08:57:28.428 Sensor Java Config Sensor [iac]
08:57:28 [2025-11-27T07:57:28.618Z] [INFO] 08:57:28.428 There are no files to be analyzed for the Java language
08:57:28 [2025-11-27T07:57:28.618Z] [INFO] 08:57:28.428 Sensor Java Config Sensor [iac] (done) | time=0ms
08:57:28 [2025-11-27T07:57:28.618Z] [INFO] 08:57:28.428 Sensor IaC GitHub Actions Sensor [iac]
08:57:28 [2025-11-27T07:57:28.618Z] [INFO] 08:57:28.429 There are no files to be analyzed for the GitHub Actions language
08:57:28 [2025-11-27T07:57:28.618Z] [INFO] 08:57:28.429 Sensor IaC GitHub Actions Sensor [iac] (done) | time=1ms
08:57:28 [2025-11-27T07:57:28.618Z] [INFO] 08:57:28.429 Sensor IaC Shell Sensor [iac]
08:57:28 [2025-11-27T07:57:28.618Z] [INFO] 08:57:28.429 There are no files to be analyzed for the Shell language
08:57:28 [2025-11-27T07:57:28.618Z] [INFO] 08:57:28.429 Sensor IaC Shell Sensor [iac] (done) | time=0ms
08:57:28 [2025-11-27T07:57:28.618Z] [INFO] 08:57:28.429 Sensor CSS Rules [javascript]
08:57:28 [2025-11-27T07:57:28.618Z] [INFO] 08:57:28.429 No CSS, PHP, HTML or VueJS files are found in the project. CSS analysis is skipped.
08:57:28 [2025-11-27T07:57:28.618Z] [INFO] 08:57:28.429 Sensor CSS Rules [javascript] (done) | time=0ms
08:57:28 [2025-11-27T07:57:28.618Z] [INFO] 08:57:28.430 Sensor ThymeLeaf template sensor [securityjavafrontend]
08:57:28 [2025-11-27T07:57:28.618Z] [INFO] 08:57:28.430 Sensor ThymeLeaf template sensor [securityjavafrontend] (done) | time=0ms
08:57:28 [2025-11-27T07:57:28.618Z] [INFO] 08:57:28.430 Sensor JavaAndroidConfigurationSensor [securityjavafrontend]
08:57:28 [2025-11-27T07:57:28.618Z] [INFO] 08:57:28.430 Sensor JavaAndroidConfigurationSensor [securityjavafrontend] (done) | time=0ms
08:57:28 [2025-11-27T07:57:28.618Z] [INFO] 08:57:28.430 Sensor HTML [web]
08:57:28 [2025-11-27T07:57:28.618Z] [INFO] 08:57:28.430 Sensor HTML [web] (done) | time=0ms
08:57:28 [2025-11-27T07:57:28.618Z] [INFO] 08:57:28.430 Sensor XML Sensor [xml]
08:57:28 [2025-11-27T07:57:28.618Z] [INFO] 08:57:28.431 1 source file to be analyzed
08:57:28 [2025-11-27T07:57:28.618Z] [INFO] 08:57:28.467 1/1 source file has been analyzed
08:57:28 [2025-11-27T07:57:28.618Z] [INFO] 08:57:28.467 Sensor XML Sensor [xml] (done) | time=37ms
08:57:28 [2025-11-27T07:57:28.618Z] [INFO] 08:57:28.468 Sensor DBD/Java IR Generation [dbdjavafrontendrewrite]
08:57:28 [2025-11-27T07:57:28.618Z] [INFO] 08:57:28.573 Sensor DBD/Java IR Generation [dbdjavafrontendrewrite] (done) | time=106ms
08:57:28 [2025-11-27T07:57:28.618Z] [INFO] 08:57:28.573 Sensor javabugs [dbd]
08:57:29 [2025-11-27T07:57:29.169Z] [INFO] 08:57:28.941 Analyzing 641/1069 functions to detect bugs.
08:57:30 [2025-11-27T07:57:30.512Z] [INFO] 08:57:30.082 Sensor javabugs [dbd] (done) | time=1509ms
08:57:30 [2025-11-27T07:57:30.513Z] [INFO] 08:57:30.083 Sensor pythonbugs [dbd]
08:57:30 [2025-11-27T07:57:30.513Z] [INFO] 08:57:30.084 No IR files have been included for analysis.
08:57:30 [2025-11-27T07:57:30.513Z] [INFO] 08:57:30.085 Sensor pythonbugs [dbd] (done) | time=2ms
08:57:30 [2025-11-27T07:57:30.513Z] [INFO] 08:57:30.085 Sensor EnterpriseTextAndSecretsSensor [textenterprise]
08:57:30 [2025-11-27T07:57:30.513Z] [INFO] 08:57:30.096 Available processors: 12
08:57:30 [2025-11-27T07:57:30.513Z] [INFO] 08:57:30.096 Using 12 threads for analysis.
08:57:30 [2025-11-27T07:57:30.765Z] [INFO] 08:57:30.529 The property "sonar.tests" is not set. To improve the analysis accuracy, we categorize a file as a test file if any of the following is true:
08:57:30 [2025-11-27T07:57:30.765Z]   * The filename starts with "test"
08:57:30 [2025-11-27T07:57:30.765Z]   * The filename contains "test." or "tests."
08:57:30 [2025-11-27T07:57:30.765Z]   * Any directory in the file path is named: "doc", "docs", "test" or "tests"
08:57:30 [2025-11-27T07:57:30.765Z]   * Any directory in the file path has a name ending in "test" or "tests"
08:57:30 [2025-11-27T07:57:30.765Z] 
08:57:30 [2025-11-27T07:57:30.765Z] [INFO] 08:57:30.604 Start fetching files for the text and secrets analysis
08:57:30 [2025-11-27T07:57:30.765Z] [INFO] 08:57:30.613 Using Git CLI to retrieve untracked files
08:57:30 [2025-11-27T07:57:30.765Z] [INFO] 08:57:30.629 Retrieving language associated files and files included via "sonar.text.inclusions" that are tracked by git
08:57:30 [2025-11-27T07:57:30.766Z] [INFO] 08:57:30.636 Starting the text and secrets analysis
08:57:30 [2025-11-27T07:57:30.766Z] [INFO] 08:57:30.638 66 source files to be analyzed for the text and secrets analysis
08:57:31 [2025-11-27T07:57:31.316Z] [INFO] 08:57:31.027 66/66 source files have been analyzed for the text and secrets analysis
08:57:31 [2025-11-27T07:57:31.316Z] [INFO] 08:57:31.031 Start fetching files for the binary file analysis
08:57:31 [2025-11-27T07:57:31.316Z] [INFO] 08:57:31.032 There are no files to be analyzed for the binary file analysis
08:57:31 [2025-11-27T07:57:31.316Z] [INFO] 08:57:31.034 Sensor EnterpriseTextAndSecretsSensor [textenterprise] (done) | time=949ms
08:57:31 [2025-11-27T07:57:31.316Z] [INFO] 08:57:31.035 Sensor JavaSecuritySensor [security]
08:57:31 [2025-11-27T07:57:31.316Z] [INFO] 08:57:31.046 21 taint analysis rules enabled.
08:57:31 [2025-11-27T07:57:31.567Z] [INFO] 08:57:31.478 Analyzing 475 UCFGs to detect vulnerabilities.
08:57:34 [2025-11-27T07:57:34.050Z] [INFO] 08:57:33.705 All rules entry points : 4
08:57:34 [2025-11-27T07:57:34.050Z] [INFO] 08:57:33.706 Retained UCFGs : 91
08:57:34 [2025-11-27T07:57:34.050Z] [INFO] 08:57:33.767 0 / 91 UCFGs simulated, memory usage: 663 MB
08:57:34 [2025-11-27T07:57:34.300Z] [INFO] 08:57:34.104 86 / 91 UCFGs simulated, memory usage: 691 MB
08:57:34 [2025-11-27T07:57:34.300Z] [INFO] 08:57:34.115 java security sensor: Begin: 2025-11-27T07:57:31.041113329Z, End: 2025-11-27T07:57:34.114220107Z, Duration: 00:00:03.073
08:57:34 [2025-11-27T07:57:34.301Z]   Load type hierarchy and UCFGs: Begin: 2025-11-27T07:57:31.047424824Z, End: 2025-11-27T07:57:31.478722638Z, Duration: 00:00:00.431
08:57:34 [2025-11-27T07:57:34.301Z]     Load type hierarchy: Begin: 2025-11-27T07:57:31.047443852Z, End: 2025-11-27T07:57:31.152504105Z, Duration: 00:00:00.105
08:57:34 [2025-11-27T07:57:34.301Z]     Load UCFGs: Begin: 2025-11-27T07:57:31.152722329Z, End: 2025-11-27T07:57:31.478591600Z, Duration: 00:00:00.325
08:57:34 [2025-11-27T07:57:34.301Z]   Check cache: Begin: 2025-11-27T07:57:31.478957575Z, End: 2025-11-27T07:57:31.479327484Z, Duration: 00:00:00.000
08:57:34 [2025-11-27T07:57:34.301Z]     Load cache: Begin: 2025-11-27T07:57:31.478966212Z, End: 2025-11-27T07:57:31.478983644Z, Duration: 00:00:00.000
08:57:34 [2025-11-27T07:57:34.301Z]   Create runtime call graph: Begin: 2025-11-27T07:57:31.479385129Z, End: 2025-11-27T07:57:31.559005609Z, Duration: 00:00:00.079
08:57:34 [2025-11-27T07:57:34.301Z]     Variable Type Analysis #1: Begin: 2025-11-27T07:57:31.480184879Z, End: 2025-11-27T07:57:31.526916830Z, Duration: 00:00:00.046
08:57:34 [2025-11-27T07:57:34.301Z]       Create runtime type propagation graph: Begin: 2025-11-27T07:57:31.481002901Z, End: 2025-11-27T07:57:31.511856736Z, Duration: 00:00:00.030
08:57:34 [2025-11-27T07:57:34.301Z]       Run SCC (Tarjan) on 2430 nodes: Begin: 2025-11-27T07:57:31.512184585Z, End: 2025-11-27T07:57:31.517625935Z, Duration: 00:00:00.005
08:57:34 [2025-11-27T07:57:34.301Z]       Propagate runtime types to strongly connected components: Begin: 2025-11-27T07:57:31.517803759Z, End: 2025-11-27T07:57:31.526799125Z, Duration: 00:00:00.008
08:57:34 [2025-11-27T07:57:34.301Z]     Variable Type Analysis #2: Begin: 2025-11-27T07:57:31.529714583Z, End: 2025-11-27T07:57:31.556724352Z, Duration: 00:00:00.027
08:57:34 [2025-11-27T07:57:34.301Z]       Create runtime type propagation graph: Begin: 2025-11-27T07:57:31.529724469Z, End: 2025-11-27T07:57:31.549309305Z, Duration: 00:00:00.019
08:57:34 [2025-11-27T07:57:34.301Z]       Run SCC (Tarjan) on 2430 nodes: Begin: 2025-11-27T07:57:31.549476262Z, End: 2025-11-27T07:57:31.551915090Z, Duration: 00:00:00.002
08:57:34 [2025-11-27T07:57:34.301Z]       Propagate runtime types to strongly connected components: Begin: 2025-11-27T07:57:31.552008808Z, End: 2025-11-27T07:57:31.556617730Z, Duration: 00:00:00.004
08:57:34 [2025-11-27T07:57:34.301Z]   Load config: Begin: 2025-11-27T07:57:31.559112720Z, End: 2025-11-27T07:57:33.632240520Z, Duration: 00:00:02.073
08:57:34 [2025-11-27T07:57:34.301Z]   Compute entry points: Begin: 2025-11-27T07:57:33.632349349Z, End: 2025-11-27T07:57:33.705348067Z, Duration: 00:00:00.072
08:57:34 [2025-11-27T07:57:34.301Z]   Slice call graph: Begin: 2025-11-27T07:57:33.705668800Z, End: 2025-11-27T07:57:33.710154923Z, Duration: 00:00:00.004
08:57:34 [2025-11-27T07:57:34.301Z]   Live variable analysis: Begin: 2025-11-27T07:57:33.710273393Z, End: 2025-11-27T07:57:33.756255319Z, Duration: 00:00:00.045
08:57:34 [2025-11-27T07:57:34.301Z]   Taint analysis for java: Begin: 2025-11-27T07:57:33.756483552Z, End: 2025-11-27T07:57:34.104311658Z, Duration: 00:00:00.347
08:57:34 [2025-11-27T07:57:34.301Z]   Report issues: Begin: 2025-11-27T07:57:34.104410387Z, End: 2025-11-27T07:57:34.108548153Z, Duration: 00:00:00.004
08:57:34 [2025-11-27T07:57:34.301Z]   Store cache: Begin: 2025-11-27T07:57:34.109974559Z, End: 2025-11-27T07:57:34.112479567Z, Duration: 00:00:00.002
08:57:34 [2025-11-27T07:57:34.301Z] [INFO] 08:57:34.116 java security sensor peak memory: 709 MB
08:57:34 [2025-11-27T07:57:34.301Z] [INFO] 08:57:34.116 Sensor JavaSecuritySensor [security] (done) | time=3081ms
08:57:34 [2025-11-27T07:57:34.301Z] [INFO] 08:57:34.120 ------------- Run sensors on project
08:57:34 [2025-11-27T07:57:34.301Z] [INFO] 08:57:34.268 Sensor JsSecuritySensorV2 [jasmin]
08:57:34 [2025-11-27T07:57:34.552Z] [INFO] 08:57:34.314 2 additional JS/TS file(s) from other modules detected but not analyzed. Set 'sonar.jasmin.modules.all' to true to include them in the taint analysis.
08:57:34 [2025-11-27T07:57:34.552Z] [INFO] 08:57:34.314 No relevant JS/TS files found. Skipping taint analysis.
08:57:34 [2025-11-27T07:57:34.552Z] [INFO] 08:57:34.315 Sensor JsSecuritySensorV2 [jasmin] (done) | time=47ms
08:57:34 [2025-11-27T07:57:34.552Z] [INFO] 08:57:34.315 Sensor JavaProjectSensor [java]
08:57:34 [2025-11-27T07:57:34.552Z] [INFO] 08:57:34.317 Sensor JavaProjectSensor [java] (done) | time=2ms
08:57:34 [2025-11-27T07:57:34.552Z] [INFO] 08:57:34.317 Sensor JavaArchitectureSensor [architecture]
08:57:34 [2025-11-27T07:57:34.552Z] [INFO] 08:57:34.331 Architecture analysis is enabled with the following features: legacy
08:57:34 [2025-11-27T07:57:34.552Z] [INFO] 08:57:34.336 * Protobuf reading starting | memory total=1504 | free=792 | used=711 (MB)
08:57:34 [2025-11-27T07:57:34.552Z] [INFO] 08:57:34.336 * Reading SonarArchitecture IR data from directory "/var/lib/jenkins/workspace/Silverpeas_Stable_AutoDeploy/Silverpeas-Looks/target/sonar/architecture/java"
08:57:34 [2025-11-27T07:57:34.803Z] [INFO] 08:57:34.585 * Files successfully loaded: "32" out of "32"
08:57:34 [2025-11-27T07:57:34.803Z] [INFO] 08:57:34.585 * Protobuf reading complete | memory total=1504 | free=772 | used=731 (MB)
08:57:34 [2025-11-27T07:57:34.803Z] [INFO] 08:57:34.646 * Build architecture.graph.java.namespace_graph.default_perspective hierarchy graph complete (filtered=false) | memory total=1504 | free=748 | used=755 (MB)
08:57:34 [2025-11-27T07:57:34.803Z] [INFO] 08:57:34.663 * Build architecture.graph.java.namespace_graph.default_perspective hierarchy graph complete (filtered=true) | memory total=1504 | free=744 | used=759 (MB)
08:57:34 [2025-11-27T07:57:34.803Z] [INFO] 08:57:34.665 * Slicing complete | memory total=1504 | free=744 | used=759 (MB)
08:57:34 [2025-11-27T07:57:34.803Z] [INFO] 08:57:34.680 * Cycle detection complete | memory total=1504 | free=744 | used=759 (MB)
08:57:34 [2025-11-27T07:57:34.803Z] [INFO] 08:57:34.694 Sensor JavaArchitectureSensor [architecture] (done) | time=377ms
08:57:34 [2025-11-27T07:57:34.803Z] [INFO] 08:57:34.695 Sensor JsArchitectureSensor [architecture]
08:57:34 [2025-11-27T07:57:34.803Z] [INFO] 08:57:34.695 Architecture analysis is enabled with the following features: legacy
08:57:34 [2025-11-27T07:57:34.803Z] [INFO] 08:57:34.695 * Protobuf reading starting | memory total=1504 | free=742 | used=761 (MB)
08:57:34 [2025-11-27T07:57:34.803Z] [INFO] 08:57:34.695 * Reading SonarArchitecture IR data from directory "/var/lib/jenkins/workspace/Silverpeas_Stable_AutoDeploy/Silverpeas-Looks/target/sonar/architecture/js"
08:57:34 [2025-11-27T07:57:34.803Z] [INFO] 08:57:34.695 * Protobuf reading complete | memory total=1504 | free=742 | used=761 (MB)
08:57:34 [2025-11-27T07:57:34.803Z] [INFO] 08:57:34.701 * Build architecture.graph.js.file_graph.default_perspective hierarchy graph complete (filtered=false) | memory total=1504 | free=742 | used=761 (MB)
08:57:34 [2025-11-27T07:57:34.803Z] [INFO] 08:57:34.702 Sensor JsArchitectureSensor [architecture] (done) | time=7ms
08:57:34 [2025-11-27T07:57:34.803Z] [INFO] 08:57:34.702 Sensor Zero Coverage Sensor
08:57:34 [2025-11-27T07:57:34.803Z] [INFO] 08:57:34.721 Sensor Zero Coverage Sensor (done) | time=19ms
08:57:34 [2025-11-27T07:57:34.803Z] [INFO] 08:57:34.721 Sensor Java CPD Block Indexer
08:57:34 [2025-11-27T07:57:34.803Z] [INFO] 08:57:34.798 Sensor Java CPD Block Indexer (done) | time=77ms
08:57:35 [2025-11-27T07:57:35.053Z] [INFO] 08:57:34.945 Inferred api base url 'https://api.sonarcloud.io' from host url 'https://sonarcloud.io'.
08:57:35 [2025-11-27T07:57:35.053Z] [INFO] 08:57:34.947 ------------- Gather SCA dependencies on project
08:57:35 [2025-11-27T07:57:35.054Z] [INFO] 08:57:34.948 Checking if SCA is enabled for organization silverpeas
08:57:35 [2025-11-27T07:57:35.304Z] [INFO] 08:57:35.204 Dependency analysis skipped
08:57:35 [2025-11-27T07:57:35.304Z] [INFO] 08:57:35.218 CPD Executor 5 files had no CPD blocks
08:57:35 [2025-11-27T07:57:35.304Z] [INFO] 08:57:35.218 CPD Executor Calculating CPD for 41 files
08:57:35 [2025-11-27T07:57:35.304Z] [INFO] 08:57:35.260 CPD Executor CPD calculation finished (done) | time=41ms
08:57:35 [2025-11-27T07:57:35.304Z] [INFO] 08:57:35.263 SCM Publisher SCM provider for this project is: git
08:57:35 [2025-11-27T07:57:35.304Z] [INFO] 08:57:35.265 SCM Publisher 66 source files to be analyzed
08:57:35 [2025-11-27T07:57:35.855Z] [INFO] 08:57:35.772 SCM Publisher 62/66 source files have been analyzed (done) | time=507ms
08:57:35 [2025-11-27T07:57:35.855Z] [WARNING] 08:57:35.773 Missing blame information for the following files:
08:57:35 [2025-11-27T07:57:35.855Z] [WARNING] 08:57:35.773   * aurora/aurora-configuration/pom.xml
08:57:35 [2025-11-27T07:57:35.855Z] [WARNING] 08:57:35.773   * pom.xml
08:57:35 [2025-11-27T07:57:35.855Z] [WARNING] 08:57:35.773   * aurora/pom.xml
08:57:35 [2025-11-27T07:57:35.855Z] [WARNING] 08:57:35.773   * aurora/aurora-war/pom.xml
08:57:35 [2025-11-27T07:57:35.855Z] [WARNING] 08:57:35.774 This may lead to missing/broken features in SonarCloud
08:57:36 [2025-11-27T07:57:36.105Z] [INFO] 08:57:36.060 Analysis report generated in 269ms, dir size=849 KB
08:57:36 [2025-11-27T07:57:36.356Z] [INFO] 08:57:36.213 Analysis report compressed in 152ms, zip size=300 KB
08:57:36 [2025-11-27T07:57:36.606Z] [INFO] 08:57:36.486 Analysis report uploaded in 273ms
08:57:36 [2025-11-27T07:57:36.606Z] [INFO] 08:57:36.489 ANALYSIS SUCCESSFUL, you can find the results at: https://sonarcloud.io/dashboard?id=Silverpeas_Silverpeas-Looks&branch=6.4.x
08:57:36 [2025-11-27T07:57:36.606Z] [INFO] 08:57:36.489 Note that you will be able to access the updated dashboard once the server has processed the submitted analysis report
08:57:36 [2025-11-27T07:57:36.606Z] [INFO] 08:57:36.489 More about the report processing at https://sonarcloud.io/api/ce/task?id=AZrEUVcYRxXX9F7AXfGV
08:57:36 [2025-11-27T07:57:36.606Z] [INFO] 08:57:36.490 ------------- Upload SCA dependency files
08:57:37 [2025-11-27T07:57:37.157Z] [INFO] 08:57:36.990 Sensor cache published successfully
08:57:37 [2025-11-27T07:57:37.408Z] [INFO] 08:57:37.244 Analysis total time: 37.248 s
08:57:37 [2025-11-27T07:57:37.408Z] [INFO] ------------------------------------------------------------------------
08:57:37 [2025-11-27T07:57:37.408Z] [INFO] Reactor Summary for Silverpeas Looks 6.4.5-build251127:
08:57:37 [2025-11-27T07:57:37.408Z] [INFO] 
08:57:37 [2025-11-27T07:57:37.408Z] [INFO] Silverpeas Looks ................................... SUCCESS [ 40.735 s]
08:57:37 [2025-11-27T07:57:37.408Z] [INFO] Silverpeas Aurora Look ............................. SKIPPED
08:57:37 [2025-11-27T07:57:37.408Z] [INFO] Look Aurora Configuration .......................... SKIPPED
08:57:37 [2025-11-27T07:57:37.408Z] [INFO] Look Aurora Web Application ........................ SKIPPED
08:57:37 [2025-11-27T07:57:37.408Z] [INFO] ------------------------------------------------------------------------
08:57:37 [2025-11-27T07:57:37.408Z] [INFO] BUILD SUCCESS
08:57:37 [2025-11-27T07:57:37.408Z] [INFO] ------------------------------------------------------------------------
08:57:37 [2025-11-27T07:57:37.408Z] [INFO] Total time:  40.967 s
08:57:37 [2025-11-27T07:57:37.408Z] [INFO] Finished at: 2025-11-27T08:57:37+01:00
08:57:37 [2025-11-27T07:57:37.408Z] [INFO] ------------------------------------------------------------------------
08:57:37 [2025-11-27T07:57:37.960Z] [Pipeline] }
08:57:38 [2025-11-27T07:57:38.185Z] [Pipeline] // withSonarQubeEnv
08:57:38 [2025-11-27T07:57:38.206Z] [Pipeline] timeout
08:57:38 [2025-11-27T07:57:38.206Z] Timeout set to expire in 30 mn
08:57:38 [2025-11-27T07:57:38.207Z] [Pipeline] {
08:57:38 [2025-11-27T07:57:38.225Z] [Pipeline] waitForQualityGate
08:57:38 [2025-11-27T07:57:38.226Z] Checking status of SonarQube task 'AZrEUVcYRxXX9F7AXfGV' on server 'Silverpeas SonarCloud'
08:57:38 [2025-11-27T07:57:38.320Z] SonarQube task 'AZrEUVcYRxXX9F7AXfGV' status is 'IN_PROGRESS'
08:57:39 [2025-11-27T07:57:39.615Z] SonarQube task 'AZrEUVcYRxXX9F7AXfGV' status is 'SUCCESS'
08:57:39 [2025-11-27T07:57:39.615Z] SonarQube task 'AZrEUVcYRxXX9F7AXfGV' completed. Quality gate is 'OK'
08:57:39 [2025-11-27T07:57:39.617Z] [Pipeline] }
08:57:39 [2025-11-27T07:57:39.644Z] [Pipeline] // timeout
08:57:39 [2025-11-27T07:57:39.661Z] [Pipeline] }
08:57:39 [2025-11-27T07:57:39.679Z] [Pipeline] // dir
08:57:39 [2025-11-27T07:57:39.697Z] [Pipeline] }
08:57:39 [2025-11-27T07:57:39.714Z] [Pipeline] // stage
08:57:39 [2025-11-27T07:57:39.733Z] [Pipeline] stage
08:57:39 [2025-11-27T07:57:39.734Z] [Pipeline] { (Publish Silverpeas-Core)
08:57:39 [2025-11-27T07:57:39.764Z] [Pipeline] dir
08:57:39 [2025-11-27T07:57:39.764Z] Running in /var/lib/jenkins/workspace/Silverpeas_Stable_AutoDeploy/Silverpeas-Core
08:57:39 [2025-11-27T07:57:39.765Z] [Pipeline] {
08:57:39 [2025-11-27T07:57:39.787Z] [Pipeline] sh
08:57:40 [2025-11-27T07:57:40.045Z] + mvn deploy -DaltDeploymentRepository=silverpeas::default::https://nexus3.silverpeas.org/repository/builds -Pdeployment -Djava.awt.headless=true -Dmaven.test.skip=true
08:57:41 [2025-11-27T07:57:41.389Z] [INFO] Scanning for projects...
08:57:41 [2025-11-27T07:57:41.639Z] [INFO] ------------------------------------------------------------------------
08:57:41 [2025-11-27T07:57:41.639Z] [INFO] Reactor Build Order:
08:57:41 [2025-11-27T07:57:41.639Z] [INFO] 
08:57:41 [2025-11-27T07:57:41.639Z] [INFO] Silverpeas Core                                                    [pom]
08:57:41 [2025-11-27T07:57:41.639Z] [INFO] Silverpeas Core Configuration 6.4.5-build251127                    [jar]
08:57:41 [2025-11-27T07:57:41.639Z] [INFO] Silverpeas Core Api 6.4.5-build251127                              [jar]
08:57:41 [2025-11-27T07:57:41.639Z] [INFO] Silverpeas Core Test 6.4.5-build251127                             [jar]
08:57:41 [2025-11-27T07:57:41.639Z] [INFO] Silverpeas Core JCR Provider 6.4.5-build251127                     [jar]
08:57:41 [2025-11-27T07:57:41.639Z] [INFO] Silverpeas Core Library 6.4.5-build251127                          [jar]
08:57:41 [2025-11-27T07:57:41.639Z] [INFO] Silverpeas Core Services 6.4.5-build251127                         [pom]
08:57:41 [2025-11-27T07:57:41.639Z] [INFO] Silverpeas Tagcloud EJB 6.4.5-build251127                          [jar]
08:57:41 [2025-11-27T07:57:41.639Z] [INFO] Silverpeas Statistics Service 6.4.5-build251127                    [jar]
08:57:41 [2025-11-27T07:57:41.639Z] [INFO] Silverpeas Contact Service 6.4.5-build251127                       [jar]
08:57:41 [2025-11-27T07:57:41.639Z] [INFO] Silverpeas Calendar Service 6.4.5-build251127                      [jar]
08:57:41 [2025-11-27T07:57:41.639Z] [INFO] Silverpeas Comment Service 6.4.5-build251127                       [jar]
08:57:41 [2025-11-27T07:57:41.639Z] [INFO] Silverpeas PdC Service 6.4.5-build251127                           [jar]
08:57:41 [2025-11-27T07:57:41.639Z] [INFO] Silverpeas My Links Service 6.4.5-build251127                      [jar]
08:57:41 [2025-11-27T07:57:41.639Z] [INFO] Silverpeas Question Container Service 6.4.5-build251127            [jar]
08:57:41 [2025-11-27T07:57:41.639Z] [INFO] Silverpeas ImportExport Service 6.4.5-build251127                  [jar]
08:57:41 [2025-11-27T07:57:41.639Z] [INFO] Silverpeas Document Viewer Service 6.4.5-build251127               [jar]
08:57:41 [2025-11-27T07:57:41.639Z] [INFO] Silverpeas Workflow Engine Service 6.4.5-build251127               [jar]
08:57:41 [2025-11-27T07:57:41.639Z] [INFO] Silverpeas Sharing Service 6.4.5-build251127                       [jar]
08:57:41 [2025-11-27T07:57:41.639Z] [INFO] Silverpeas Search Service 6.4.5-build251127                        [jar]
08:57:41 [2025-11-27T07:57:41.639Z] [INFO] Silverpeas Chat Service 6.4.5-build251127                          [jar]
08:57:41 [2025-11-27T07:57:41.639Z] [INFO] Silverpeas Document Template Service 6.4.5-build251127             [jar]
08:57:41 [2025-11-27T07:57:41.639Z] [INFO] Silverpeas Core JAX-RS API 6.4.5-build251127                       [jar]
08:57:41 [2025-11-27T07:57:41.639Z] [INFO] Silverpeas Core Web Test 6.4.5-build251127                         [jar]
08:57:41 [2025-11-27T07:57:41.639Z] [INFO] Silverpeas Core Web 6.4.5-build251127                              [jar]
08:57:41 [2025-11-27T07:57:41.639Z] [INFO] Silverpeas Core Web Archive 6.4.5-build251127                      [war]
08:57:41 [2025-11-27T07:57:41.639Z] [INFO] 
08:57:41 [2025-11-27T07:57:41.639Z] [INFO] ------------------------< org.silverpeas:core >-------------------------
08:57:41 [2025-11-27T07:57:41.639Z] [INFO] Building Silverpeas Core 6.4.5-build251127                        [1/26]
08:57:41 [2025-11-27T07:57:41.639Z] [INFO]   from pom.xml
08:57:41 [2025-11-27T07:57:41.639Z] [INFO] --------------------------------[ pom ]---------------------------------
08:57:41 [2025-11-27T07:57:41.890Z] [INFO] 
08:57:41 [2025-11-27T07:57:41.890Z] [INFO] --- git-commit-id-plugin:4.9.10:revision (default) @ core ---
08:57:42 [2025-11-27T07:57:42.140Z] [INFO] 
08:57:42 [2025-11-27T07:57:42.140Z] [INFO] --- maven-site-plugin:3.12.1:attach-descriptor (attach-descriptor) @ core ---
08:57:43 [2025-11-27T07:57:43.051Z] [INFO] Attaching 'src/site/site.xml' site descriptor with classifier 'site'.
08:57:43 [2025-11-27T07:57:43.051Z] [INFO] 
08:57:43 [2025-11-27T07:57:43.051Z] [INFO] --- maven-source-plugin:3.2.1:jar-no-fork (bundle-source) @ core ---
08:57:43 [2025-11-27T07:57:43.051Z] [INFO] 
08:57:43 [2025-11-27T07:57:43.051Z] [INFO] --- maven-javadoc-plugin:3.4.1:jar (attach-javadocs) @ core ---
08:57:43 [2025-11-27T07:57:43.602Z] [INFO] Not executing Javadoc as the project is not a Java classpath-capable package
08:57:43 [2025-11-27T07:57:43.602Z] [INFO] 
08:57:43 [2025-11-27T07:57:43.602Z] [INFO] --- maven-source-plugin:3.2.1:jar-no-fork (attach-sources) @ core ---
08:57:43 [2025-11-27T07:57:43.602Z] [INFO] 
08:57:43 [2025-11-27T07:57:43.602Z] [INFO] --- maven-install-plugin:3.0.1:install (default-install) @ core ---
08:57:43 [2025-11-27T07:57:43.602Z] [INFO] Installing /var/lib/jenkins/workspace/Silverpeas_Stable_AutoDeploy/Silverpeas-Core/pom.xml to /home/silverbuild/.m2/repository/org/silverpeas/core/6.4.5-build251127/core-6.4.5-build251127.pom
08:57:43 [2025-11-27T07:57:43.602Z] [INFO] Installing /var/lib/jenkins/workspace/Silverpeas_Stable_AutoDeploy/Silverpeas-Core/target/core-6.4.5-build251127-site.xml to /home/silverbuild/.m2/repository/org/silverpeas/core/6.4.5-build251127/core-6.4.5-build251127-site.xml
08:57:43 [2025-11-27T07:57:43.602Z] [INFO] 
08:57:43 [2025-11-27T07:57:43.602Z] [INFO] --- maven-deploy-plugin:3.0.0:deploy (default-deploy) @ core ---
08:57:43 [2025-11-27T07:57:43.853Z] Downloading from Silverpeas Nexus: https://nexus3.silverpeas.org/repository/silverpeas/org/codehaus/plexus/plexus-utils/3.3.1/plexus-utils-3.3.1.jar
08:57:44 [2025-11-27T07:57:44.103Z] Progress (1): 4.1/262 kB
08:57:44 [2025-11-27T07:57:44.103Z] Progress (1): 7.6/262 kB
08:57:44 [2025-11-27T07:57:44.103Z] Progress (1): 12/262 kB 
08:57:44 [2025-11-27T07:57:44.103Z] Progress (1): 16/262 kB
08:57:44 [2025-11-27T07:57:44.103Z] Progress (1): 20/262 kB
08:57:44 [2025-11-27T07:57:44.103Z] Progress (1): 23/262 kB
08:57:44 [2025-11-27T07:57:44.103Z] Progress (1): 28/262 kB
08:57:44 [2025-11-27T07:57:44.103Z] Progress (1): 32/262 kB
08:57:44 [2025-11-27T07:57:44.103Z] Progress (1): 36/262 kB
08:57:44 [2025-11-27T07:57:44.103Z] Progress (1): 39/262 kB
08:57:44 [2025-11-27T07:57:44.103Z] Progress (1): 44/262 kB
08:57:44 [2025-11-27T07:57:44.103Z] Progress (1): 48/262 kB
08:57:44 [2025-11-27T07:57:44.103Z] Progress (1): 52/262 kB
08:57:44 [2025-11-27T07:57:44.103Z] Progress (1): 55/262 kB
08:57:44 [2025-11-27T07:57:44.103Z] Progress (1): 60/262 kB
08:57:44 [2025-11-27T07:57:44.103Z] Progress (1): 64/262 kB
08:57:44 [2025-11-27T07:57:44.103Z] Progress (1): 68/262 kB
08:57:44 [2025-11-27T07:57:44.103Z] Progress (1): 71/262 kB
08:57:44 [2025-11-27T07:57:44.103Z] Progress (1): 74/262 kB
08:57:44 [2025-11-27T07:57:44.103Z] Progress (1): 78/262 kB
08:57:44 [2025-11-27T07:57:44.103Z] Progress (1): 82/262 kB
08:57:44 [2025-11-27T07:57:44.103Z] Progress (1): 86/262 kB
08:57:44 [2025-11-27T07:57:44.103Z] Progress (1): 90/262 kB
08:57:44 [2025-11-27T07:57:44.103Z] Progress (1): 94/262 kB
08:57:44 [2025-11-27T07:57:44.103Z] Progress (1): 98/262 kB
08:57:44 [2025-11-27T07:57:44.103Z] Progress (1): 102/262 kB
08:57:44 [2025-11-27T07:57:44.103Z] Progress (1): 106/262 kB
08:57:44 [2025-11-27T07:57:44.103Z] Progress (1): 111/262 kB
08:57:44 [2025-11-27T07:57:44.103Z] Progress (1): 115/262 kB
08:57:44 [2025-11-27T07:57:44.103Z] Progress (1): 119/262 kB
08:57:44 [2025-11-27T07:57:44.103Z] Progress (1): 123/262 kB
08:57:44 [2025-11-27T07:57:44.103Z] Progress (1): 127/262 kB
08:57:44 [2025-11-27T07:57:44.103Z] Progress (1): 131/262 kB
08:57:44 [2025-11-27T07:57:44.103Z] Progress (1): 135/262 kB
08:57:44 [2025-11-27T07:57:44.103Z] Progress (1): 139/262 kB
08:57:44 [2025-11-27T07:57:44.103Z] Progress (1): 143/262 kB
08:57:44 [2025-11-27T07:57:44.103Z] Progress (1): 147/262 kB
08:57:44 [2025-11-27T07:57:44.103Z] Progress (1): 152/262 kB
08:57:44 [2025-11-27T07:57:44.103Z] Progress (1): 154/262 kB
08:57:44 [2025-11-27T07:57:44.103Z] Progress (1): 158/262 kB
08:57:44 [2025-11-27T07:57:44.103Z] Progress (1): 162/262 kB
08:57:44 [2025-11-27T07:57:44.103Z] Progress (1): 166/262 kB
08:57:44 [2025-11-27T07:57:44.103Z] Progress (1): 170/262 kB
08:57:44 [2025-11-27T07:57:44.103Z] Progress (1): 172/262 kB
08:57:44 [2025-11-27T07:57:44.104Z] Progress (1): 176/262 kB
08:57:44 [2025-11-27T07:57:44.104Z] Progress (1): 180/262 kB
08:57:44 [2025-11-27T07:57:44.104Z] Progress (1): 184/262 kB
08:57:44 [2025-11-27T07:57:44.104Z] Progress (1): 188/262 kB
08:57:44 [2025-11-27T07:57:44.104Z] Progress (1): 193/262 kB
08:57:44 [2025-11-27T07:57:44.104Z] Progress (1): 197/262 kB
08:57:44 [2025-11-27T07:57:44.104Z] Progress (1): 201/262 kB
08:57:44 [2025-11-27T07:57:44.104Z] Progress (1): 205/262 kB
08:57:44 [2025-11-27T07:57:44.104Z] Progress (1): 209/262 kB
08:57:44 [2025-11-27T07:57:44.104Z] Progress (1): 213/262 kB
08:57:44 [2025-11-27T07:57:44.104Z] Progress (1): 217/262 kB
08:57:44 [2025-11-27T07:57:44.104Z] Progress (1): 221/262 kB
08:57:44 [2025-11-27T07:57:44.104Z] Progress (1): 225/262 kB
08:57:44 [2025-11-27T07:57:44.104Z] Progress (1): 229/262 kB
08:57:44 [2025-11-27T07:57:44.104Z] Progress (1): 233/262 kB
08:57:44 [2025-11-27T07:57:44.104Z] Progress (1): 238/262 kB
08:57:44 [2025-11-27T07:57:44.104Z] Progress (1): 242/262 kB
08:57:44 [2025-11-27T07:57:44.104Z] Progress (1): 246/262 kB
08:57:44 [2025-11-27T07:57:44.104Z] Progress (1): 250/262 kB
08:57:44 [2025-11-27T07:57:44.104Z] Progress (1): 254/262 kB
08:57:44 [2025-11-27T07:57:44.104Z] Progress (1): 258/262 kB
08:57:44 [2025-11-27T07:57:44.104Z] Progress (1): 262/262 kB
08:57:44 [2025-11-27T07:57:44.104Z] Progress (1): 262 kB    
08:57:44 [2025-11-27T07:57:44.104Z]                     
08:57:44 [2025-11-27T07:57:44.104Z] Downloaded from Silverpeas Nexus: https://nexus3.silverpeas.org/repository/silverpeas/org/codehaus/plexus/plexus-utils/3.3.1/plexus-utils-3.3.1.jar (262 kB at 848 kB/s)
08:57:44 [2025-11-27T07:57:44.104Z] [INFO] Using alternate deployment repository silverpeas::default::https://nexus3.silverpeas.org/repository/builds
08:57:44 [2025-11-27T07:57:44.104Z] [WARNING] Using legacy syntax for alternative repository. Use "silverpeas::https://nexus3.silverpeas.org/repository/builds" instead.
08:57:44 [2025-11-27T07:57:44.104Z] Uploading to silverpeas: https://nexus3.silverpeas.org/repository/builds/org/silverpeas/core/6.4.5-build251127/core-6.4.5-build251127.pom
08:57:44 [2025-11-27T07:57:44.104Z] Uploading to silverpeas: https://nexus3.silverpeas.org/repository/builds/org/silverpeas/core/6.4.5-build251127/core-6.4.5-build251127-site.xml
08:57:44 [2025-11-27T07:57:44.104Z] [INFO] ------------------------------------------------------------------------
08:57:44 [2025-11-27T07:57:44.104Z] [INFO] Reactor Summary for Silverpeas Core 6.4.5-build251127:
08:57:44 [2025-11-27T07:57:44.104Z] [INFO] 
08:57:44 [2025-11-27T07:57:44.104Z] [INFO] Silverpeas Core .................................... FAILURE [  2.640 s]
08:57:44 [2025-11-27T07:57:44.104Z] [INFO] Silverpeas Core Configuration 6.4.5-build251127 .... SKIPPED
08:57:44 [2025-11-27T07:57:44.104Z] [INFO] Silverpeas Core Api 6.4.5-build251127 .............. SKIPPED
08:57:44 [2025-11-27T07:57:44.104Z] [INFO] Silverpeas Core Test 6.4.5-build251127 ............. SKIPPED
08:57:44 [2025-11-27T07:57:44.104Z] [INFO] Silverpeas Core JCR Provider 6.4.5-build251127 ..... SKIPPED
08:57:44 [2025-11-27T07:57:44.104Z] [INFO] Silverpeas Core Library 6.4.5-build251127 .......... SKIPPED
08:57:44 [2025-11-27T07:57:44.104Z] [INFO] Silverpeas Core Services 6.4.5-build251127 ......... SKIPPED
08:57:44 [2025-11-27T07:57:44.104Z] [INFO] Silverpeas Tagcloud EJB 6.4.5-build251127 .......... SKIPPED
08:57:44 [2025-11-27T07:57:44.104Z] [INFO] Silverpeas Statistics Service 6.4.5-build251127 .... SKIPPED
08:57:44 [2025-11-27T07:57:44.104Z] [INFO] Silverpeas Contact Service 6.4.5-build251127 ....... SKIPPED
08:57:44 [2025-11-27T07:57:44.104Z] [INFO] Silverpeas Calendar Service 6.4.5-build251127 ...... SKIPPED
08:57:44 [2025-11-27T07:57:44.104Z] [INFO] Silverpeas Comment Service 6.4.5-build251127 ....... SKIPPED
08:57:44 [2025-11-27T07:57:44.104Z] [INFO] Silverpeas PdC Service 6.4.5-build251127 ........... SKIPPED
08:57:44 [2025-11-27T07:57:44.104Z] [INFO] Silverpeas My Links Service 6.4.5-build251127 ...... SKIPPED
08:57:44 [2025-11-27T07:57:44.104Z] [INFO] Silverpeas Question Container Service 6.4.5-build251127 SKIPPED
08:57:44 [2025-11-27T07:57:44.104Z] [INFO] Silverpeas ImportExport Service 6.4.5-build251127 .. SKIPPED
08:57:44 [2025-11-27T07:57:44.104Z] [INFO] Silverpeas Document Viewer Service 6.4.5-build251127 SKIPPED
08:57:44 [2025-11-27T07:57:44.104Z] [INFO] Silverpeas Workflow Engine Service 6.4.5-build251127 SKIPPED
08:57:44 [2025-11-27T07:57:44.104Z] [INFO] Silverpeas Sharing Service 6.4.5-build251127 ....... SKIPPED
08:57:44 [2025-11-27T07:57:44.104Z] [INFO] Silverpeas Search Service 6.4.5-build251127 ........ SKIPPED
08:57:44 [2025-11-27T07:57:44.104Z] [INFO] Silverpeas Chat Service 6.4.5-build251127 .......... SKIPPED
08:57:44 [2025-11-27T07:57:44.104Z] [INFO] Silverpeas Document Template Service 6.4.5-build251127 SKIPPED
08:57:44 [2025-11-27T07:57:44.104Z] [INFO] Silverpeas Core JAX-RS API 6.4.5-build251127 ....... SKIPPED
08:57:44 [2025-11-27T07:57:44.104Z] [INFO] Silverpeas Core Web Test 6.4.5-build251127 ......... SKIPPED
08:57:44 [2025-11-27T07:57:44.104Z] [INFO] Silverpeas Core Web 6.4.5-build251127 .............. SKIPPED
08:57:44 [2025-11-27T07:57:44.104Z] [INFO] Silverpeas Core Web Archive 6.4.5-build251127 ...... SKIPPED
08:57:44 [2025-11-27T07:57:44.104Z] [INFO] ------------------------------------------------------------------------
08:57:44 [2025-11-27T07:57:44.104Z] [INFO] BUILD FAILURE
08:57:44 [2025-11-27T07:57:44.104Z] [INFO] ------------------------------------------------------------------------
08:57:44 [2025-11-27T07:57:44.104Z] [INFO] Total time:  3.001 s
08:57:44 [2025-11-27T07:57:44.104Z] [INFO] Finished at: 2025-11-27T08:57:44+01:00
08:57:44 [2025-11-27T07:57:44.104Z] [INFO] ------------------------------------------------------------------------
08:57:44 [2025-11-27T07:57:44.104Z] [ERROR] Failed to execute goal org.apache.maven.plugins:maven-deploy-plugin:3.0.0:deploy (default-deploy) on project core: Failed to deploy artifacts: Could not transfer artifact org.silverpeas:core:pom:6.4.5-build251127 from/to silverpeas (https://nexus3.silverpeas.org/repository/builds): authorization failed for https://nexus3.silverpeas.org/repository/builds/org/silverpeas/core/6.4.5-build251127/core-6.4.5-build251127.pom, status: 403 Forbidden -> [Help 1]
08:57:44 [2025-11-27T07:57:44.104Z] [ERROR] 
08:57:44 [2025-11-27T07:57:44.104Z] [ERROR] To see the full stack trace of the errors, re-run Maven with the -e switch.
08:57:44 [2025-11-27T07:57:44.104Z] [ERROR] Re-run Maven using the -X switch to enable full debug logging.
08:57:44 [2025-11-27T07:57:44.104Z] [ERROR] 
08:57:44 [2025-11-27T07:57:44.104Z] [ERROR] For more information about the errors and possible solutions, please read the following articles:
08:57:44 [2025-11-27T07:57:44.104Z] [ERROR] [Help 1] http://cwiki.apache.org/confluence/display/MAVEN/MojoExecutionException
08:57:44 [2025-11-27T07:57:44.357Z] [Pipeline] }
08:57:44 [2025-11-27T07:57:44.375Z] [Pipeline] // dir
08:57:44 [2025-11-27T07:57:44.421Z] [Pipeline] }
08:57:44 [2025-11-27T07:57:44.439Z] [Pipeline] // stage
08:57:44 [2025-11-27T07:57:44.460Z] [Pipeline] stage
08:57:44 [2025-11-27T07:57:44.461Z] [Pipeline] { (Publish Silverpeas-Components)
08:57:44 [2025-11-27T07:57:44.480Z] Stage "Publish Silverpeas-Components" skipped due to earlier failure(s)
08:57:44 [2025-11-27T07:57:44.481Z] [Pipeline] getContext
08:57:44 [2025-11-27T07:57:44.483Z] [Pipeline] }
08:57:44 [2025-11-27T07:57:44.501Z] [Pipeline] // stage
08:57:44 [2025-11-27T07:57:44.520Z] [Pipeline] stage
08:57:44 [2025-11-27T07:57:44.521Z] [Pipeline] { (Publish Silverpeas-Assembly)
08:57:44 [2025-11-27T07:57:44.537Z] Stage "Publish Silverpeas-Assembly" skipped due to earlier failure(s)
08:57:44 [2025-11-27T07:57:44.538Z] [Pipeline] getContext
08:57:44 [2025-11-27T07:57:44.540Z] [Pipeline] }
08:57:44 [2025-11-27T07:57:44.555Z] [Pipeline] // stage
08:57:44 [2025-11-27T07:57:44.572Z] [Pipeline] stage
08:57:44 [2025-11-27T07:57:44.572Z] [Pipeline] { (Publish Silverpeas-Setup)
08:57:44 [2025-11-27T07:57:44.586Z] Stage "Publish Silverpeas-Setup" skipped due to earlier failure(s)
08:57:44 [2025-11-27T07:57:44.587Z] [Pipeline] getContext
08:57:44 [2025-11-27T07:57:44.589Z] [Pipeline] }
08:57:44 [2025-11-27T07:57:44.603Z] [Pipeline] // stage
08:57:44 [2025-11-27T07:57:44.618Z] [Pipeline] stage
08:57:44 [2025-11-27T07:57:44.619Z] [Pipeline] { (Publish Silverpeas-Distribution)
08:57:44 [2025-11-27T07:57:44.630Z] Stage "Publish Silverpeas-Distribution" skipped due to earlier failure(s)
08:57:44 [2025-11-27T07:57:44.631Z] [Pipeline] getContext
08:57:44 [2025-11-27T07:57:44.633Z] [Pipeline] }
08:57:44 [2025-11-27T07:57:44.645Z] [Pipeline] // stage
08:57:44 [2025-11-27T07:57:44.659Z] [Pipeline] stage
08:57:44 [2025-11-27T07:57:44.659Z] [Pipeline] { (Publish Silverpeas-Looks)
08:57:44 [2025-11-27T07:57:44.671Z] Stage "Publish Silverpeas-Looks" skipped due to earlier failure(s)
08:57:44 [2025-11-27T07:57:44.672Z] [Pipeline] getContext
08:57:44 [2025-11-27T07:57:44.673Z] [Pipeline] }
08:57:44 [2025-11-27T07:57:44.685Z] [Pipeline] // stage
08:57:44 [2025-11-27T07:57:44.698Z] [Pipeline] stage
08:57:44 [2025-11-27T07:57:44.699Z] [Pipeline] { (Publish Community Web Site)
08:57:44 [2025-11-27T07:57:44.709Z] Stage "Publish Community Web Site" skipped due to earlier failure(s)
08:57:44 [2025-11-27T07:57:44.710Z] [Pipeline] getContext
08:57:44 [2025-11-27T07:57:44.712Z] [Pipeline] }
08:57:44 [2025-11-27T07:57:44.722Z] [Pipeline] // stage
08:57:44 [2025-11-27T07:57:44.735Z] [Pipeline] }
08:57:44 [2025-11-27T07:57:44.744Z] [Pipeline] // stage
08:57:44 [2025-11-27T07:57:44.764Z] [Pipeline] stage
08:57:44 [2025-11-27T07:57:44.764Z] [Pipeline] { (Create YAML build report)
08:57:44 [2025-11-27T07:57:44.782Z] Stage "Create YAML build report" skipped due to earlier failure(s)
08:57:44 [2025-11-27T07:57:44.783Z] [Pipeline] getContext
08:57:44 [2025-11-27T07:57:44.784Z] [Pipeline] }
08:57:44 [2025-11-27T07:57:44.802Z] [Pipeline] // stage
08:57:44 [2025-11-27T07:57:44.828Z] [Pipeline] stage
08:57:44 [2025-11-27T07:57:44.829Z] [Pipeline] { (Declarative: Post Actions)
08:57:44 [2025-11-27T07:57:44.861Z] [Pipeline] step
08:57:45 [2025-11-27T07:57:45.000Z] Sending e-mails to: miguel.moquillon@silverpeas.org david.lesimple@silverpeas.com sebastien.vuillet@silverpeas.com
08:57:45 [2025-11-27T07:57:45.118Z] [Pipeline] script
08:57:45 [2025-11-27T07:57:45.122Z] [Pipeline] {
08:57:45 [2025-11-27T07:57:45.138Z] [Pipeline] sh
08:57:45 [2025-11-27T07:57:45.394Z] + test -e /var/lib/jenkins/wildfly-mem.hprof
08:57:45 [2025-11-27T07:57:45.398Z] [Pipeline] echo
08:57:45 [2025-11-27T07:57:45.399Z] No failure by out of memory
08:57:45 [2025-11-27T07:57:45.399Z] [Pipeline] }
08:57:45 [2025-11-27T07:57:45.418Z] [Pipeline] // script
08:57:45 [2025-11-27T07:57:45.439Z] [Pipeline] }
08:57:45 [2025-11-27T07:57:45.457Z] [Pipeline] // stage
08:57:45 [2025-11-27T07:57:45.474Z] [Pipeline] }
08:57:45 [2025-11-27T07:57:45.492Z] [Pipeline] // withEnv
08:57:45 [2025-11-27T07:57:45.511Z] [Pipeline] }
08:57:45 [2025-11-27T07:57:45.512Z] $ docker stop --time=1 e29edfe5d647e28ff5272e54406d5f0ef747cfd13103f3c509d2596acb33f9ff
08:57:46 [2025-11-27T07:57:46.935Z] $ docker rm -f --volumes e29edfe5d647e28ff5272e54406d5f0ef747cfd13103f3c509d2596acb33f9ff
08:57:47 [2025-11-27T07:57:47.730Z] [Pipeline] // withDockerContainer
08:57:47 [2025-11-27T07:57:47.739Z] [Pipeline] }
08:57:47 [2025-11-27T07:57:47.748Z] [Pipeline] // withEnv
08:57:47 [2025-11-27T07:57:47.758Z] [Pipeline] }
08:57:47 [2025-11-27T07:57:47.768Z] [Pipeline] // node
08:57:47 [2025-11-27T07:57:47.787Z] [Pipeline] End of Pipeline
08:57:47 [2025-11-27T07:57:47.837Z] ERROR: script returned exit code 1
08:57:47 [2025-11-27T07:57:47.889Z] Finished: FAILURE