Console Output
Skipping 157 192 KB..
Full Logtderr] (default task-2) at deployment.test-CommentRequesterIT.war//org.junit.runners.ParentRunner$3.evaluate(ParentRunner.java:306)
20:22:08 [2026-10-14T18:22:08.361Z] [0m[31m20:22:08,153 ERROR [stderr] (default task-2) at deployment.test-CommentRequesterIT.war//org.junit.runners.ParentRunner.run(ParentRunner.java:413)
20:22:08 [2026-10-14T18:22:08.361Z] [0m[31m20:22:08,153 ERROR [stderr] (default task-2) at deployment.test-CommentRequesterIT.war//org.jboss.arquillian.junit.Arquillian.run(Arquillian.java:108)
20:22:08 [2026-10-14T18:22:08.361Z] [0m[31m20:22:08,153 ERROR [stderr] (default task-2) at deployment.test-CommentRequesterIT.war//org.junit.runner.JUnitCore.run(JUnitCore.java:137)
20:22:08 [2026-10-14T18:22:08.361Z] [0m[31m20:22:08,154 ERROR [stderr] (default task-2) at deployment.test-CommentRequesterIT.war//org.junit.runner.JUnitCore.run(JUnitCore.java:115)
20:22:08 [2026-10-14T18:22:08.361Z] [0m[31m20:22:08,154 ERROR [stderr] (default task-2) at deployment.test-CommentRequesterIT.war//org.jboss.arquillian.junit.container.JUnitTestRunner.execute(JUnitTestRunner.java:60)
20:22:08 [2026-10-14T18:22:08.361Z] [0m[31m20:22:08,154 ERROR [stderr] (default task-2) at deployment.test-CommentRequesterIT.war//org.jboss.arquillian.protocol.servlet5.runner.ServletTestRunner.executeTest(ServletTestRunner.java:139)
20:22:08 [2026-10-14T18:22:08.361Z] [0m[31m20:22:08,154 ERROR [stderr] (default task-2) at deployment.test-CommentRequesterIT.war//org.jboss.arquillian.protocol.servlet5.runner.ServletTestRunner.execute(ServletTestRunner.java:117)
20:22:08 [2026-10-14T18:22:08.361Z] [0m[31m20:22:08,154 ERROR [stderr] (default task-2) at deployment.test-CommentRequesterIT.war//org.jboss.arquillian.protocol.servlet5.runner.ServletTestRunner.doGet(ServletTestRunner.java:86)
20:22:08 [2026-10-14T18:22:08.361Z] [0m[31m20:22:08,154 ERROR [stderr] (default task-2) at jakarta.servlet.api@6.0.0//jakarta.servlet.http.HttpServlet.service(HttpServlet.java:527)
20:22:08 [2026-10-14T18:22:08.361Z] [0m[31m20:22:08,154 ERROR [stderr] (default task-2) at jakarta.servlet.api@6.0.0//jakarta.servlet.http.HttpServlet.service(HttpServlet.java:614)
20:22:08 [2026-10-14T18:22:08.361Z] [0m[31m20:22:08,154 ERROR [stderr] (default task-2) at io.undertow.servlet@2.3.23.Final//io.undertow.servlet.handlers.ServletHandler.handleRequest(ServletHandler.java:74)
20:22:08 [2026-10-14T18:22:08.361Z] [0m[31m20:22:08,154 ERROR [stderr] (default task-2) at io.undertow.servlet@2.3.23.Final//io.undertow.servlet.handlers.security.ServletSecurityRoleHandler.handleRequest(ServletSecurityRoleHandler.java:62)
20:22:08 [2026-10-14T18:22:08.361Z] [0m[31m20:22:08,154 ERROR [stderr] (default task-2) at io.undertow.servlet@2.3.23.Final//io.undertow.servlet.handlers.ServletChain$1.handleRequest(ServletChain.java:68)
20:22:08 [2026-10-14T18:22:08.361Z] [0m[31m20:22:08,154 ERROR [stderr] (default task-2) at io.undertow.servlet@2.3.23.Final//io.undertow.servlet.handlers.ServletDispatchingHandler.handleRequest(ServletDispatchingHandler.java:36)
20:22:08 [2026-10-14T18:22:08.361Z] [0m[31m20:22:08,154 ERROR [stderr] (default task-2) at org.wildfly.security.elytron-web.undertow-server@4.1.2.Final//org.wildfly.elytron.web.undertow.server.ElytronRunAsHandler.lambda$handleRequest$1(ElytronRunAsHandler.java:68)
20:22:08 [2026-10-14T18:22:08.361Z] [0m[31m20:22:08,154 ERROR [stderr] (default task-2) at org.wildfly.security.elytron-base@2.8.2.Final//org.wildfly.security.auth.server.FlexibleIdentityAssociation.runAsFunctionEx(FlexibleIdentityAssociation.java:103)
20:22:08 [2026-10-14T18:22:08.361Z] [0m[31m20:22:08,154 ERROR [stderr] (default task-2) at org.wildfly.security.elytron-base@2.8.2.Final//org.wildfly.security.auth.server.Scoped.runAsFunctionEx(Scoped.java:161)
20:22:08 [2026-10-14T18:22:08.361Z] [0m[31m20:22:08,154 ERROR [stderr] (default task-2) at org.wildfly.security.elytron-base@2.8.2.Final//org.wildfly.security.auth.server.Scoped.runAs(Scoped.java:73)
20:22:08 [2026-10-14T18:22:08.361Z] [0m[31m20:22:08,154 ERROR [stderr] (default task-2) at org.wildfly.security.elytron-web.undertow-server@4.1.2.Final//org.wildfly.elytron.web.undertow.server.ElytronRunAsHandler.handleRequest(ElytronRunAsHandler.java:67)
20:22:08 [2026-10-14T18:22:08.361Z] [0m[31m20:22:08,154 ERROR [stderr] (default task-2) at io.undertow.servlet@2.3.23.Final//io.undertow.servlet.handlers.RedirectDirHandler.handleRequest(RedirectDirHandler.java:68)
20:22:08 [2026-10-14T18:22:08.361Z] [0m[31m20:22:08,154 ERROR [stderr] (default task-2) at io.undertow.servlet@2.3.23.Final//io.undertow.servlet.handlers.security.SSLInformationAssociationHandler.handleRequest(SSLInformationAssociationHandler.java:117)
20:22:08 [2026-10-14T18:22:08.361Z] [0m[31m20:22:08,154 ERROR [stderr] (default task-2) at io.undertow.servlet@2.3.23.Final//io.undertow.servlet.handlers.security.ServletAuthenticationCallHandler.handleRequest(ServletAuthenticationCallHandler.java:57)
20:22:08 [2026-10-14T18:22:08.361Z] [0m[31m20:22:08,154 ERROR [stderr] (default task-2) at io.undertow.core@2.3.23.Final//io.undertow.server.handlers.PredicateHandler.handleRequest(PredicateHandler.java:43)
20:22:08 [2026-10-14T18:22:08.361Z] [0m[31m20:22:08,154 ERROR [stderr] (default task-2) at io.undertow.core@2.3.23.Final//io.undertow.security.handlers.AbstractConfidentialityHandler.handleRequest(AbstractConfidentialityHandler.java:46)
20:22:08 [2026-10-14T18:22:08.361Z] [0m[31m20:22:08,154 ERROR [stderr] (default task-2) at io.undertow.servlet@2.3.23.Final//io.undertow.servlet.handlers.security.ServletConfidentialityConstraintHandler.handleRequest(ServletConfidentialityConstraintHandler.java:64)
20:22:08 [2026-10-14T18:22:08.361Z] [0m[31m20:22:08,154 ERROR [stderr] (default task-2) at io.undertow.core@2.3.23.Final//io.undertow.security.handlers.AbstractSecurityContextAssociationHandler.handleRequest(AbstractSecurityContextAssociationHandler.java:43)
20:22:08 [2026-10-14T18:22:08.361Z] [0m[31m20:22:08,154 ERROR [stderr] (default task-2) at org.wildfly.security.elytron-web.undertow-server-servlet@4.1.2.Final//org.wildfly.elytron.web.undertow.server.servlet.CleanUpHandler.handleRequest(CleanUpHandler.java:38)
20:22:08 [2026-10-14T18:22:08.361Z] [0m[31m20:22:08,154 ERROR [stderr] (default task-2) at io.undertow.core@2.3.23.Final//io.undertow.server.handlers.PredicateHandler.handleRequest(PredicateHandler.java:43)
20:22:08 [2026-10-14T18:22:08.361Z] [0m[31m20:22:08,154 ERROR [stderr] (default task-2) at org.wildfly.extension.undertow@39.0.1.Final//org.wildfly.extension.undertow.deployment.ControlPointDeploymentInfoConfigurator$ControlPointRequestAttributeHandler.handleRequest(ControlPointDeploymentInfoConfigurator.java:175)
20:22:08 [2026-10-14T18:22:08.361Z] [0m[31m20:22:08,154 ERROR [stderr] (default task-2) at org.wildfly.extension.undertow@39.0.1.Final//org.wildfly.extension.undertow.security.jacc.JACCContextIdHandler.handleRequest(JACCContextIdHandler.java:44)
20:22:08 [2026-10-14T18:22:08.361Z] [0m[31m20:22:08,154 ERROR [stderr] (default task-2) at io.undertow.core@2.3.23.Final//io.undertow.server.handlers.PredicateHandler.handleRequest(PredicateHandler.java:43)
20:22:08 [2026-10-14T18:22:08.361Z] [0m[31m20:22:08,154 ERROR [stderr] (default task-2) at io.undertow.servlet@2.3.23.Final//io.undertow.servlet.handlers.SendErrorPageHandler.handleRequest(SendErrorPageHandler.java:52)
20:22:08 [2026-10-14T18:22:08.361Z] [0m[31m20:22:08,154 ERROR [stderr] (default task-2) at io.undertow.core@2.3.23.Final//io.undertow.server.handlers.PredicateHandler.handleRequest(PredicateHandler.java:43)
20:22:08 [2026-10-14T18:22:08.361Z] [0m[31m20:22:08,154 ERROR [stderr] (default task-2) at io.undertow.servlet@2.3.23.Final//io.undertow.servlet.handlers.ServletInitialHandler.handleFirstRequest(ServletInitialHandler.java:271)
20:22:08 [2026-10-14T18:22:08.361Z] [0m[31m20:22:08,154 ERROR [stderr] (default task-2) at io.undertow.servlet@2.3.23.Final//io.undertow.servlet.handlers.ServletInitialHandler$1.call(ServletInitialHandler.java:130)
20:22:08 [2026-10-14T18:22:08.361Z] [0m[31m20:22:08,154 ERROR [stderr] (default task-2) at io.undertow.servlet@2.3.23.Final//io.undertow.servlet.handlers.ServletInitialHandler$1.call(ServletInitialHandler.java:127)
20:22:08 [2026-10-14T18:22:08.361Z] [0m[31m20:22:08,154 ERROR [stderr] (default task-2) at io.undertow.servlet@2.3.23.Final//io.undertow.servlet.core.ServletRequestContextThreadSetupAction$1.call(ServletRequestContextThreadSetupAction.java:48)
20:22:08 [2026-10-14T18:22:08.361Z] [0m[31m20:22:08,154 ERROR [stderr] (default task-2) at io.undertow.servlet@2.3.23.Final//io.undertow.servlet.core.ContextClassLoaderSetupAction$1.call(ContextClassLoaderSetupAction.java:43)
20:22:08 [2026-10-14T18:22:08.361Z] [0m[31m20:22:08,154 ERROR [stderr] (default task-2) at org.wildfly.extension.undertow@39.0.1.Final//org.wildfly.extension.undertow.deployment.ControlPointDeploymentInfoConfigurator$1.call(ControlPointDeploymentInfoConfigurator.java:100)
20:22:08 [2026-10-14T18:22:08.361Z] [0m[31m20:22:08,154 ERROR [stderr] (default task-2) at org.wildfly.extension.undertow@39.0.1.Final//org.wildfly.extension.undertow.deployment.UndertowDeploymentInfoService$UndertowThreadSetupAction.lambda$create$0(UndertowDeploymentInfoService.java:1431)
20:22:08 [2026-10-14T18:22:08.361Z] [0m[31m20:22:08,154 ERROR [stderr] (default task-2) at org.wildfly.extension.undertow@39.0.1.Final//org.wildfly.extension.undertow.deployment.UndertowDeploymentInfoService$UndertowThreadSetupAction.lambda$create$0(UndertowDeploymentInfoService.java:1431)
20:22:08 [2026-10-14T18:22:08.361Z] [0m[31m20:22:08,154 ERROR [stderr] (default task-2) at org.wildfly.extension.undertow@39.0.1.Final//org.wildfly.extension.undertow.deployment.UndertowDeploymentInfoService$UndertowThreadSetupAction.lambda$create$0(UndertowDeploymentInfoService.java:1431)
20:22:08 [2026-10-14T18:22:08.361Z] [0m[31m20:22:08,154 ERROR [stderr] (default task-2) at org.wildfly.extension.undertow@39.0.1.Final//org.wildfly.extension.undertow.deployment.UndertowDeploymentInfoService$UndertowThreadSetupAction.lambda$create$0(UndertowDeploymentInfoService.java:1431)
20:22:08 [2026-10-14T18:22:08.361Z] [0m[31m20:22:08,154 ERROR [stderr] (default task-2) at org.wildfly.extension.undertow@39.0.1.Final//org.wildfly.extension.undertow.deployment.UndertowDeploymentInfoService$UndertowThreadSetupAction.lambda$create$0(UndertowDeploymentInfoService.java:1431)
20:22:08 [2026-10-14T18:22:08.361Z] [0m[31m20:22:08,154 ERROR [stderr] (default task-2) at io.undertow.servlet@2.3.23.Final//io.undertow.servlet.handlers.ServletInitialHandler.dispatchRequest(ServletInitialHandler.java:251)
20:22:08 [2026-10-14T18:22:08.361Z] [0m[31m20:22:08,154 ERROR [stderr] (default task-2) at io.undertow.servlet@2.3.23.Final//io.undertow.servlet.handlers.ServletInitialHandler.lambda$new$1(ServletInitialHandler.java:99)
20:22:08 [2026-10-14T18:22:08.361Z] [0m[31m20:22:08,154 ERROR [stderr] (default task-2) at io.undertow.core@2.3.23.Final//io.undertow.server.Connectors.executeRootHandler(Connectors.java:418)
20:22:08 [2026-10-14T18:22:08.361Z] [0m[31m20:22:08,154 ERROR [stderr] (default task-2) at io.undertow.core@2.3.23.Final//io.undertow.server.HttpServerExchange$1.run(HttpServerExchange.java:938)
20:22:08 [2026-10-14T18:22:08.361Z] [0m[31m20:22:08,154 ERROR [stderr] (default task-2) at org.jboss.threads@3.9.2//org.jboss.threads.ContextHandler$1.runWith(ContextHandler.java:18)
20:22:08 [2026-10-14T18:22:08.361Z] [0m[31m20:22:08,154 ERROR [stderr] (default task-2) at org.jboss.threads@3.9.2//org.jboss.threads.EnhancedQueueExecutor$Task.doRunWith(EnhancedQueueExecutor.java:2651)
20:22:08 [2026-10-14T18:22:08.361Z] [0m[31m20:22:08,154 ERROR [stderr] (default task-2) at org.jboss.threads@3.9.2//org.jboss.threads.EnhancedQueueExecutor$Task.run(EnhancedQueueExecutor.java:2630)
20:22:08 [2026-10-14T18:22:08.361Z] [0m[31m20:22:08,154 ERROR [stderr] (default task-2) at org.jboss.threads@3.9.2//org.jboss.threads.EnhancedQueueExecutor.runThreadBody(EnhancedQueueExecutor.java:1622)
20:22:08 [2026-10-14T18:22:08.361Z] [0m[31m20:22:08,154 ERROR [stderr] (default task-2) at org.jboss.threads@3.9.2//org.jboss.threads.EnhancedQueueExecutor$ThreadBody.run(EnhancedQueueExecutor.java:1589)
20:22:08 [2026-10-14T18:22:08.361Z] [0m[31m20:22:08,154 ERROR [stderr] (default task-2) at org.jboss.xnio@3.8.16.Final//org.xnio.XnioWorker$WorkerThreadFactory$1$1.run(XnioWorker.java:1282)
20:22:08 [2026-10-14T18:22:08.361Z] [0m[31m20:22:08,154 ERROR [stderr] (default task-2) at java.base/java.lang.Thread.run(Thread.java:1583)
20:22:08 [2026-10-14T18:22:08.361Z] [0m[31m20:22:08,154 ERROR [stderr] (default task-2) Caused by: org.h2.jdbc.JdbcSQLSyntaxErrorException: Colonne "ISCOMMUNITY" non trouvée
20:22:08 [2026-10-14T18:22:08.361Z] [0m[31m20:22:08,154 ERROR [stderr] (default task-2) Column "ISCOMMUNITY" not found; SQL statement:
20:22:08 [2026-10-14T18:22:08.361Z] [0m[31m20:22:08,154 ERROR [stderr] (default task-2) select id,domainFatherId,name,description,createdBy,firstPageType,firstPageExtraParam,orderNum,createTime,updateTime,removeTime,spaceStatus,updatedBy,removedBy,lang,isInheritanceBlocked,look,displaySpaceFirst,isPersonal,isCommunity from ST_Space order by orderNum [42122-224]
20:22:08 [2026-10-14T18:22:08.361Z] [0m[31m20:22:08,154 ERROR [stderr] (default task-2) at com.h2database.h2@2.2.224//org.h2.message.DbException.getJdbcSQLException(DbException.java:514)
20:22:08 [2026-10-14T18:22:08.361Z] [0m[31m20:22:08,154 ERROR [stderr] (default task-2) at com.h2database.h2@2.2.224//org.h2.message.DbException.getJdbcSQLException(DbException.java:489)
20:22:08 [2026-10-14T18:22:08.361Z] [0m[31m20:22:08,154 ERROR [stderr] (default task-2) at com.h2database.h2@2.2.224//org.h2.message.DbException.get(DbException.java:223)
20:22:08 [2026-10-14T18:22:08.361Z] [0m[31m20:22:08,154 ERROR [stderr] (default task-2) at com.h2database.h2@2.2.224//org.h2.message.DbException.get(DbException.java:199)
20:22:08 [2026-10-14T18:22:08.361Z] [0m[31m20:22:08,154 ERROR [stderr] (default task-2) at com.h2database.h2@2.2.224//org.h2.expression.ExpressionColumn.getColumnException(ExpressionColumn.java:244)
20:22:08 [2026-10-14T18:22:08.362Z] [0m[31m20:22:08,154 ERROR [stderr] (default task-2) at com.h2database.h2@2.2.224//org.h2.expression.ExpressionColumn.optimizeOther(ExpressionColumn.java:226)
20:22:08 [2026-10-14T18:22:08.362Z] [0m[31m20:22:08,154 ERROR [stderr] (default task-2) at com.h2database.h2@2.2.224//org.h2.expression.ExpressionColumn.optimize(ExpressionColumn.java:213)
20:22:08 [2026-10-14T18:22:08.362Z] [0m[31m20:22:08,154 ERROR [stderr] (default task-2) at com.h2database.h2@2.2.224//org.h2.command.query.Select.prepareExpressions(Select.java:1170)
20:22:08 [2026-10-14T18:22:08.362Z] [0m[31m20:22:08,154 ERROR [stderr] (default task-2) at com.h2database.h2@2.2.224//org.h2.command.query.Query.prepare(Query.java:218)
20:22:08 [2026-10-14T18:22:08.362Z] [0m[31m20:22:08,154 ERROR [stderr] (default task-2) at com.h2database.h2@2.2.224//org.h2.command.Parser.prepareCommand(Parser.java:489)
20:22:08 [2026-10-14T18:22:08.362Z] [0m[31m20:22:08,154 ERROR [stderr] (default task-2) at com.h2database.h2@2.2.224//org.h2.engine.SessionLocal.prepareLocal(SessionLocal.java:639)
20:22:08 [2026-10-14T18:22:08.362Z] [0m[31m20:22:08,154 ERROR [stderr] (default task-2) at com.h2database.h2@2.2.224//org.h2.engine.SessionLocal.prepareCommand(SessionLocal.java:559)
20:22:08 [2026-10-14T18:22:08.362Z] [0m[31m20:22:08,154 ERROR [stderr] (default task-2) at com.h2database.h2@2.2.224//org.h2.jdbc.JdbcConnection.prepareCommand(JdbcConnection.java:1166)
20:22:08 [2026-10-14T18:22:08.362Z] [0m[31m20:22:08,154 ERROR [stderr] (default task-2) at com.h2database.h2@2.2.224//org.h2.jdbc.JdbcPreparedStatement.<init>(JdbcPreparedStatement.java:93)
20:22:08 [2026-10-14T18:22:08.362Z] [0m[31m20:22:08,154 ERROR [stderr] (default task-2) at com.h2database.h2@2.2.224//org.h2.jdbc.JdbcConnection.prepareStatement(JdbcConnection.java:689)
20:22:08 [2026-10-14T18:22:08.362Z] [0m[31m20:22:08,154 ERROR [stderr] (default task-2) at org.jboss.ironjacamar.jdbcadapters@3.0.18.Final//org.jboss.jca.adapters.jdbc.BaseWrapperManagedConnection.doPrepareStatement(BaseWrapperManagedConnection.java:791)
20:22:08 [2026-10-14T18:22:08.362Z] [0m[31m20:22:08,154 ERROR [stderr] (default task-2) at org.jboss.ironjacamar.jdbcadapters@3.0.18.Final//org.jboss.jca.adapters.jdbc.BaseWrapperManagedConnection.prepareStatement(BaseWrapperManagedConnection.java:777)
20:22:08 [2026-10-14T18:22:08.362Z] [0m[31m20:22:08,154 ERROR [stderr] (default task-2) at org.jboss.ironjacamar.jdbcadapters@3.0.18.Final//org.jboss.jca.adapters.jdbc.WrappedConnection$4.produce(WrappedConnection.java:478)
20:22:08 [2026-10-14T18:22:08.362Z] [0m[31m20:22:08,154 ERROR [stderr] (default task-2) at org.jboss.ironjacamar.jdbcadapters@3.0.18.Final//org.jboss.jca.adapters.jdbc.WrappedConnection$4.produce(WrappedConnection.java:476)
20:22:08 [2026-10-14T18:22:08.362Z] [0m[31m20:22:08,154 ERROR [stderr] (default task-2) at org.jboss.ironjacamar.jdbcadapters@3.0.18.Final//org.jboss.jca.adapters.jdbc.SecurityActions.executeInTccl(SecurityActions.java:103)
20:22:08 [2026-10-14T18:22:08.362Z] [0m[31m20:22:08,154 ERROR [stderr] (default task-2) at org.jboss.ironjacamar.jdbcadapters@3.0.18.Final//org.jboss.jca.adapters.jdbc.WrappedConnection.prepareStatement(WrappedConnection.java:476)
20:22:08 [2026-10-14T18:22:08.362Z] [0m[31m20:22:08,154 ERROR [stderr] (default task-2) at deployment.test-CommentRequesterIT.war//org.silverpeas.core.persistence.jdbc.AbstractTable.getRows(AbstractTable.java:227)
20:22:08 [2026-10-14T18:22:08.362Z] [0m[31m20:22:08,154 ERROR [stderr] (default task-2) at deployment.test-CommentRequesterIT.war//org.silverpeas.core.admin.persistence.SpaceTable$Proxy$_$$_WeldSubclass.getRows(Unknown Source)
20:22:08 [2026-10-14T18:22:08.362Z] [0m[31m20:22:08,154 ERROR [stderr] (default task-2) at deployment.test-CommentRequesterIT.war//org.silverpeas.core.admin.persistence.SpaceTable.getAllSpaces(SpaceTable.java:147)
20:22:08 [2026-10-14T18:22:08.362Z] [0m[31m20:22:08,154 ERROR [stderr] (default task-2) at deployment.test-CommentRequesterIT.war//org.silverpeas.core.admin.persistence.SpaceTable$Proxy$_$$_WeldSubclass.getAllSpaces$$super(Unknown Source)
20:22:08 [2026-10-14T18:22:08.362Z] [0m[31m20:22:08,154 ERROR [stderr] (default task-2) at java.base/jdk.internal.reflect.DirectMethodHandleAccessor.invoke(DirectMethodHandleAccessor.java:103)
20:22:08 [2026-10-14T18:22:08.362Z] [0m[31m20:22:08,154 ERROR [stderr] (default task-2) at java.base/java.lang.reflect.Method.invoke(Method.java:580)
20:22:08 [2026-10-14T18:22:08.362Z] [0m[31m20:22:08,154 ERROR [stderr] (default task-2) at org.jboss.weld.core@5.1.6.Final//org.jboss.weld.interceptor.proxy.TerminalAroundInvokeInvocationContext.proceedInternal(TerminalAroundInvokeInvocationContext.java:55)
20:22:08 [2026-10-14T18:22:08.362Z] [0m[31m20:22:08,154 ERROR [stderr] (default task-2) at org.jboss.weld.core@5.1.6.Final//org.jboss.weld.interceptor.proxy.AroundInvokeInvocationContext.proceed(AroundInvokeInvocationContext.java:86)
20:22:08 [2026-10-14T18:22:08.362Z] [0m[31m20:22:08,154 ERROR [stderr] (default task-2) at org.jboss.jts//com.arjuna.ats.jta.cdi.transactional.TransactionalInterceptorBase.invokeInCallerTx(TransactionalInterceptorBase.java:204)
20:22:08 [2026-10-14T18:22:08.362Z] [0m[31m20:22:08,154 ERROR [stderr] (default task-2) at org.jboss.jts//com.arjuna.ats.jta.cdi.transactional.TransactionalInterceptorMandatory.doIntercept(TransactionalInterceptorMandatory.java:43)
20:22:08 [2026-10-14T18:22:08.362Z] [0m[31m20:22:08,154 ERROR [stderr] (default task-2) at org.jboss.jts//com.arjuna.ats.jta.cdi.transactional.TransactionalInterceptorBase.intercept(TransactionalInterceptorBase.java:74)
20:22:08 [2026-10-14T18:22:08.362Z] [0m[31m20:22:08,154 ERROR [stderr] (default task-2) at org.jboss.jts//com.arjuna.ats.jta.cdi.transactional.TransactionalInterceptorMandatory.intercept(TransactionalInterceptorMandatory.java:35)
20:22:08 [2026-10-14T18:22:08.362Z] [0m[31m20:22:08,154 ERROR [stderr] (default task-2) at java.base/jdk.internal.reflect.DirectMethodHandleAccessor.invoke(DirectMethodHandleAccessor.java:103)
20:22:08 [2026-10-14T18:22:08.362Z] [0m[31m20:22:08,154 ERROR [stderr] (default task-2) at java.base/java.lang.reflect.Method.invoke(Method.java:580)
20:22:08 [2026-10-14T18:22:08.362Z] [0m[31m20:22:08,154 ERROR [stderr] (default task-2) at org.jboss.weld.core@5.1.6.Final//org.jboss.weld.interceptor.reader.SimpleInterceptorInvocation$SimpleMethodInvocation.invoke(SimpleInterceptorInvocation.java:75)
20:22:08 [2026-10-14T18:22:08.362Z] [0m[31m20:22:08,154 ERROR [stderr] (default task-2) at org.jboss.weld.core@5.1.6.Final//org.jboss.weld.interceptor.proxy.InterceptorMethodHandler.executeAroundInvoke(InterceptorMethodHandler.java:90)
20:22:08 [2026-10-14T18:22:08.362Z] [0m[31m20:22:08,154 ERROR [stderr] (default task-2) at org.jboss.weld.core@5.1.6.Final//org.jboss.weld.interceptor.proxy.InterceptorMethodHandler.executeInterception(InterceptorMethodHandler.java:73)
20:22:08 [2026-10-14T18:22:08.362Z] [0m[31m20:22:08,154 ERROR [stderr] (default task-2) at org.jboss.weld.core@5.1.6.Final//org.jboss.weld.interceptor.proxy.InterceptorMethodHandler.invoke(InterceptorMethodHandler.java:56)
20:22:08 [2026-10-14T18:22:08.362Z] [0m[31m20:22:08,154 ERROR [stderr] (default task-2) at org.jboss.weld.core@5.1.6.Final//org.jboss.weld.bean.proxy.CombinedInterceptorAndDecoratorStackMethodHandler.invoke(CombinedInterceptorAndDecoratorStackMethodHandler.java:80)
20:22:08 [2026-10-14T18:22:08.362Z] [0m[31m20:22:08,155 ERROR [stderr] (default task-2) at org.jboss.weld.core@5.1.6.Final//org.jboss.weld.bean.proxy.CombinedInterceptorAndDecoratorStackMethodHandler.invoke(CombinedInterceptorAndDecoratorStackMethodHandler.java:68)
20:22:08 [2026-10-14T18:22:08.362Z] [0m[31m20:22:08,155 ERROR [stderr] (default task-2) at deployment.test-CommentRequesterIT.war//org.silverpeas.core.admin.persistence.SpaceTable$Proxy$_$$_WeldSubclass.getAllSpaces(Unknown Source)
20:22:08 [2026-10-14T18:22:08.362Z] [0m[31m20:22:08,155 ERROR [stderr] (default task-2) at deployment.test-CommentRequesterIT.war//org.silverpeas.core.admin.service.SpaceInstManager.getAllSpaces(SpaceInstManager.java:608)
20:22:08 [2026-10-14T18:22:08.362Z] [0m[31m20:22:08,155 ERROR [stderr] (default task-2) ... 224 more
20:22:08 [2026-10-14T18:22:08.362Z] [0m[31m20:22:08,155 ERROR [stderr] (default task-2)
20:22:08 [2026-10-14T18:22:08.362Z] [0m[0m20:22:08,157 INFO [org.jboss.weld.Interceptor] (default task-2) WELD-001703: Unable to determine the @Intercepted Bean<?> for [UnbackedAnnotatedField] @Inject @Intercepted private com.arjuna.ats.jta.cdi.transactional.TransactionalInterceptorMandatory.interceptedBean
20:22:08 [2026-10-14T18:22:08.362Z] [0m[0m20:22:08,157 INFO [org.jboss.weld.Interceptor] (default task-2) WELD-001703: Unable to determine the @Intercepted Bean<?> for [UnbackedAnnotatedField] @Inject @Intercepted private com.arjuna.ats.jta.cdi.transactional.TransactionalInterceptorSupports.interceptedBean
20:22:08 [2026-10-14T18:22:08.362Z] [0m[0m20:22:08,188 INFO [org.silverpeas.core.test.integration.rule.DbSetupRule] (default task-2) Get a new connection successfully.
20:22:08 [2026-10-14T18:22:08.362Z] [0m[0m20:22:08,188 INFO [org.silverpeas.core.test.integration.rule.DbSetupRule] (default task-2) Database structure dropped successfully.
20:22:08 [2026-10-14T18:22:08.362Z] [0m[0m20:22:08,189 INFO [org.silverpeas.core.test.integration.rule.DbSetupRule] (default task-2) # Quiet database connection close report #
20:22:08 [2026-10-14T18:22:08.362Z] On 1 opened safe connection:
20:22:08 [2026-10-14T18:22:08.362Z] - 0 closed successfully (could be the user of getActualDataSet or something wrong),
20:22:08 [2026-10-14T18:22:08.362Z] - 1 already closed,
20:22:08 [2026-10-14T18:22:08.362Z] - 0 closed in error
20:22:08 [2026-10-14T18:22:08.362Z] [0m[0m20:22:08,215 INFO [org.silverpeas.core.test.integration.rule.DbSetupRule] (default task-2) Load database scripts: /org/silverpeas/core/comment/create-database.sql
20:22:08 [2026-10-14T18:22:08.362Z] [0m[0m20:22:08,215 INFO [org.silverpeas.core.test.integration.rule.DbSetupRule] (default task-2) Load dataset scripts: /org/silverpeas/core/comment/comment-dataset.sql
20:22:08 [2026-10-14T18:22:08.362Z] [0m[0m20:22:08,219 INFO [org.silverpeas.core.test.integration.rule.DbSetupRule] (default task-2) Database structure loaded successfully with DbSetup framework.
20:22:08 [2026-10-14T18:22:08.362Z] [0m[0m20:22:08,222 INFO [org.silverpeas.core.test.integration.rule.DbSetupRule] (default task-2) Get a new connection successfully.
20:22:08 [2026-10-14T18:22:08.362Z] [0m[0m20:22:08,222 INFO [org.silverpeas.core.test.integration.rule.DbSetupRule] (default task-2) Database structure dropped successfully.
20:22:08 [2026-10-14T18:22:08.362Z] [0m[0m20:22:08,223 INFO [org.silverpeas.core.test.integration.rule.DbSetupRule] (default task-2) # Quiet database connection close report #
20:22:08 [2026-10-14T18:22:08.362Z] On 1 opened safe connection:
20:22:08 [2026-10-14T18:22:08.362Z] - 0 closed successfully (could be the user of getActualDataSet or something wrong),
20:22:08 [2026-10-14T18:22:08.362Z] - 1 already closed,
20:22:08 [2026-10-14T18:22:08.362Z] - 0 closed in error
20:22:08 [2026-10-14T18:22:08.362Z] [0moct. 14, 2026 8:22:08 PM org.silverpeas.core.test.integration.rule.DbSetupRule createTablesFrom
20:22:08 [2026-10-14T18:22:08.362Z] INFOS: Load database scripts: /org/silverpeas/core/comment/create-database.sql
20:22:08 [2026-10-14T18:22:08.362Z] oct. 14, 2026 8:22:08 PM org.silverpeas.core.test.integration.rule.DbSetupRule loadInitialDataSetFrom
20:22:08 [2026-10-14T18:22:08.362Z] INFOS: Load dataset scripts: /org/silverpeas/core/comment/comment-dataset.sql
20:22:08 [2026-10-14T18:22:08.362Z] [0m20:22:08,245 INFO [org.silverpeas.core.test.integration.rule.DbSetupRule] (default task-2) Load database scripts: /org/silverpeas/core/comment/create-database.sql
20:22:08 [2026-10-14T18:22:08.362Z] [0m[0m20:22:08,245 INFO [org.silverpeas.core.test.integration.rule.DbSetupRule] (default task-2) Load dataset scripts: /org/silverpeas/core/comment/comment-dataset.sql
20:22:08 [2026-10-14T18:22:08.362Z] [0m[0m20:22:08,248 INFO [org.silverpeas.core.test.integration.rule.DbSetupRule] (default task-2) Database structure loaded successfully with DbSetup framework.
20:22:08 [2026-10-14T18:22:08.362Z] [0m[0m20:22:08,251 INFO [org.silverpeas.core.test.integration.rule.DbSetupRule] (default task-2) Get a new connection successfully.
20:22:08 [2026-10-14T18:22:08.362Z] [0m[0m20:22:08,252 INFO [org.silverpeas.core.test.integration.rule.DbSetupRule] (default task-2) Database structure dropped successfully.
20:22:08 [2026-10-14T18:22:08.362Z] [0m[0m20:22:08,252 INFO [org.silverpeas.core.test.integration.rule.DbSetupRule] (default task-2) # Quiet database connection close report #
20:22:08 [2026-10-14T18:22:08.362Z] On 1 opened safe connection:
20:22:08 [2026-10-14T18:22:08.362Z] - 0 closed successfully (could be the user of getActualDataSet or something wrong),
20:22:08 [2026-10-14T18:22:08.362Z] - 1 already closed,
20:22:08 [2026-10-14T18:22:08.362Z] - 0 closed in error
20:22:08 [2026-10-14T18:22:08.362Z] [0moct. 14, 2026 8:22:08 PM org.silverpeas.core.test.integration.rule.DbSetupRule createTablesFrom
20:22:08 [2026-10-14T18:22:08.362Z] INFOS: Load database scripts: /org/silverpeas/core/comment/create-database.sql
20:22:08 [2026-10-14T18:22:08.362Z] oct. 14, 2026 8:22:08 PM org.silverpeas.core.test.integration.rule.DbSetupRule loadInitialDataSetFrom
20:22:08 [2026-10-14T18:22:08.362Z] INFOS: Load dataset scripts: /org/silverpeas/core/comment/comment-dataset.sql
20:22:08 [2026-10-14T18:22:08.362Z] [0m20:22:08,285 INFO [org.silverpeas.core.test.integration.rule.DbSetupRule] (default task-3) Load database scripts: /org/silverpeas/core/comment/create-database.sql
20:22:08 [2026-10-14T18:22:08.362Z] [0m[0m20:22:08,285 INFO [org.silverpeas.core.test.integration.rule.DbSetupRule] (default task-3) Load dataset scripts: /org/silverpeas/core/comment/comment-dataset.sql
20:22:08 [2026-10-14T18:22:08.362Z] [0m[0m20:22:08,294 INFO [org.silverpeas.core.test.integration.rule.DbSetupRule] (default task-3) Database structure loaded successfully with DbSetup framework.
20:22:08 [2026-10-14T18:22:08.362Z] [0m[0m20:22:08,305 INFO [org.silverpeas.core.test.integration.rule.DbSetupRule] (default task-3) Get a new connection successfully.
20:22:08 [2026-10-14T18:22:08.362Z] [0m[0m20:22:08,306 INFO [org.silverpeas.core.test.integration.rule.DbSetupRule] (default task-3) Database structure dropped successfully.
20:22:08 [2026-10-14T18:22:08.362Z] [0m[0m20:22:08,307 INFO [org.silverpeas.core.test.integration.rule.DbSetupRule] (default task-3) # Quiet database connection close report #
20:22:08 [2026-10-14T18:22:08.362Z] On 1 opened safe connection:
20:22:08 [2026-10-14T18:22:08.362Z] - 0 closed successfully (could be the user of getActualDataSet or something wrong),
20:22:08 [2026-10-14T18:22:08.362Z] - 1 already closed,
20:22:08 [2026-10-14T18:22:08.362Z] - 0 closed in error
20:22:08 [2026-10-14T18:22:08.362Z] [0moct. 14, 2026 8:22:08 PM org.silverpeas.core.test.integration.rule.DbSetupRule createTablesFrom
20:22:08 [2026-10-14T18:22:08.362Z] INFOS: Load database scripts: /org/silverpeas/core/comment/create-database.sql
20:22:08 [2026-10-14T18:22:08.362Z] oct. 14, 2026 8:22:08 PM org.silverpeas.core.test.integration.rule.DbSetupRule loadInitialDataSetFrom
20:22:08 [2026-10-14T18:22:08.362Z] INFOS: Load dataset scripts: /org/silverpeas/core/comment/comment-dataset.sql
20:22:08 [2026-10-14T18:22:08.362Z] oct. 14, 2026 8:22:08 PM org.silverpeas.core.test.integration.rule.DbSetupRule createTablesFrom
20:22:08 [2026-10-14T18:22:08.362Z] INFOS: Load database scripts: /org/silverpeas/core/comment/create-database.sql
20:22:08 [2026-10-14T18:22:08.362Z] oct. 14, 2026 8:22:08 PM org.silverpeas.core.test.integration.rule.DbSetupRule loadInitialDataSetFrom
20:22:08 [2026-10-14T18:22:08.362Z] INFOS: Load dataset scripts: /org/silverpeas/core/comment/comment-dataset.sql
20:22:08 [2026-10-14T18:22:08.362Z] [0m20:22:08,334 INFO [org.silverpeas.core.test.integration.rule.DbSetupRule] (default task-2) Load database scripts: /org/silverpeas/core/comment/create-database.sql
20:22:08 [2026-10-14T18:22:08.362Z] [0m[0m20:22:08,334 INFO [org.silverpeas.core.test.integration.rule.DbSetupRule] (default task-2) Load dataset scripts: /org/silverpeas/core/comment/comment-dataset.sql
20:22:08 [2026-10-14T18:22:08.363Z] [0m[0m20:22:08,338 INFO [org.silverpeas.core.test.integration.rule.DbSetupRule] (default task-2) Database structure loaded successfully with DbSetup framework.
20:22:08 [2026-10-14T18:22:08.363Z] [0m[0m20:22:08,342 INFO [org.silverpeas.core.test.integration.rule.DbSetupRule] (default task-2) Get a new connection successfully.
20:22:08 [2026-10-14T18:22:08.363Z] [0m[0m20:22:08,343 INFO [org.silverpeas.core.test.integration.rule.DbSetupRule] (default task-2) Database structure dropped successfully.
20:22:08 [2026-10-14T18:22:08.363Z] [0m[0m20:22:08,343 INFO [org.silverpeas.core.test.integration.rule.DbSetupRule] (default task-2) # Quiet database connection close report #
20:22:08 [2026-10-14T18:22:08.363Z] On 1 opened safe connection:
20:22:08 [2026-10-14T18:22:08.363Z] - 0 closed successfully (could be the user of getActualDataSet or something wrong),
20:22:08 [2026-10-14T18:22:08.363Z] - 1 already closed,
20:22:08 [2026-10-14T18:22:08.363Z] - 0 closed in error
20:22:08 [2026-10-14T18:22:08.613Z] [0m[0m20:22:08,361 INFO [org.silverpeas.core.test.integration.rule.DbSetupRule] (default task-3) Load database scripts: /org/silverpeas/core/comment/create-database.sql
20:22:08 [2026-10-14T18:22:08.613Z] [0m[0m20:22:08,361 INFO [org.silverpeas.core.test.integration.rule.DbSetupRule] (default task-3) Load dataset scripts: /org/silverpeas/core/comment/comment-dataset.sql
20:22:08 [2026-10-14T18:22:08.613Z] [0m[0m20:22:08,365 INFO [org.silverpeas.core.test.integration.rule.DbSetupRule] (default task-3) Database structure loaded successfully with DbSetup framework.
20:22:08 [2026-10-14T18:22:08.613Z] [0m[0m20:22:08,368 INFO [org.silverpeas.core.test.integration.rule.DbSetupRule] (default task-3) Get a new connection successfully.
20:22:08 [2026-10-14T18:22:08.613Z] [0m[0m20:22:08,369 INFO [org.silverpeas.core.test.integration.rule.DbSetupRule] (default task-3) Database structure dropped successfully.
20:22:08 [2026-10-14T18:22:08.613Z] [0m[0m20:22:08,369 INFO [org.silverpeas.core.test.integration.rule.DbSetupRule] (default task-3) # Quiet database connection close report #
20:22:08 [2026-10-14T18:22:08.613Z] On 1 opened safe connection:
20:22:08 [2026-10-14T18:22:08.613Z] - 0 closed successfully (could be the user of getActualDataSet or something wrong),
20:22:08 [2026-10-14T18:22:08.613Z] - 1 already closed,
20:22:08 [2026-10-14T18:22:08.613Z] - 0 closed in error
20:22:08 [2026-10-14T18:22:08.613Z] [0moct. 14, 2026 8:22:08 PM org.silverpeas.core.test.integration.rule.DbSetupRule createTablesFrom
20:22:08 [2026-10-14T18:22:08.613Z] INFOS: Load database scripts: /org/silverpeas/core/comment/create-database.sql
20:22:08 [2026-10-14T18:22:08.613Z] oct. 14, 2026 8:22:08 PM org.silverpeas.core.test.integration.rule.DbSetupRule loadInitialDataSetFrom
20:22:08 [2026-10-14T18:22:08.613Z] INFOS: Load dataset scripts: /org/silverpeas/core/comment/comment-dataset.sql
20:22:08 [2026-10-14T18:22:08.613Z] [0m20:22:08,392 INFO [org.silverpeas.core.test.integration.rule.DbSetupRule] (default task-3) Load database scripts: /org/silverpeas/core/comment/create-database.sql
20:22:08 [2026-10-14T18:22:08.613Z] [0m[0m20:22:08,392 INFO [org.silverpeas.core.test.integration.rule.DbSetupRule] (default task-3) Load dataset scripts: /org/silverpeas/core/comment/comment-dataset.sql
20:22:08 [2026-10-14T18:22:08.613Z] [0m[0m20:22:08,401 INFO [org.silverpeas.core.test.integration.rule.DbSetupRule] (default task-3) Database structure loaded successfully with DbSetup framework.
20:22:08 [2026-10-14T18:22:08.613Z] [0m[0m20:22:08,411 INFO [org.silverpeas.core.test.integration.rule.DbSetupRule] (default task-3) Get a new connection successfully.
20:22:08 [2026-10-14T18:22:08.613Z] [0m[0m20:22:08,411 INFO [org.silverpeas.core.test.integration.rule.DbSetupRule] (default task-3) Database structure dropped successfully.
20:22:08 [2026-10-14T18:22:08.613Z] [0m[0m20:22:08,412 INFO [org.silverpeas.core.test.integration.rule.DbSetupRule] (default task-3) # Quiet database connection close report #
20:22:08 [2026-10-14T18:22:08.613Z] On 1 opened safe connection:
20:22:08 [2026-10-14T18:22:08.613Z] - 0 closed successfully (could be the user of getActualDataSet or something wrong),
20:22:08 [2026-10-14T18:22:08.613Z] - 1 already closed,
20:22:08 [2026-10-14T18:22:08.613Z] - 0 closed in error
20:22:08 [2026-10-14T18:22:08.613Z] [0moct. 14, 2026 8:22:08 PM org.silverpeas.core.test.integration.rule.DbSetupRule createTablesFrom
20:22:08 [2026-10-14T18:22:08.613Z] INFOS: Load database scripts: /org/silverpeas/core/comment/create-database.sql
20:22:08 [2026-10-14T18:22:08.613Z] oct. 14, 2026 8:22:08 PM org.silverpeas.core.test.integration.rule.DbSetupRule loadInitialDataSetFrom
20:22:08 [2026-10-14T18:22:08.613Z] INFOS: Load dataset scripts: /org/silverpeas/core/comment/comment-dataset.sql
20:22:08 [2026-10-14T18:22:08.613Z] oct. 14, 2026 8:22:08 PM org.silverpeas.core.test.integration.rule.DbSetupRule createTablesFrom
20:22:08 [2026-10-14T18:22:08.613Z] INFOS: Load database scripts: /org/silverpeas/core/comment/create-database.sql
20:22:08 [2026-10-14T18:22:08.613Z] oct. 14, 2026 8:22:08 PM org.silverpeas.core.test.integration.rule.DbSetupRule loadInitialDataSetFrom
20:22:08 [2026-10-14T18:22:08.613Z] INFOS: Load dataset scripts: /org/silverpeas/core/comment/comment-dataset.sql
20:22:08 [2026-10-14T18:22:08.613Z] [0m20:22:08,429 INFO [org.silverpeas.core.test.integration.rule.DbSetupRule] (default task-3) Load database scripts: /org/silverpeas/core/comment/create-database.sql
20:22:08 [2026-10-14T18:22:08.613Z] [0m[0m20:22:08,429 INFO [org.silverpeas.core.test.integration.rule.DbSetupRule] (default task-3) Load dataset scripts: /org/silverpeas/core/comment/comment-dataset.sql
20:22:08 [2026-10-14T18:22:08.613Z] [0m[0m20:22:08,433 INFO [org.silverpeas.core.test.integration.rule.DbSetupRule] (default task-3) Database structure loaded successfully with DbSetup framework.
20:22:08 [2026-10-14T18:22:08.613Z] [0m[0m20:22:08,458 INFO [org.silverpeas.core.test.integration.rule.DbSetupRule] (default task-3) Get a new connection successfully.
20:22:08 [2026-10-14T18:22:08.613Z] [0m[0m20:22:08,459 INFO [org.silverpeas.core.test.integration.rule.DbSetupRule] (default task-3) Database structure dropped successfully.
20:22:08 [2026-10-14T18:22:08.613Z] [0m[0m20:22:08,459 INFO [org.silverpeas.core.test.integration.rule.DbSetupRule] (default task-3) # Quiet database connection close report #
20:22:08 [2026-10-14T18:22:08.613Z] On 1 opened safe connection:
20:22:08 [2026-10-14T18:22:08.613Z] - 0 closed successfully (could be the user of getActualDataSet or something wrong),
20:22:08 [2026-10-14T18:22:08.613Z] - 1 already closed,
20:22:08 [2026-10-14T18:22:08.613Z] - 0 closed in error
20:22:08 [2026-10-14T18:22:08.613Z] [0m[0m20:22:08,477 INFO [org.silverpeas.core.test.integration.rule.DbSetupRule] (default task-3) Load database scripts: /org/silverpeas/core/comment/create-database.sql
20:22:08 [2026-10-14T18:22:08.613Z] [0m[0m20:22:08,477 INFO [org.silverpeas.core.test.integration.rule.DbSetupRule] (default task-3) Load dataset scripts: /org/silverpeas/core/comment/comment-dataset.sql
20:22:08 [2026-10-14T18:22:08.613Z] [0m[0m20:22:08,482 INFO [org.silverpeas.core.test.integration.rule.DbSetupRule] (default task-3) Database structure loaded successfully with DbSetup framework.
20:22:08 [2026-10-14T18:22:08.613Z] [0m[0m20:22:08,486 INFO [org.silverpeas.core.test.integration.rule.DbSetupRule] (default task-3) Get a new connection successfully.
20:22:08 [2026-10-14T18:22:08.613Z] [0m[0m20:22:08,486 INFO [org.silverpeas.core.test.integration.rule.DbSetupRule] (default task-3) Database structure dropped successfully.
20:22:08 [2026-10-14T18:22:08.613Z] [0m[0m20:22:08,486 INFO [org.silverpeas.core.test.integration.rule.DbSetupRule] (default task-3) # Quiet database connection close report #
20:22:08 [2026-10-14T18:22:08.613Z] On 1 opened safe connection:
20:22:08 [2026-10-14T18:22:08.613Z] - 0 closed successfully (could be the user of getActualDataSet or something wrong),
20:22:08 [2026-10-14T18:22:08.613Z] - 1 already closed,
20:22:08 [2026-10-14T18:22:08.613Z] - 0 closed in error
20:22:08 [2026-10-14T18:22:08.613Z] [0moct. 14, 2026 8:22:08 PM org.silverpeas.core.test.integration.rule.DbSetupRule createTablesFrom
20:22:08 [2026-10-14T18:22:08.613Z] INFOS: Load database scripts: /org/silverpeas/core/comment/create-database.sql
20:22:08 [2026-10-14T18:22:08.613Z] oct. 14, 2026 8:22:08 PM org.silverpeas.core.test.integration.rule.DbSetupRule loadInitialDataSetFrom
20:22:08 [2026-10-14T18:22:08.613Z] INFOS: Load dataset scripts: /org/silverpeas/core/comment/comment-dataset.sql
20:22:08 [2026-10-14T18:22:08.613Z] [0m20:22:08,503 INFO [org.silverpeas.core.test.integration.rule.DbSetupRule] (default task-3) Load database scripts: /org/silverpeas/core/comment/create-database.sql
20:22:08 [2026-10-14T18:22:08.613Z] [0m[0m20:22:08,503 INFO [org.silverpeas.core.test.integration.rule.DbSetupRule] (default task-3) Load dataset scripts: /org/silverpeas/core/comment/comment-dataset.sql
20:22:08 [2026-10-14T18:22:08.613Z] [0m[0m20:22:08,508 INFO [org.silverpeas.core.test.integration.rule.DbSetupRule] (default task-3) Database structure loaded successfully with DbSetup framework.
20:22:08 [2026-10-14T18:22:08.613Z] [0m[0m20:22:08,513 INFO [org.silverpeas.core.test.integration.rule.DbSetupRule] (default task-3) Get a new connection successfully.
20:22:08 [2026-10-14T18:22:08.613Z] [0m[0m20:22:08,514 INFO [org.silverpeas.core.test.integration.rule.DbSetupRule] (default task-3) Database structure dropped successfully.
20:22:08 [2026-10-14T18:22:08.613Z] [0m[0m20:22:08,514 INFO [org.silverpeas.core.test.integration.rule.DbSetupRule] (default task-3) # Quiet database connection close report #
20:22:08 [2026-10-14T18:22:08.613Z] On 1 opened safe connection:
20:22:08 [2026-10-14T18:22:08.613Z] - 0 closed successfully (could be the user of getActualDataSet or something wrong),
20:22:08 [2026-10-14T18:22:08.613Z] - 1 already closed,
20:22:08 [2026-10-14T18:22:08.613Z] - 0 closed in error
20:22:08 [2026-10-14T18:22:08.613Z] [0moct. 14, 2026 8:22:08 PM org.silverpeas.core.test.integration.rule.DbSetupRule createTablesFrom
20:22:08 [2026-10-14T18:22:08.613Z] INFOS: Load database scripts: /org/silverpeas/core/comment/create-database.sql
20:22:08 [2026-10-14T18:22:08.613Z] oct. 14, 2026 8:22:08 PM org.silverpeas.core.test.integration.rule.DbSetupRule loadInitialDataSetFrom
20:22:08 [2026-10-14T18:22:08.613Z] INFOS: Load dataset scripts: /org/silverpeas/core/comment/comment-dataset.sql
20:22:08 [2026-10-14T18:22:08.613Z] oct. 14, 2026 8:22:08 PM org.silverpeas.core.test.integration.rule.DbSetupRule createTablesFrom
20:22:08 [2026-10-14T18:22:08.613Z] INFOS: Load database scripts: /org/silverpeas/core/comment/create-database.sql
20:22:08 [2026-10-14T18:22:08.613Z] oct. 14, 2026 8:22:08 PM org.silverpeas.core.test.integration.rule.DbSetupRule loadInitialDataSetFrom
20:22:08 [2026-10-14T18:22:08.613Z] INFOS: Load dataset scripts: /org/silverpeas/core/comment/comment-dataset.sql
20:22:08 [2026-10-14T18:22:08.613Z] [0m20:22:08,532 INFO [org.silverpeas.core.test.integration.rule.DbSetupRule] (default task-3) Load database scripts: /org/silverpeas/core/comment/create-database.sql
20:22:08 [2026-10-14T18:22:08.613Z] [0m[0m20:22:08,532 INFO [org.silverpeas.core.test.integration.rule.DbSetupRule] (default task-3) Load dataset scripts: /org/silverpeas/core/comment/comment-dataset.sql
20:22:08 [2026-10-14T18:22:08.613Z] [0m[0m20:22:08,537 INFO [org.silverpeas.core.test.integration.rule.DbSetupRule] (default task-3) Database structure loaded successfully with DbSetup framework.
20:22:08 [2026-10-14T18:22:08.613Z] [0m[0m20:22:08,540 INFO [org.silverpeas.core.test.integration.rule.DbSetupRule] (default task-3) Get a new connection successfully.
20:22:08 [2026-10-14T18:22:08.613Z] [0m[0m20:22:08,541 INFO [org.silverpeas.core.test.integration.rule.DbSetupRule] (default task-3) Database structure dropped successfully.
20:22:08 [2026-10-14T18:22:08.613Z] [0m[0m20:22:08,541 INFO [org.silverpeas.core.test.integration.rule.DbSetupRule] (default task-3) # Quiet database connection close report #
20:22:08 [2026-10-14T18:22:08.613Z] On 1 opened safe connection:
20:22:08 [2026-10-14T18:22:08.613Z] - 0 closed successfully (could be the user of getActualDataSet or something wrong),
20:22:08 [2026-10-14T18:22:08.613Z] - 1 already closed,
20:22:08 [2026-10-14T18:22:08.613Z] - 0 closed in error
20:22:08 [2026-10-14T18:22:08.613Z] [0m[0m20:22:08,558 INFO [org.silverpeas.core.test.integration.rule.DbSetupRule] (default task-2) Load database scripts: /org/silverpeas/core/comment/create-database.sql
20:22:08 [2026-10-14T18:22:08.613Z] [0m[0m20:22:08,558 INFO [org.silverpeas.core.test.integration.rule.DbSetupRule] (default task-2) Load dataset scripts: /org/silverpeas/core/comment/comment-dataset.sql
20:22:08 [2026-10-14T18:22:08.613Z] [0m[0m20:22:08,564 INFO [org.silverpeas.core.test.integration.rule.DbSetupRule] (default task-2) Database structure loaded successfully with DbSetup framework.
20:22:08 [2026-10-14T18:22:08.613Z] [0m[0m20:22:08,567 INFO [org.silverpeas.core.test.integration.rule.DbSetupRule] (default task-2) Get a new connection successfully.
20:22:08 [2026-10-14T18:22:08.613Z] [0m[0m20:22:08,568 INFO [org.silverpeas.core.test.integration.rule.DbSetupRule] (default task-2) Database structure dropped successfully.
20:22:08 [2026-10-14T18:22:08.613Z] [0m[0m20:22:08,568 INFO [org.silverpeas.core.test.integration.rule.DbSetupRule] (default task-2) # Quiet database connection close report #
20:22:08 [2026-10-14T18:22:08.613Z] On 1 opened safe connection:
20:22:08 [2026-10-14T18:22:08.613Z] - 0 closed successfully (could be the user of getActualDataSet or something wrong),
20:22:08 [2026-10-14T18:22:08.614Z] - 1 already closed,
20:22:08 [2026-10-14T18:22:08.614Z] - 0 closed in error
20:22:08 [2026-10-14T18:22:08.614Z] [0moct. 14, 2026 8:22:08 PM org.silverpeas.core.test.integration.rule.DbSetupRule createTablesFrom
20:22:08 [2026-10-14T18:22:08.614Z] INFOS: Load database scripts: /org/silverpeas/core/comment/create-database.sql
20:22:08 [2026-10-14T18:22:08.614Z] oct. 14, 2026 8:22:08 PM org.silverpeas.core.test.integration.rule.DbSetupRule loadInitialDataSetFrom
20:22:08 [2026-10-14T18:22:08.614Z] INFOS: Load dataset scripts: /org/silverpeas/core/comment/comment-dataset.sql
20:22:08 [2026-10-14T18:22:08.614Z] [0m20:22:08,588 INFO [org.silverpeas.core.test.integration.rule.DbSetupRule] (default task-2) Load database scripts: /org/silverpeas/core/comment/create-database.sql
20:22:08 [2026-10-14T18:22:08.614Z] [0m[0m20:22:08,588 INFO [org.silverpeas.core.test.integration.rule.DbSetupRule] (default task-2) Load dataset scripts: /org/silverpeas/core/comment/comment-dataset.sql
20:22:08 [2026-10-14T18:22:08.614Z] [0m[0m20:22:08,594 INFO [org.silverpeas.core.test.integration.rule.DbSetupRule] (default task-2) Database structure loaded successfully with DbSetup framework.
20:22:08 [2026-10-14T18:22:08.614Z] [0m[0m20:22:08,598 INFO [org.silverpeas.core.test.integration.rule.DbSetupRule] (default task-2) Get a new connection successfully.
20:22:08 [2026-10-14T18:22:08.614Z] [0m[0m20:22:08,599 INFO [org.silverpeas.core.test.integration.rule.DbSetupRule] (default task-2) Database structure dropped successfully.
20:22:08 [2026-10-14T18:22:08.614Z] [0m[0m20:22:08,599 INFO [org.silverpeas.core.test.integration.rule.DbSetupRule] (default task-2) # Quiet database connection close report #
20:22:08 [2026-10-14T18:22:08.614Z] On 1 opened safe connection:
20:22:08 [2026-10-14T18:22:08.614Z] - 0 closed successfully (could be the user of getActualDataSet or something wrong),
20:22:08 [2026-10-14T18:22:08.614Z] - 1 already closed,
20:22:08 [2026-10-14T18:22:08.614Z] - 0 closed in error
20:22:08 [2026-10-14T18:22:08.614Z] [0moct. 14, 2026 8:22:08 PM org.silverpeas.core.test.integration.rule.DbSetupRule createTablesFrom
20:22:08 [2026-10-14T18:22:08.614Z] INFOS: Load database scripts: /org/silverpeas/core/comment/create-database.sql
20:22:08 [2026-10-14T18:22:08.614Z] oct. 14, 2026 8:22:08 PM org.silverpeas.core.test.integration.rule.DbSetupRule loadInitialDataSetFrom
20:22:08 [2026-10-14T18:22:08.614Z] INFOS: Load dataset scripts: /org/silverpeas/core/comment/comment-dataset.sql
20:22:08 [2026-10-14T18:22:08.864Z] [0m20:22:08,621 INFO [org.silverpeas.core.test.integration.rule.DbSetupRule] (default task-2) Load database scripts: /org/silverpeas/core/comment/create-database.sql
20:22:08 [2026-10-14T18:22:08.864Z] [0m[0m20:22:08,621 INFO [org.silverpeas.core.test.integration.rule.DbSetupRule] (default task-2) Load dataset scripts: /org/silverpeas/core/comment/comment-dataset.sql
20:22:08 [2026-10-14T18:22:08.864Z] [0m[0m20:22:08,627 INFO [org.silverpeas.core.test.integration.rule.DbSetupRule] (default task-2) Database structure loaded successfully with DbSetup framework.
20:22:08 [2026-10-14T18:22:08.864Z] [0moct. 14, 2026 8:22:08 PM org.silverpeas.core.test.integration.rule.DbSetupRule createTablesFrom
20:22:08 [2026-10-14T18:22:08.864Z] INFOS: Load database scripts: /org/silverpeas/core/comment/create-database.sql
20:22:08 [2026-10-14T18:22:08.864Z] oct. 14, 2026 8:22:08 PM org.silverpeas.core.test.integration.rule.DbSetupRule loadInitialDataSetFrom
20:22:08 [2026-10-14T18:22:08.864Z] INFOS: Load dataset scripts: /org/silverpeas/core/comment/comment-dataset.sql
20:22:08 [2026-10-14T18:22:08.864Z] [0m20:22:08,631 INFO [org.silverpeas.core.test.integration.rule.DbSetupRule] (default task-2) Get a new connection successfully.
20:22:08 [2026-10-14T18:22:08.864Z] [0m[0m20:22:08,632 INFO [org.silverpeas.core.test.integration.rule.DbSetupRule] (default task-2) Database structure dropped successfully.
20:22:08 [2026-10-14T18:22:08.864Z] [0m[0m20:22:08,632 INFO [org.silverpeas.core.test.integration.rule.DbSetupRule] (default task-2) # Quiet database connection close report #
20:22:08 [2026-10-14T18:22:08.864Z] On 1 opened safe connection:
20:22:08 [2026-10-14T18:22:08.864Z] - 0 closed successfully (could be the user of getActualDataSet or something wrong),
20:22:08 [2026-10-14T18:22:08.864Z] - 1 already closed,
20:22:08 [2026-10-14T18:22:08.864Z] - 0 closed in error
20:22:08 [2026-10-14T18:22:08.864Z] [0m[0m20:22:08,659 INFO [org.silverpeas.core.test.integration.rule.DbSetupRule] (default task-3) Load database scripts: /org/silverpeas/core/comment/create-database.sql
20:22:08 [2026-10-14T18:22:08.864Z] [0m[0m20:22:08,659 INFO [org.silverpeas.core.test.integration.rule.DbSetupRule] (default task-3) Load dataset scripts: /org/silverpeas/core/comment/comment-dataset.sql
20:22:08 [2026-10-14T18:22:08.864Z] [0m[0m20:22:08,665 INFO [org.silverpeas.core.test.integration.rule.DbSetupRule] (default task-3) Database structure loaded successfully with DbSetup framework.
20:22:08 [2026-10-14T18:22:08.864Z] [0m[0m20:22:08,668 INFO [org.silverpeas.core.test.integration.rule.DbSetupRule] (default task-3) Get a new connection successfully.
20:22:08 [2026-10-14T18:22:08.864Z] [0m[0m20:22:08,669 INFO [org.silverpeas.core.test.integration.rule.DbSetupRule] (default task-3) Database structure dropped successfully.
20:22:08 [2026-10-14T18:22:08.864Z] [0m[0m20:22:08,669 INFO [org.silverpeas.core.test.integration.rule.DbSetupRule] (default task-3) # Quiet database connection close report #
20:22:08 [2026-10-14T18:22:08.864Z] On 1 opened safe connection:
20:22:08 [2026-10-14T18:22:08.864Z] - 0 closed successfully (could be the user of getActualDataSet or something wrong),
20:22:08 [2026-10-14T18:22:08.864Z] - 1 already closed,
20:22:08 [2026-10-14T18:22:08.864Z] - 0 closed in error
20:22:08 [2026-10-14T18:22:08.864Z] [0moct. 14, 2026 8:22:08 PM org.silverpeas.core.test.integration.rule.DbSetupRule createTablesFrom
20:22:08 [2026-10-14T18:22:08.864Z] INFOS: Load database scripts: /org/silverpeas/core/comment/create-database.sql
20:22:08 [2026-10-14T18:22:08.864Z] oct. 14, 2026 8:22:08 PM org.silverpeas.core.test.integration.rule.DbSetupRule loadInitialDataSetFrom
20:22:08 [2026-10-14T18:22:08.864Z] INFOS: Load dataset scripts: /org/silverpeas/core/comment/comment-dataset.sql
20:22:08 [2026-10-14T18:22:08.864Z] [0m20:22:08,692 INFO [org.silverpeas.core.test.integration.rule.DbSetupRule] (default task-3) Load database scripts: /org/silverpeas/core/comment/create-database.sql
20:22:08 [2026-10-14T18:22:08.864Z] [0m[0m20:22:08,693 INFO [org.silverpeas.core.test.integration.rule.DbSetupRule] (default task-3) Load dataset scripts: /org/silverpeas/core/comment/comment-dataset.sql
20:22:08 [2026-10-14T18:22:08.864Z] [0m[0m20:22:08,698 INFO [org.silverpeas.core.test.integration.rule.DbSetupRule] (default task-3) Database structure loaded successfully with DbSetup framework.
20:22:08 [2026-10-14T18:22:08.864Z] [0m[0m20:22:08,705 INFO [org.silverpeas.core.test.integration.rule.DbSetupRule] (default task-3) Get a new connection successfully.
20:22:08 [2026-10-14T18:22:08.864Z] [0m[0m20:22:08,706 INFO [org.silverpeas.core.test.integration.rule.DbSetupRule] (default task-3) Database structure dropped successfully.
20:22:08 [2026-10-14T18:22:08.864Z] [0m[0m20:22:08,706 INFO [org.silverpeas.core.test.integration.rule.DbSetupRule] (default task-3) # Quiet database connection close report #
20:22:08 [2026-10-14T18:22:08.864Z] On 1 opened safe connection:
20:22:08 [2026-10-14T18:22:08.864Z] - 0 closed successfully (could be the user of getActualDataSet or something wrong),
20:22:08 [2026-10-14T18:22:08.864Z] - 1 already closed,
20:22:08 [2026-10-14T18:22:08.864Z] - 0 closed in error
20:22:08 [2026-10-14T18:22:08.864Z] [0moct. 14, 2026 8:22:08 PM org.silverpeas.core.test.integration.rule.DbSetupRule createTablesFrom
20:22:08 [2026-10-14T18:22:08.864Z] INFOS: Load database scripts: /org/silverpeas/core/comment/create-database.sql
20:22:08 [2026-10-14T18:22:08.864Z] oct. 14, 2026 8:22:08 PM org.silverpeas.core.test.integration.rule.DbSetupRule loadInitialDataSetFrom
20:22:08 [2026-10-14T18:22:08.864Z] INFOS: Load dataset scripts: /org/silverpeas/core/comment/comment-dataset.sql
20:22:08 [2026-10-14T18:22:08.864Z] [0m20:22:08,722 INFO [org.silverpeas.core.test.integration.rule.DbSetupRule] (default task-3) Load database scripts: /org/silverpeas/core/comment/create-database.sql
20:22:08 [2026-10-14T18:22:08.864Z] [0m[0m20:22:08,722 INFO [org.silverpeas.core.test.integration.rule.DbSetupRule] (default task-3) Load dataset scripts: /org/silverpeas/core/comment/comment-dataset.sql
20:22:08 [2026-10-14T18:22:08.864Z] [0m[0m20:22:08,726 INFO [org.silverpeas.core.test.integration.rule.DbSetupRule] (default task-3) Database structure loaded successfully with DbSetup framework.
20:22:08 [2026-10-14T18:22:08.864Z] [0moct. 14, 2026 8:22:08 PM org.silverpeas.core.test.integration.rule.DbSetupRule createTablesFrom
20:22:08 [2026-10-14T18:22:08.864Z] INFOS: Load database scripts: /org/silverpeas/core/comment/create-database.sql
20:22:08 [2026-10-14T18:22:08.864Z] oct. 14, 2026 8:22:08 PM org.silverpeas.core.test.integration.rule.DbSetupRule loadInitialDataSetFrom
20:22:08 [2026-10-14T18:22:08.864Z] INFOS: Load dataset scripts: /org/silverpeas/core/comment/comment-dataset.sql
20:22:08 [2026-10-14T18:22:08.864Z] [0m20:22:08,730 INFO [org.silverpeas.core.test.integration.rule.DbSetupRule] (default task-3) Get a new connection successfully.
20:22:08 [2026-10-14T18:22:08.864Z] [0m[0m20:22:08,730 INFO [org.silverpeas.core.test.integration.rule.DbSetupRule] (default task-3) Database structure dropped successfully.
20:22:08 [2026-10-14T18:22:08.864Z] [0m[0m20:22:08,730 INFO [org.silverpeas.core.test.integration.rule.DbSetupRule] (default task-3) # Quiet database connection close report #
20:22:08 [2026-10-14T18:22:08.864Z] On 1 opened safe connection:
20:22:08 [2026-10-14T18:22:08.864Z] - 0 closed successfully (could be the user of getActualDataSet or something wrong),
20:22:08 [2026-10-14T18:22:08.864Z] - 1 already closed,
20:22:08 [2026-10-14T18:22:08.864Z] - 0 closed in error
20:22:08 [2026-10-14T18:22:08.864Z] [0m[0m20:22:08,743 INFO [org.silverpeas.core.test.integration.rule.DbSetupRule] (default task-2) Load database scripts: /org/silverpeas/core/comment/create-database.sql
20:22:08 [2026-10-14T18:22:08.864Z] [0m[0m20:22:08,743 INFO [org.silverpeas.core.test.integration.rule.DbSetupRule] (default task-2) Load dataset scripts: /org/silverpeas/core/comment/comment-dataset.sql
20:22:08 [2026-10-14T18:22:08.864Z] [0m[0m20:22:08,747 INFO [org.silverpeas.core.test.integration.rule.DbSetupRule] (default task-2) Database structure loaded successfully with DbSetup framework.
20:22:08 [2026-10-14T18:22:08.864Z] [0m[0m20:22:08,749 INFO [org.silverpeas.core.test.integration.rule.DbSetupRule] (default task-2) Get a new connection successfully.
20:22:08 [2026-10-14T18:22:08.864Z] [0m[0m20:22:08,750 INFO [org.silverpeas.core.test.integration.rule.DbSetupRule] (default task-2) Database structure dropped successfully.
20:22:08 [2026-10-14T18:22:08.864Z] [0m[0m20:22:08,750 INFO [org.silverpeas.core.test.integration.rule.DbSetupRule] (default task-2) # Quiet database connection close report #
20:22:08 [2026-10-14T18:22:08.864Z] On 1 opened safe connection:
20:22:08 [2026-10-14T18:22:08.864Z] - 0 closed successfully (could be the user of getActualDataSet or something wrong),
20:22:08 [2026-10-14T18:22:08.864Z] - 1 already closed,
20:22:08 [2026-10-14T18:22:08.864Z] - 0 closed in error
20:22:08 [2026-10-14T18:22:08.864Z] [0moct. 14, 2026 8:22:08 PM org.silverpeas.core.test.integration.rule.DbSetupRule createTablesFrom
20:22:08 [2026-10-14T18:22:08.864Z] INFOS: Load database scripts: /org/silverpeas/core/comment/create-database.sql
20:22:08 [2026-10-14T18:22:08.864Z] oct. 14, 2026 8:22:08 PM org.silverpeas.core.test.integration.rule.DbSetupRule loadInitialDataSetFrom
20:22:08 [2026-10-14T18:22:08.864Z] INFOS: Load dataset scripts: /org/silverpeas/core/comment/comment-dataset.sql
20:22:08 [2026-10-14T18:22:08.864Z] [0m20:22:08,764 INFO [org.silverpeas.core.test.integration.rule.DbSetupRule] (default task-3) Load database scripts: /org/silverpeas/core/comment/create-database.sql
20:22:08 [2026-10-14T18:22:08.864Z] [0m[0m20:22:08,764 INFO [org.silverpeas.core.test.integration.rule.DbSetupRule] (default task-3) Load dataset scripts: /org/silverpeas/core/comment/comment-dataset.sql
20:22:08 [2026-10-14T18:22:08.864Z] [0m[0m20:22:08,768 INFO [org.silverpeas.core.test.integration.rule.DbSetupRule] (default task-3) Database structure loaded successfully with DbSetup framework.
20:22:08 [2026-10-14T18:22:08.864Z] [0m[0m20:22:08,770 INFO [org.silverpeas.core.test.integration.rule.DbSetupRule] (default task-3) Get a new connection successfully.
20:22:08 [2026-10-14T18:22:08.864Z] [0m[0m20:22:08,771 INFO [org.silverpeas.core.test.integration.rule.DbSetupRule] (default task-3) Database structure dropped successfully.
20:22:08 [2026-10-14T18:22:08.864Z] [0m[0m20:22:08,771 INFO [org.silverpeas.core.test.integration.rule.DbSetupRule] (default task-3) # Quiet database connection close report #
20:22:08 [2026-10-14T18:22:08.864Z] On 1 opened safe connection:
20:22:08 [2026-10-14T18:22:08.864Z] - 0 closed successfully (could be the user of getActualDataSet or something wrong),
20:22:08 [2026-10-14T18:22:08.864Z] - 1 already closed,
20:22:08 [2026-10-14T18:22:08.864Z] - 0 closed in error
20:22:08 [2026-10-14T18:22:08.864Z] [0moct. 14, 2026 8:22:08 PM org.silverpeas.core.test.integration.rule.DbSetupRule createTablesFrom
20:22:08 [2026-10-14T18:22:08.864Z] INFOS: Load database scripts: /org/silverpeas/core/comment/create-database.sql
20:22:08 [2026-10-14T18:22:08.865Z] oct. 14, 2026 8:22:08 PM org.silverpeas.core.test.integration.rule.DbSetupRule loadInitialDataSetFrom
20:22:08 [2026-10-14T18:22:08.865Z] INFOS: Load dataset scripts: /org/silverpeas/core/comment/comment-dataset.sql
20:22:08 [2026-10-14T18:22:08.865Z] [0m20:22:08,789 INFO [org.silverpeas.core.test.integration.rule.DbSetupRule] (default task-3) Load database scripts: /org/silverpeas/core/comment/create-database.sql
20:22:08 [2026-10-14T18:22:08.865Z] [0m[0m20:22:08,789 INFO [org.silverpeas.core.test.integration.rule.DbSetupRule] (default task-3) Load dataset scripts: /org/silverpeas/core/comment/comment-dataset.sql
20:22:08 [2026-10-14T18:22:08.865Z] [0m[0m20:22:08,794 INFO [org.silverpeas.core.test.integration.rule.DbSetupRule] (default task-3) Database structure loaded successfully with DbSetup framework.
20:22:08 [2026-10-14T18:22:08.865Z] [0m[0m20:22:08,798 INFO [org.silverpeas.core.test.integration.rule.DbSetupRule] (default task-3) Get a new connection successfully.
20:22:08 [2026-10-14T18:22:08.865Z] [0m[0m20:22:08,799 INFO [org.silverpeas.core.test.integration.rule.DbSetupRule] (default task-3) Database structure dropped successfully.
20:22:08 [2026-10-14T18:22:08.865Z] [0m[0m20:22:08,799 INFO [org.silverpeas.core.test.integration.rule.DbSetupRule] (default task-3) # Quiet database connection close report #
20:22:08 [2026-10-14T18:22:08.865Z] On 1 opened safe connection:
20:22:08 [2026-10-14T18:22:08.865Z] - 0 closed successfully (could be the user of getActualDataSet or something wrong),
20:22:08 [2026-10-14T18:22:08.865Z] - 1 already closed,
20:22:08 [2026-10-14T18:22:08.865Z] - 0 closed in error
20:22:08 [2026-10-14T18:22:08.865Z] [0moct. 14, 2026 8:22:08 PM org.silverpeas.core.test.integration.rule.DbSetupRule createTablesFrom
20:22:08 [2026-10-14T18:22:08.865Z] INFOS: Load database scripts: /org/silverpeas/core/comment/create-database.sql
20:22:08 [2026-10-14T18:22:08.865Z] oct. 14, 2026 8:22:08 PM org.silverpeas.core.test.integration.rule.DbSetupRule loadInitialDataSetFrom
20:22:08 [2026-10-14T18:22:08.865Z] INFOS: Load dataset scripts: /org/silverpeas/core/comment/comment-dataset.sql
20:22:08 [2026-10-14T18:22:08.865Z] [0m20:22:08,839 INFO [org.silverpeas.core.test.integration.rule.DbSetupRule] (default task-3) Load database scripts: /org/silverpeas/core/comment/create-database.sql
20:22:08 [2026-10-14T18:22:08.865Z] [0m[0m20:22:08,839 INFO [org.silverpeas.core.test.integration.rule.DbSetupRule] (default task-3) Load dataset scripts: /org/silverpeas/core/comment/comment-dataset.sql
20:22:08 [2026-10-14T18:22:08.865Z] [0m[0m20:22:08,843 INFO [org.silverpeas.core.test.integration.rule.DbSetupRule] (default task-3) Database structure loaded successfully with DbSetup framework.
20:22:08 [2026-10-14T18:22:08.865Z] [0m[0m20:22:08,845 INFO [org.silverpeas.core.test.integration.rule.DbSetupRule] (default task-3) Get a new connection successfully.
20:22:08 [2026-10-14T18:22:08.865Z] [0m[0m20:22:08,846 INFO [org.silverpeas.core.test.integration.rule.DbSetupRule] (default task-3) Database structure dropped successfully.
20:22:08 [2026-10-14T18:22:08.865Z] [0m[0m20:22:08,846 INFO [org.silverpeas.core.test.integration.rule.DbSetupRule] (default task-3) # Quiet database connection close report #
20:22:08 [2026-10-14T18:22:08.865Z] On 1 opened safe connection:
20:22:08 [2026-10-14T18:22:08.865Z] - 0 closed successfully (could be the user of getActualDataSet or something wrong),
20:22:08 [2026-10-14T18:22:08.865Z] - 1 already closed,
20:22:08 [2026-10-14T18:22:08.865Z] - 0 closed in error
20:22:08 [2026-10-14T18:22:08.865Z] [0moct. 14, 2026 8:22:08 PM org.silverpeas.core.test.integration.rule.DbSetupRule createTablesFrom
20:22:08 [2026-10-14T18:22:08.865Z] INFOS: Load database scripts: /org/silverpeas/core/comment/create-database.sql
20:22:08 [2026-10-14T18:22:08.865Z] oct. 14, 2026 8:22:08 PM org.silverpeas.core.test.integration.rule.DbSetupRule loadInitialDataSetFrom
20:22:08 [2026-10-14T18:22:08.865Z] INFOS: Load dataset scripts: /org/silverpeas/core/comment/comment-dataset.sql
20:22:08 [2026-10-14T18:22:08.865Z] [0m20:22:08,858 INFO [org.silverpeas.core.test.integration.rule.DbSetupRule] (default task-3) Load database scripts: /org/silverpeas/core/comment/create-database.sql
20:22:08 [2026-10-14T18:22:08.865Z] [0m[0m20:22:08,858 INFO [org.silverpeas.core.test.integration.rule.DbSetupRule] (default task-3) Load dataset scripts: /org/silverpeas/core/comment/comment-dataset.sql
20:22:08 [2026-10-14T18:22:08.865Z] [0m[0m20:22:08,862 INFO [org.silverpeas.core.test.integration.rule.DbSetupRule] (default task-3) Database structure loaded successfully with DbSetup framework.
20:22:09 [2026-10-14T18:22:09.115Z] [0m[0m20:22:08,864 INFO [org.silverpeas.core.test.integration.rule.DbSetupRule] (default task-3) Get a new connection successfully.
20:22:09 [2026-10-14T18:22:09.115Z] [0m[0m20:22:08,864 INFO [org.silverpeas.core.test.integration.rule.DbSetupRule] (default task-3) Database structure dropped successfully.
20:22:09 [2026-10-14T18:22:09.115Z] [0m[0m20:22:08,865 INFO [org.silverpeas.core.test.integration.rule.DbSetupRule] (default task-3) # Quiet database connection close report #
20:22:09 [2026-10-14T18:22:09.115Z] On 1 opened safe connection:
20:22:09 [2026-10-14T18:22:09.115Z] - 0 closed successfully (could be the user of getActualDataSet or something wrong),
20:22:09 [2026-10-14T18:22:09.115Z] - 1 already closed,
20:22:09 [2026-10-14T18:22:09.115Z] - 0 closed in error
20:22:09 [2026-10-14T18:22:09.115Z] [0moct. 14, 2026 8:22:08 PM org.silverpeas.core.test.integration.rule.DbSetupRule createTablesFrom
20:22:09 [2026-10-14T18:22:09.115Z] INFOS: Load database scripts: /org/silverpeas/core/comment/create-database.sql
20:22:09 [2026-10-14T18:22:09.115Z] oct. 14, 2026 8:22:08 PM org.silverpeas.core.test.integration.rule.DbSetupRule loadInitialDataSetFrom
20:22:09 [2026-10-14T18:22:09.115Z] INFOS: Load dataset scripts: /org/silverpeas/core/comment/comment-dataset.sql
20:22:09 [2026-10-14T18:22:09.115Z] [0m20:22:08,877 INFO [org.silverpeas.core.test.integration.rule.DbSetupRule] (default task-3) Load database scripts: /org/silverpeas/core/comment/create-database.sql
20:22:09 [2026-10-14T18:22:09.115Z] [0m[0m20:22:08,877 INFO [org.silverpeas.core.test.integration.rule.DbSetupRule] (default task-3) Load dataset scripts: /org/silverpeas/core/comment/comment-dataset.sql
20:22:09 [2026-10-14T18:22:09.115Z] [0m[0m20:22:08,882 INFO [org.silverpeas.core.test.integration.rule.DbSetupRule] (default task-3) Database structure loaded successfully with DbSetup framework.
20:22:09 [2026-10-14T18:22:09.115Z] [0m[0m20:22:08,884 INFO [org.silverpeas.core.test.integration.rule.DbSetupRule] (default task-3) Get a new connection successfully.
20:22:09 [2026-10-14T18:22:09.115Z] [0m[0m20:22:08,885 INFO [org.silverpeas.core.test.integration.rule.DbSetupRule] (default task-3) Database structure dropped successfully.
20:22:09 [2026-10-14T18:22:09.115Z] [0m[0m20:22:08,885 INFO [org.silverpeas.core.test.integration.rule.DbSetupRule] (default task-3) # Quiet database connection close report #
20:22:09 [2026-10-14T18:22:09.115Z] On 1 opened safe connection:
20:22:09 [2026-10-14T18:22:09.115Z] - 0 closed successfully (could be the user of getActualDataSet or something wrong),
20:22:09 [2026-10-14T18:22:09.115Z] - 1 already closed,
20:22:09 [2026-10-14T18:22:09.115Z] - 0 closed in error
20:22:09 [2026-10-14T18:22:09.115Z] [0moct. 14, 2026 8:22:08 PM org.silverpeas.core.test.integration.rule.DbSetupRule createTablesFrom
20:22:09 [2026-10-14T18:22:09.115Z] INFOS: Load database scripts: /org/silverpeas/core/comment/create-database.sql
20:22:09 [2026-10-14T18:22:09.115Z] oct. 14, 2026 8:22:08 PM org.silverpeas.core.test.integration.rule.DbSetupRule loadInitialDataSetFrom
20:22:09 [2026-10-14T18:22:09.115Z] INFOS: Load dataset scripts: /org/silverpeas/core/comment/comment-dataset.sql
20:22:09 [2026-10-14T18:22:09.116Z] [0m20:22:08,898 INFO [org.silverpeas.core.test.integration.rule.DbSetupRule] (default task-3) Load database scripts: /org/silverpeas/core/comment/create-database.sql
20:22:09 [2026-10-14T18:22:09.116Z] [0m[0m20:22:08,898 INFO [org.silverpeas.core.test.integration.rule.DbSetupRule] (default task-3) Load dataset scripts: /org/silverpeas/core/comment/comment-dataset.sql
20:22:09 [2026-10-14T18:22:09.116Z] [0m[0m20:22:08,903 INFO [org.silverpeas.core.test.integration.rule.DbSetupRule] (default task-3) Database structure loaded successfully with DbSetup framework.
20:22:09 [2026-10-14T18:22:09.116Z] [0m[0m20:22:08,906 INFO [org.silverpeas.core.test.integration.rule.DbSetupRule] (default task-3) Get a new connection successfully.
20:22:09 [2026-10-14T18:22:09.116Z] [0m[0m20:22:08,907 INFO [org.silverpeas.core.test.integration.rule.DbSetupRule] (default task-3) Database structure dropped successfully.
20:22:09 [2026-10-14T18:22:09.116Z] [0m[0m20:22:08,907 INFO [org.silverpeas.core.test.integration.rule.DbSetupRule] (default task-3) # Quiet database connection close report #
20:22:09 [2026-10-14T18:22:09.116Z] On 1 opened safe connection:
20:22:09 [2026-10-14T18:22:09.116Z] - 0 closed successfully (could be the user of getActualDataSet or something wrong),
20:22:09 [2026-10-14T18:22:09.116Z] - 1 already closed,
20:22:09 [2026-10-14T18:22:09.116Z] - 0 closed in error
20:22:09 [2026-10-14T18:22:09.116Z] [0moct. 14, 2026 8:22:08 PM org.silverpeas.core.test.integration.rule.DbSetupRule createTablesFrom
20:22:09 [2026-10-14T18:22:09.116Z] INFOS: Load database scripts: /org/silverpeas/core/comment/create-database.sql
20:22:09 [2026-10-14T18:22:09.116Z] oct. 14, 2026 8:22:08 PM org.silverpeas.core.test.integration.rule.DbSetupRule loadInitialDataSetFrom
20:22:09 [2026-10-14T18:22:09.116Z] INFOS: Load dataset scripts: /org/silverpeas/core/comment/comment-dataset.sql
20:22:09 [2026-10-14T18:22:09.116Z] [0m20:22:08,919 INFO [org.silverpeas.core.test.integration.rule.DbSetupRule] (default task-3) Load database scripts: /org/silverpeas/core/comment/create-database.sql
20:22:09 [2026-10-14T18:22:09.116Z] [0m[0m20:22:08,919 INFO [org.silverpeas.core.test.integration.rule.DbSetupRule] (default task-3) Load dataset scripts: /org/silverpeas/core/comment/comment-dataset.sql
20:22:09 [2026-10-14T18:22:09.116Z] [0m[0m20:22:08,923 INFO [org.silverpeas.core.test.integration.rule.DbSetupRule] (default task-3) Database structure loaded successfully with DbSetup framework.
20:22:09 [2026-10-14T18:22:09.116Z] [0m[0m20:22:08,925 INFO [org.silverpeas.core.test.integration.rule.DbSetupRule] (default task-3) Get a new connection successfully.
20:22:09 [2026-10-14T18:22:09.116Z] [0m[0m20:22:08,925 INFO [org.silverpeas.core.test.integration.rule.DbSetupRule] (default task-3) Database structure dropped successfully.
20:22:09 [2026-10-14T18:22:09.116Z] [0m[0m20:22:08,925 INFO [org.silverpeas.core.test.integration.rule.DbSetupRule] (default task-3) # Quiet database connection close report #
20:22:09 [2026-10-14T18:22:09.116Z] On 1 opened safe connection:
20:22:09 [2026-10-14T18:22:09.116Z] - 0 closed successfully (could be the user of getActualDataSet or something wrong),
20:22:09 [2026-10-14T18:22:09.116Z] - 1 already closed,
20:22:09 [2026-10-14T18:22:09.116Z] - 0 closed in error
20:22:09 [2026-10-14T18:22:09.116Z] [0moct. 14, 2026 8:22:08 PM org.silverpeas.core.test.integration.rule.DbSetupRule createTablesFrom
20:22:09 [2026-10-14T18:22:09.116Z] INFOS: Load database scripts: /org/silverpeas/core/comment/create-database.sql
20:22:09 [2026-10-14T18:22:09.116Z] oct. 14, 2026 8:22:08 PM org.silverpeas.core.test.integration.rule.DbSetupRule loadInitialDataSetFrom
20:22:09 [2026-10-14T18:22:09.116Z] INFOS: Load dataset scripts: /org/silverpeas/core/comment/comment-dataset.sql
20:22:09 [2026-10-14T18:22:09.116Z] [0m20:22:08,931 INFO [org.jboss.as.connector.deployers.jdbc] (MSC service thread 1-3) WFLYJCA0019: Stopped Driver service with driver-name = test-CommentRequesterIT.war_org.h2.Driver_2_2
20:22:09 [2026-10-14T18:22:09.116Z] [0m[0m20:22:08,932 INFO [org.wildfly.extension.undertow] (ServerService Thread Pool -- 1137) WFLYUT0022: Unregistered web context: '/test-CommentRequesterIT' from server 'default-server'
20:22:09 [2026-10-14T18:22:09.116Z] [0m[31m20:22:08,932 ERROR [stderr] (ServerService Thread Pool -- 1137) oct. 14, 2026 8:22:08 PM org.silverpeas.kernel.logging.sys.SysLogger log
20:22:09 [2026-10-14T18:22:09.116Z] [0m[31m20:22:08,932 ERROR [stderr] (ServerService Thread Pool -- 1137) INFOS: Silverpeas Services Release...
20:22:09 [2026-10-14T18:22:09.116Z] [0m[31m20:22:08,933 ERROR [stderr] (ServerService Thread Pool -- 1137) oct. 14, 2026 8:22:08 PM org.silverpeas.kernel.logging.sys.SysLogger log
20:22:09 [2026-10-14T18:22:09.116Z] [0m[31m20:22:08,933 ERROR [stderr] (ServerService Thread Pool -- 1137) INFOS: -> IIOProviderInitializer release...
20:22:09 [2026-10-14T18:22:09.116Z] [0m[31m20:22:08,933 ERROR [stderr] (ServerService Thread Pool -- 1137) oct. 14, 2026 8:22:08 PM org.silverpeas.kernel.logging.sys.SysLogger log
20:22:09 [2026-10-14T18:22:09.116Z] [0m[31m20:22:08,933 ERROR [stderr] (ServerService Thread Pool -- 1137) INFOS: Unregisters all available IIO plugins...
20:22:09 [2026-10-14T18:22:09.116Z] [0m[31m20:22:08,933 ERROR [stderr] (ServerService Thread Pool -- 1137) oct. 14, 2026 8:22:08 PM org.silverpeas.kernel.logging.sys.SysLogger log
20:22:09 [2026-10-14T18:22:09.116Z] [0m[31m20:22:08,933 ERROR [stderr] (ServerService Thread Pool -- 1137) INFOS: IIOProviderInitializer release done.
20:22:09 [2026-10-14T18:22:09.116Z] [0m[31m20:22:08,933 ERROR [stderr] (ServerService Thread Pool -- 1137) oct. 14, 2026 8:22:08 PM org.silverpeas.kernel.logging.sys.SysLogger log
20:22:09 [2026-10-14T18:22:09.116Z] [0m[31m20:22:08,933 ERROR [stderr] (ServerService Thread Pool -- 1137) INFOS: Silverpeas Services Release...
20:22:09 [2026-10-14T18:22:09.116Z] [0m[31m20:22:08,934 ERROR [stderr] (ServerService Thread Pool -- 1137) oct. 14, 2026 8:22:08 PM org.silverpeas.kernel.logging.sys.SysLogger log
20:22:09 [2026-10-14T18:22:09.116Z] [0m[31m20:22:08,934 ERROR [stderr] (ServerService Thread Pool -- 1137) INFOS: -> SseLogger release...
20:22:09 [2026-10-14T18:22:09.116Z] [0m[31m20:22:08,934 ERROR [stderr] (ServerService Thread Pool -- 1137) oct. 14, 2026 8:22:08 PM org.silverpeas.kernel.logging.sys.SysLogger log
20:22:09 [2026-10-14T18:22:09.116Z] [0m[31m20:22:08,934 ERROR [stderr] (ServerService Thread Pool -- 1137) INFOS: SseLogger release done.
20:22:09 [2026-10-14T18:22:09.116Z] [0m[0m20:22:08,935 INFO [org.jboss.as.webservices] (MSC service thread 1-3) WFLYWS0004: Stopping service jboss.ws.endpoint."test-CommentRequesterIT.war"."org.apache.chemistry.opencmis.server.impl.webservices.PolicyService"
20:22:09 [2026-10-14T18:22:09.116Z] [0m[0m20:22:08,935 INFO [org.jboss.as.webservices] (MSC service thread 1-4) WFLYWS0004: Stopping service jboss.ws.endpoint."test-CommentRequesterIT.war"."org.apache.chemistry.opencmis.server.impl.webservices.RepositoryService"
20:22:09 [2026-10-14T18:22:09.116Z] [0m[0m20:22:08,935 INFO [org.jboss.as.webservices] (MSC service thread 1-8) WFLYWS0004: Stopping service jboss.ws.endpoint."test-CommentRequesterIT.war"."org.apache.chemistry.opencmis.server.impl.webservices.RelationshipService"
20:22:09 [2026-10-14T18:22:09.116Z] [0m[0m20:22:08,935 INFO [org.jboss.as.webservices] (MSC service thread 1-9) WFLYWS0004: Stopping service jboss.ws.endpoint."test-CommentRequesterIT.war"."org.apache.chemistry.opencmis.server.impl.webservices.ObjectService10"
20:22:09 [2026-10-14T18:22:09.116Z] [0m[0m20:22:08,935 INFO [org.jboss.as.webservices] (MSC service thread 1-6) WFLYWS0004: Stopping service jboss.ws.endpoint."test-CommentRequesterIT.war"."org.apache.chemistry.opencmis.server.impl.webservices.NavigationService"
20:22:09 [2026-10-14T18:22:09.116Z] [0m[0m20:22:08,935 INFO [org.jboss.as.webservices] (MSC service thread 1-5) WFLYWS0004: Stopping service jboss.ws.endpoint."test-CommentRequesterIT.war"."org.apache.chemistry.opencmis.server.impl.webservices.DiscoveryService"
20:22:09 [2026-10-14T18:22:09.116Z] [0m[0m20:22:08,935 INFO [org.jboss.as.webservices] (MSC service thread 1-2) WFLYWS0004: Stopping service jboss.ws.endpoint."test-CommentRequesterIT.war"."org.apache.chemistry.opencmis.server.impl.webservices.ObjectService"
20:22:09 [2026-10-14T18:22:09.116Z] [0m[0m20:22:08,936 INFO [org.jboss.as.webservices] (MSC service thread 1-9) WFLYWS0004: Stopping service jboss.ws.endpoint."test-CommentRequesterIT.war"."org.apache.chemistry.opencmis.server.impl.webservices.RepositoryService10"
20:22:09 [2026-10-14T18:22:09.116Z] [0m[0m20:22:08,936 INFO [org.jboss.as.webservices] (MSC service thread 1-7) WFLYWS0004: Stopping service jboss.ws.endpoint."test-CommentRequesterIT.war"."org.apache.chemistry.opencmis.server.impl.webservices.MultiFilingService"
20:22:09 [2026-10-14T18:22:09.116Z] [0m[0m20:22:08,936 INFO [org.jboss.as.webservices] (MSC service thread 1-8) WFLYWS0004: Stopping service jboss.ws.endpoint."test-CommentRequesterIT.war"."org.apache.chemistry.opencmis.server.impl.webservices.AclService"
20:22:09 [2026-10-14T18:22:09.116Z] [0m[0m20:22:08,936 INFO [org.jboss.as.webservices] (MSC service thread 1-3) WFLYWS0004: Stopping service jboss.ws.endpoint."test-CommentRequesterIT.war"."org.apache.chemistry.opencmis.server.impl.webservices.VersioningService"
20:22:09 [2026-10-14T18:22:09.116Z] [0m[0m20:22:08,954 INFO [org.jboss.as.jpa] (ServerService Thread Pool -- 1121) WFLYJPA0011: Stopping Persistence Unit (phase 2 of 2) Service 'test-CommentRequesterIT.war#silverpeas'
20:22:09 [2026-10-14T18:22:09.116Z] [0m[0m20:22:08,954 INFO [org.jboss.as.jpa] (ServerService Thread Pool -- 1121) WFLYJPA0011: Stopping Persistence Unit (phase 1 of 2) Service 'test-CommentRequesterIT.war#silverpeas'
20:22:09 [2026-10-14T18:22:09.116Z] [0m[0m20:22:09,062 INFO [org.jboss.as.server.deployment] (MSC service thread 1-5) WFLYSRV0028: Stopped deployment test-CommentRequesterIT.war (runtime-name: test-CommentRequesterIT.war) in 131ms
20:22:09 [2026-10-14T18:22:09.367Z] [0m[0m20:22:09,127 INFO [org.jboss.as.repository] (management-handler-thread - 2) WFLYDR0002: Content removed from location /opt/wildfly-for-tests/wildfly-39.0.1.Final/standalone/data/content/05/95e5267ec76b6156865ed4fdb22aa2eaadc387/content
20:22:09 [2026-10-14T18:22:09.367Z] [0m[0m20:22:09,127 INFO [org.jboss.as.server] (management-handler-thread - 2) WFLYSRV0009: Undeployed "test-CommentRequesterIT.war" (runtime-name: "test-CommentRequesterIT.war")
20:22:09 [2026-10-14T18:22:09.367Z] [0m[INFO] Tests run: 25, Failures: 0, Errors: 0, Skipped: 0, Time elapsed: 32.25 s -- in org.silverpeas.core.comment.dao.CommentRequesterIT
20:22:09 [2026-10-14T18:22:09.918Z] [INFO]
20:22:09 [2026-10-14T18:22:09.918Z] [INFO] Results:
20:22:09 [2026-10-14T18:22:09.918Z] [INFO]
20:22:09 [2026-10-14T18:22:09.918Z] [INFO] Tests run: 30, Failures: 0, Errors: 0, Skipped: 0
20:22:09 [2026-10-14T18:22:09.918Z] [INFO]
20:22:09 [2026-10-14T18:22:09.918Z] [INFO]
20:22:09 [2026-10-14T18:22:09.918Z] [INFO] --- javadoc:3.4.1:jar (attach-javadocs) @ silverpeas-core-comment ---
20:22:09 [2026-10-14T18:22:09.918Z] [INFO] No previous run data found, generating javadoc.
20:22:13 [2026-10-14T18:22:13.146Z] [WARNING] Javadoc Warnings
20:22:13 [2026-10-14T18:22:13.146Z] [WARNING] /var/lib/jenkins/workspace/Silverpeas_Master_AutoDeploy/Silverpeas-Core/core-services/comment/src/main/java/org/silverpeas/core/comment/service/CommentUserNotification.java:43: warning: no main description
20:22:13 [2026-10-14T18:22:13.146Z] [WARNING] * @author Yohann Chastagnier
20:22:13 [2026-10-14T18:22:13.146Z] [WARNING] ^
20:22:13 [2026-10-14T18:22:13.146Z] [WARNING] /var/lib/jenkins/workspace/Silverpeas_Master_AutoDeploy/Silverpeas-Core/core-services/comment/src/main/java/org/silverpeas/core/comment/model/Comment.java:43: warning: no comment
20:22:13 [2026-10-14T18:22:13.146Z] [WARNING] public static final String CONTRIBUTION_TYPE = "Comment";
20:22:13 [2026-10-14T18:22:13.146Z] [WARNING] ^
20:22:13 [2026-10-14T18:22:13.146Z] [WARNING] /var/lib/jenkins/workspace/Silverpeas_Master_AutoDeploy/Silverpeas-Core/core-services/comment/src/main/java/org/silverpeas/core/comment/model/Comment.java:92: warning: no comment
20:22:13 [2026-10-14T18:22:13.146Z] [WARNING] public String getCreatorId() {
20:22:13 [2026-10-14T18:22:13.146Z] [WARNING] ^
20:22:13 [2026-10-14T18:22:13.146Z] [WARNING] /var/lib/jenkins/workspace/Silverpeas_Master_AutoDeploy/Silverpeas-Core/core-services/comment/src/main/java/org/silverpeas/core/comment/model/Comment.java:100: warning: no comment
20:22:13 [2026-10-14T18:22:13.146Z] [WARNING] public String getMessage() {
20:22:13 [2026-10-14T18:22:13.146Z] [WARNING] ^
20:22:13 [2026-10-14T18:22:13.146Z] [WARNING] /var/lib/jenkins/workspace/Silverpeas_Master_AutoDeploy/Silverpeas-Core/core-services/comment/src/main/java/org/silverpeas/core/comment/model/Comment.java:109: warning: no comment
20:22:13 [2026-10-14T18:22:13.146Z] [WARNING] public void setLastUpdateDate(Date modificationDate) {
20:22:13 [2026-10-14T18:22:13.146Z] [WARNING] ^
20:22:13 [2026-10-14T18:22:13.146Z] [WARNING] /var/lib/jenkins/workspace/Silverpeas_Master_AutoDeploy/Silverpeas-Core/core-services/comment/src/main/java/org/silverpeas/core/comment/model/Comment.java:96: warning: no comment
20:22:13 [2026-10-14T18:22:13.146Z] [WARNING] public void setMessage(String message) {
20:22:13 [2026-10-14T18:22:13.146Z] [WARNING] ^
20:22:13 [2026-10-14T18:22:13.146Z] [WARNING] /var/lib/jenkins/workspace/Silverpeas_Master_AutoDeploy/Silverpeas-Core/core-services/comment/src/main/java/org/silverpeas/core/comment/dao/CommentDAO.java:65: warning: no description for @param
20:22:13 [2026-10-14T18:22:13.146Z] [WARNING] * @param commentId
20:22:13 [2026-10-14T18:22:13.146Z] [WARNING] ^
20:22:13 [2026-10-14T18:22:13.146Z] [WARNING] /var/lib/jenkins/workspace/Silverpeas_Master_AutoDeploy/Silverpeas-Core/core-services/comment/src/main/java/org/silverpeas/core/comment/service/CommentDeleter.java:41: warning: use of default constructor, which does not provide a comment
20:22:13 [2026-10-14T18:22:13.146Z] [WARNING] public class CommentDeleter implements ContributionDeletion {
20:22:13 [2026-10-14T18:22:13.146Z] [WARNING] ^
20:22:13 [2026-10-14T18:22:13.146Z] [WARNING] /var/lib/jenkins/workspace/Silverpeas_Master_AutoDeploy/Silverpeas-Core/core-services/comment/src/main/java/org/silverpeas/core/comment/dao/CommentedPublicationInfoComparator.java:33: warning: use of default constructor, which does not provide a comment
20:22:13 [2026-10-14T18:22:13.146Z] [WARNING] public class CommentedPublicationInfoComparator implements Comparator<CommentedPublicationInfo> {
20:22:13 [2026-10-14T18:22:13.146Z] [WARNING] ^
20:22:13 [2026-10-14T18:22:13.146Z] [WARNING] /var/lib/jenkins/workspace/Silverpeas_Master_AutoDeploy/Silverpeas-Core/core-services/comment/src/main/java/org/silverpeas/core/comment/service/notification/CommentEvent.java:44: warning: no main description
20:22:13 [2026-10-14T18:22:13.146Z] [WARNING] * @see AbstractResourceEvent#AbstractResourceEvent(ResourceEvent.Type, Serializable[])
20:22:13 [2026-10-14T18:22:13.146Z] [WARNING] ^
20:22:13 [2026-10-14T18:22:13.146Z] [WARNING] /var/lib/jenkins/workspace/Silverpeas_Master_AutoDeploy/Silverpeas-Core/core-services/comment/src/main/java/org/silverpeas/core/comment/service/notification/CommentEvent.java:46: warning: no @param for type
20:22:13 [2026-10-14T18:22:13.146Z] [WARNING] public CommentEvent(final Type type, Comment ... resource) {
20:22:13 [2026-10-14T18:22:13.146Z] [WARNING] ^
20:22:13 [2026-10-14T18:22:13.146Z] [WARNING] /var/lib/jenkins/workspace/Silverpeas_Master_AutoDeploy/Silverpeas-Core/core-services/comment/src/main/java/org/silverpeas/core/comment/service/notification/CommentEvent.java:46: warning: no @param for resource
20:22:13 [2026-10-14T18:22:13.146Z] [WARNING] public CommentEvent(final Type type, Comment ... resource) {
20:22:13 [2026-10-14T18:22:13.146Z] [WARNING] ^
20:22:13 [2026-10-14T18:22:13.146Z] [WARNING] /var/lib/jenkins/workspace/Silverpeas_Master_AutoDeploy/Silverpeas-Core/core-services/comment/src/main/java/org/silverpeas/core/comment/service/notification/CommentEvent.java:39: warning: no comment
20:22:13 [2026-10-14T18:22:13.146Z] [WARNING] public CommentEvent() {
20:22:13 [2026-10-14T18:22:13.146Z] [WARNING] ^
20:22:13 [2026-10-14T18:22:13.147Z] [WARNING] /var/lib/jenkins/workspace/Silverpeas_Master_AutoDeploy/Silverpeas-Core/core-services/comment/src/main/java/org/silverpeas/core/comment/model/CommentId.java:35: warning: no comment
20:22:13 [2026-10-14T18:22:13.147Z] [WARNING] public CommentId(final String instanceId, final String localId) {
20:22:13 [2026-10-14T18:22:13.147Z] [WARNING] ^
20:22:13 [2026-10-14T18:22:13.147Z] [WARNING] /var/lib/jenkins/workspace/Silverpeas_Master_AutoDeploy/Silverpeas-Core/core-services/comment/src/main/java/org/silverpeas/core/comment/CommentRuntimeException.java:55: warning: no @param for callingClass
20:22:13 [2026-10-14T18:22:13.147Z] [WARNING] public CommentRuntimeException(String callingClass, int errorLevel,
20:22:13 [2026-10-14T18:22:13.147Z] [WARNING] ^
20:22:13 [2026-10-14T18:22:13.147Z] [WARNING] /var/lib/jenkins/workspace/Silverpeas_Master_AutoDeploy/Silverpeas-Core/core-services/comment/src/main/java/org/silverpeas/core/comment/CommentRuntimeException.java:55: warning: no @param for errorLevel
20:22:13 [2026-10-14T18:22:13.147Z] [WARNING] public CommentRuntimeException(String callingClass, int errorLevel,
20:22:13 [2026-10-14T18:22:13.147Z] [WARNING] ^
20:22:13 [2026-10-14T18:22:13.147Z] [WARNING] /var/lib/jenkins/workspace/Silverpeas_Master_AutoDeploy/Silverpeas-Core/core-services/comment/src/main/java/org/silverpeas/core/comment/CommentRuntimeException.java:55: warning: no @param for message
20:22:13 [2026-10-14T18:22:13.147Z] [WARNING] public CommentRuntimeException(String callingClass, int errorLevel,
20:22:13 [2026-10-14T18:22:13.147Z] [WARNING] ^
20:22:13 [2026-10-14T18:22:13.147Z] [WARNING] /var/lib/jenkins/workspace/Silverpeas_Master_AutoDeploy/Silverpeas-Core/core-services/comment/src/main/java/org/silverpeas/core/comment/CommentRuntimeException.java:62: warning: no description for @param
20:22:13 [2026-10-14T18:22:13.147Z] [WARNING] * @param callingClass
20:22:13 [2026-10-14T18:22:13.147Z] [WARNING] ^
20:22:13 [2026-10-14T18:22:13.147Z] [WARNING] /var/lib/jenkins/workspace/Silverpeas_Master_AutoDeploy/Silverpeas-Core/core-services/comment/src/main/java/org/silverpeas/core/comment/CommentRuntimeException.java:63: warning: no description for @param
20:22:13 [2026-10-14T18:22:13.147Z] [WARNING] * @param errorLevel
20:22:13 [2026-10-14T18:22:13.147Z] [WARNING] ^
20:22:13 [2026-10-14T18:22:13.147Z] [WARNING] /var/lib/jenkins/workspace/Silverpeas_Master_AutoDeploy/Silverpeas-Core/core-services/comment/src/main/java/org/silverpeas/core/comment/CommentRuntimeException.java:64: warning: no description for @param
20:22:13 [2026-10-14T18:22:13.147Z] [WARNING] * @param message
20:22:13 [2026-10-14T18:22:13.147Z] [WARNING] ^
20:22:13 [2026-10-14T18:22:13.147Z] [WARNING] /var/lib/jenkins/workspace/Silverpeas_Master_AutoDeploy/Silverpeas-Core/core-services/comment/src/main/java/org/silverpeas/core/comment/CommentRuntimeException.java:65: warning: no description for @param
20:22:13 [2026-10-14T18:22:13.147Z] [WARNING] * @param extraParams
20:22:13 [2026-10-14T18:22:13.147Z] [WARNING] ^
20:22:13 [2026-10-14T18:22:13.147Z] [WARNING] /var/lib/jenkins/workspace/Silverpeas_Master_AutoDeploy/Silverpeas-Core/core-services/comment/src/main/java/org/silverpeas/core/comment/CommentRuntimeException.java:75: warning: no description for @param
20:22:13 [2026-10-14T18:22:13.147Z] [WARNING] * @param callingClass
20:22:13 [2026-10-14T18:22:13.147Z] [WARNING] ^
20:22:13 [2026-10-14T18:22:13.147Z] [WARNING] /var/lib/jenkins/workspace/Silverpeas_Master_AutoDeploy/Silverpeas-Core/core-services/comment/src/main/java/org/silverpeas/core/comment/CommentRuntimeException.java:76: warning: no description for @param
20:22:13 [2026-10-14T18:22:13.147Z] [WARNING] * @param errorLevel
20:22:13 [2026-10-14T18:22:13.147Z] [WARNING] ^
20:22:13 [2026-10-14T18:22:13.147Z] [WARNING] /var/lib/jenkins/workspace/Silverpeas_Master_AutoDeploy/Silverpeas-Core/core-services/comment/src/main/java/org/silverpeas/core/comment/CommentRuntimeException.java:77: warning: no description for @param
20:22:13 [2026-10-14T18:22:13.147Z] [WARNING] * @param message
20:22:13 [2026-10-14T18:22:13.147Z] [WARNING] ^
20:22:13 [2026-10-14T18:22:13.147Z] [WARNING] /var/lib/jenkins/workspace/Silverpeas_Master_AutoDeploy/Silverpeas-Core/core-services/comment/src/main/java/org/silverpeas/core/comment/CommentRuntimeException.java:78: warning: no description for @param
20:22:13 [2026-10-14T18:22:13.147Z] [WARNING] * @param nested
20:22:13 [2026-10-14T18:22:13.147Z] [WARNING] ^
20:22:13 [2026-10-14T18:22:13.147Z] [WARNING] /var/lib/jenkins/workspace/Silverpeas_Master_AutoDeploy/Silverpeas-Core/core-services/comment/src/main/java/org/silverpeas/core/comment/CommentRuntimeException.java:88: warning: no description for @param
20:22:13 [2026-10-14T18:22:13.147Z] [WARNING] * @param callingClass
20:22:13 [2026-10-14T18:22:13.147Z] [WARNING] ^
20:22:13 [2026-10-14T18:22:13.147Z] [WARNING] /var/lib/jenkins/workspace/Silverpeas_Master_AutoDeploy/Silverpeas-Core/core-services/comment/src/main/java/org/silverpeas/core/comment/CommentRuntimeException.java:89: warning: no description for @param
20:22:13 [2026-10-14T18:22:13.147Z] [WARNING] * @param errorLevel
20:22:13 [2026-10-14T18:22:13.147Z] [WARNING] ^
20:22:13 [2026-10-14T18:22:13.147Z] [WARNING] /var/lib/jenkins/workspace/Silverpeas_Master_AutoDeploy/Silverpeas-Core/core-services/comment/src/main/java/org/silverpeas/core/comment/CommentRuntimeException.java:90: warning: no description for @param
20:22:13 [2026-10-14T18:22:13.147Z] [WARNING] * @param message
20:22:13 [2026-10-14T18:22:13.147Z] [WARNING] ^
20:22:13 [2026-10-14T18:22:13.147Z] [WARNING] /var/lib/jenkins/workspace/Silverpeas_Master_AutoDeploy/Silverpeas-Core/core-services/comment/src/main/java/org/silverpeas/core/comment/CommentRuntimeException.java:91: warning: no description for @param
20:22:13 [2026-10-14T18:22:13.147Z] [WARNING] * @param extraParams
20:22:13 [2026-10-14T18:22:13.147Z] [WARNING] ^
20:22:13 [2026-10-14T18:22:13.147Z] [WARNING] /var/lib/jenkins/workspace/Silverpeas_Master_AutoDeploy/Silverpeas-Core/core-services/comment/src/main/java/org/silverpeas/core/comment/CommentRuntimeException.java:92: warning: no description for @param
20:22:13 [2026-10-14T18:22:13.147Z] [WARNING] * @param nested
20:22:13 [2026-10-14T18:22:13.147Z] [WARNING] ^
20:22:13 [2026-10-14T18:22:13.147Z] [WARNING] /var/lib/jenkins/workspace/Silverpeas_Master_AutoDeploy/Silverpeas-Core/core-services/comment/src/main/java/org/silverpeas/core/comment/service/CommentService.java:44: warning: no comment
20:22:13 [2026-10-14T18:22:13.147Z] [WARNING] static CommentService get() {
20:22:13 [2026-10-14T18:22:13.147Z] [WARNING] ^
20:22:13 [2026-10-14T18:22:13.147Z] [WARNING] /var/lib/jenkins/workspace/Silverpeas_Master_AutoDeploy/Silverpeas-Core/core-services/comment/src/main/java/org/silverpeas/core/comment/service/CommentService.java:232: warning: no comment
20:22:13 [2026-10-14T18:22:13.147Z] [WARNING] LocalizationBundle getComponentMessages(String language);
20:22:13 [2026-10-14T18:22:13.147Z] [WARNING] ^
20:22:13 [2026-10-14T18:22:13.147Z] [WARNING] /var/lib/jenkins/workspace/Silverpeas_Master_AutoDeploy/Silverpeas-Core/core-services/comment/src/main/java/org/silverpeas/core/comment/service/CommentService.java:189: warning: no comment
20:22:13 [2026-10-14T18:22:13.147Z] [WARNING] List<Comment> getLastComments(final String resourceType, int count);
20:22:13 [2026-10-14T18:22:13.147Z] [WARNING] ^
20:22:13 [2026-10-14T18:22:13.147Z] [WARNING] /var/lib/jenkins/workspace/Silverpeas_Master_AutoDeploy/Silverpeas-Core/core-services/comment/src/main/java/org/silverpeas/core/comment/service/CommentUserNotification.java:78: warning: no comment
20:22:13 [2026-10-14T18:22:13.147Z] [WARNING] public CommentUserNotification(final CommentService commentService, final Comment comment,
20:22:13 [2026-10-14T18:22:13.147Z] [WARNING] ^
20:22:13 [2026-10-14T18:22:13.147Z] [WARNING] /var/lib/jenkins/workspace/Silverpeas_Master_AutoDeploy/Silverpeas-Core/core-services/comment/src/main/java/org/silverpeas/core/comment/service/notification/CommentUserNotificationService.java:65: warning: use of default constructor, which does not provide a comment
20:22:13 [2026-10-14T18:22:13.147Z] [WARNING] public class CommentUserNotificationService extends CDIResourceEventListener<CommentEvent> {
20:22:13 [2026-10-14T18:22:13.147Z] [WARNING] ^
20:22:13 [2026-10-14T18:22:13.147Z] [WARNING] /var/lib/jenkins/workspace/Silverpeas_Master_AutoDeploy/Silverpeas-Core/core-services/comment/src/main/java/org/silverpeas/core/comment/service/notification/CommentUserNotificationService.java:167: warning: no comment
20:22:13 [2026-10-14T18:22:13.147Z] [WARNING] protected CommentService getCommentService() {
20:22:13 [2026-10-14T18:22:13.147Z] [WARNING] ^
20:22:13 [2026-10-14T18:22:13.147Z] [WARNING] /var/lib/jenkins/workspace/Silverpeas_Master_AutoDeploy/Silverpeas-Core/core-services/comment/src/main/java/org/silverpeas/core/comment/service/notification/CommentUserNotificationService.java:163: warning: no comment
20:22:13 [2026-10-14T18:22:13.147Z] [WARNING] protected NotificationSender getNotificationSender(String componentInstanceId) {
20:22:13 [2026-10-14T18:22:13.147Z] [WARNING] ^
20:22:13 [2026-10-14T18:22:13.147Z] [WARNING] /var/lib/jenkins/workspace/Silverpeas_Master_AutoDeploy/Silverpeas-Core/core-services/comment/src/main/java/org/silverpeas/core/comment/dao/jdbc/JDBCCommentDAO.java:49: warning: no comment
20:22:13 [2026-10-14T18:22:13.147Z] [WARNING] public class JDBCCommentDAO implements CommentDAO {
20:22:13 [2026-10-14T18:22:13.147Z] [WARNING] ^
20:22:13 [2026-10-14T18:22:13.147Z] [WARNING] /var/lib/jenkins/workspace/Silverpeas_Master_AutoDeploy/Silverpeas-Core/core-services/comment/src/main/java/org/silverpeas/core/comment/dao/jdbc/JDBCCommentDAO.java:49: warning: use of default constructor, which does not provide a comment
20:22:13 [2026-10-14T18:22:13.147Z] [WARNING] public class JDBCCommentDAO implements CommentDAO {
20:22:13 [2026-10-14T18:22:13.147Z] [WARNING] ^
20:22:13 [2026-10-14T18:22:13.147Z] [WARNING] /var/lib/jenkins/workspace/Silverpeas_Master_AutoDeploy/Silverpeas-Core/core-services/comment/src/main/java/org/silverpeas/core/comment/dao/jdbc/JDBCCommentRequester.java:86: warning: no comment
20:22:13 [2026-10-14T18:22:13.147Z] [WARNING] protected JDBCCommentRequester() {
20:22:13 [2026-10-14T18:22:13.147Z] [WARNING] ^
20:22:13 [2026-10-14T18:22:13.147Z] [WARNING] /var/lib/jenkins/workspace/Silverpeas_Master_AutoDeploy/Silverpeas-Core/core-services/comment/src/main/java/org/silverpeas/core/comment/dao/jdbc/JDBCCommentRequester.java:338: warning: no comment
20:22:13 [2026-10-14T18:22:13.147Z] [WARNING] public int deleteAllComments(Connection con, String resourceType,
20:22:13 [2026-10-14T18:22:13.147Z] [WARNING] ^
20:22:13 [2026-10-14T18:22:13.147Z] [WARNING] /var/lib/jenkins/workspace/Silverpeas_Master_AutoDeploy/Silverpeas-Core/core-services/comment/src/main/java/org/silverpeas/core/comment/dao/jdbc/JDBCCommentRequester.java:314: warning: no comment
20:22:13 [2026-10-14T18:22:13.147Z] [WARNING] public List<Comment> getAllComments(Connection con, String resourceType,
20:22:13 [2026-10-14T18:22:13.147Z] [WARNING] ^
20:22:13 [2026-10-14T18:22:13.147Z] [WARNING] /var/lib/jenkins/workspace/Silverpeas_Master_AutoDeploy/Silverpeas-Core/core-services/comment/src/main/java/org/silverpeas/core/comment/dao/jdbc/JDBCCommentRequester.java:288: warning: no comment
20:22:13 [2026-10-14T18:22:13.147Z] [WARNING] public Map<ResourceReference, Integer> getCommentCountIndexedByResource(Connection con,
20:22:13 [2026-10-14T18:22:13.147Z] [WARNING] ^
20:22:13 [2026-10-14T18:22:13.147Z] [WARNING] /var/lib/jenkins/workspace/Silverpeas_Master_AutoDeploy/Silverpeas-Core/core-services/comment/src/main/java/org/silverpeas/core/comment/dao/jdbc/JDBCCommentRequester.java:264: warning: no comment
20:22:13 [2026-10-14T18:22:13.147Z] [WARNING] public int getCommentsCount(Connection con, String resourceType, ResourceReference resourceRef)
20:22:13 [2026-10-14T18:22:13.147Z] [WARNING] ^
20:22:13 [2026-10-14T18:22:13.147Z] [WARNING] /var/lib/jenkins/workspace/Silverpeas_Master_AutoDeploy/Silverpeas-Core/core-services/comment/src/main/java/org/silverpeas/core/comment/dao/jdbc/JDBCCommentRequester.java:423: warning: no comment
20:22:13 [2026-10-14T18:22:13.147Z] [WARNING] public List<Comment> getLastComments(Connection con, String instanceId, int count)
20:22:13 [2026-10-14T18:22:13.147Z] [WARNING] ^
20:22:13 [2026-10-14T18:22:13.147Z] [WARNING] /var/lib/jenkins/workspace/Silverpeas_Master_AutoDeploy/Silverpeas-Core/core-services/comment/src/main/java/org/silverpeas/core/comment/dao/jdbc/JDBCCommentRequester.java:209: warning: no comment
20:22:13 [2026-10-14T18:22:13.147Z] [WARNING] public List<CommentedPublicationInfo> getMostCommentedAllPublications(Connection con,
20:22:13 [2026-10-14T18:22:13.147Z] [WARNING] ^
20:22:13 [2026-10-14T18:22:13.147Z] [WARNING] /var/lib/jenkins/workspace/Silverpeas_Master_AutoDeploy/Silverpeas-Core/core-services/comment/src/main/java/org/silverpeas/core/comment/dao/jdbc/JDBCCommentRequester.java:230: warning: no comment
20:22:13 [2026-10-14T18:22:13.147Z] [WARNING] public List<CommentedPublicationInfo> getMostCommentedPublications(Connection con,
20:22:13 [2026-10-14T18:22:13.147Z] [WARNING] ^
20:22:13 [2026-10-14T18:22:13.147Z] [WARNING] /var/lib/jenkins/workspace/Silverpeas_Master_AutoDeploy/Silverpeas-Core/core-services/comment/src/main/java/org/silverpeas/core/comment/dao/jdbc/JDBCCommentRequester.java:444: warning: no comment
20:22:13 [2026-10-14T18:22:13.147Z] [WARNING] public List<SocialInformationComment> getSocialInformationComments(Connection con,
20:22:13 [2026-10-14T18:22:13.147Z] [WARNING] ^
20:22:13 [2026-10-14T18:22:13.147Z] [WARNING] /var/lib/jenkins/workspace/Silverpeas_Master_AutoDeploy/Silverpeas-Core/core-services/comment/src/main/java/org/silverpeas/core/comment/socialnetwork/SocialInformationComment.java:32: warning: no comment
20:22:13 [2026-10-14T18:22:13.148Z] [WARNING] public class SocialInformationComment extends AbstractSocialInformation {
20:22:13 [2026-10-14T18:22:13.148Z] [WARNING] ^
20:22:13 [2026-10-14T18:22:13.148Z] [WARNING] /var/lib/jenkins/workspace/Silverpeas_Master_AutoDeploy/Silverpeas-Core/core-services/comment/src/main/java/org/silverpeas/core/comment/socialnetwork/SocialInformationComment.java:111: warning: no comment
20:22:13 [2026-10-14T18:22:13.148Z] [WARNING] public Comment getComment() {
20:22:13 [2026-10-14T18:22:13.148Z] [WARNING] ^
20:22:13 [2026-10-14T18:22:13.148Z] [WARNING] /var/lib/jenkins/workspace/Silverpeas_Master_AutoDeploy/Silverpeas-Core/core-services/comment/src/main/java/org/silverpeas/core/comment/socialnetwork/SocialPublicationComment.java:42: warning: no comment
20:22:13 [2026-10-14T18:22:13.148Z] [WARNING] public class SocialPublicationComment
20:22:13 [2026-10-14T18:22:13.148Z] [WARNING] ^
20:22:13 [2026-10-14T18:22:13.148Z] [WARNING] /var/lib/jenkins/workspace/Silverpeas_Master_AutoDeploy/Silverpeas-Core/core-services/comment/src/main/java/org/silverpeas/core/comment/socialnetwork/SocialPublicationComment.java:42: warning: use of default constructor, which does not provide a comment
20:22:13 [2026-10-14T18:22:13.148Z] [WARNING] public class SocialPublicationComment
20:22:13 [2026-10-14T18:22:13.148Z] [WARNING] ^
20:22:13 [2026-10-14T18:22:13.148Z] [WARNING] /var/lib/jenkins/workspace/Silverpeas_Master_AutoDeploy/Silverpeas-Core/core-services/comment/src/main/java/org/silverpeas/core/comment/model/Comment.java:50: warning: no comment
20:22:13 [2026-10-14T18:22:13.148Z] [WARNING] private final String authorId;
20:22:13 [2026-10-14T18:22:13.148Z] [WARNING] ^
20:22:13 [2026-10-14T18:22:13.148Z] [WARNING] /var/lib/jenkins/workspace/Silverpeas_Master_AutoDeploy/Silverpeas-Core/core-services/comment/src/main/java/org/silverpeas/core/comment/model/Comment.java:48: warning: no comment
20:22:13 [2026-10-14T18:22:13.148Z] [WARNING] private final Date creationDate;
20:22:13 [2026-10-14T18:22:13.148Z] [WARNING] ^
20:22:13 [2026-10-14T18:22:13.148Z] [WARNING] /var/lib/jenkins/workspace/Silverpeas_Master_AutoDeploy/Silverpeas-Core/core-services/comment/src/main/java/org/silverpeas/core/comment/model/Comment.java:44: warning: no comment
20:22:13 [2026-10-14T18:22:13.148Z] [WARNING] private final CommentId id;
20:22:13 [2026-10-14T18:22:13.148Z] [WARNING] ^
20:22:13 [2026-10-14T18:22:13.148Z] [WARNING] /var/lib/jenkins/workspace/Silverpeas_Master_AutoDeploy/Silverpeas-Core/core-services/comment/src/main/java/org/silverpeas/core/comment/model/Comment.java:47: warning: no comment
20:22:13 [2026-10-14T18:22:13.148Z] [WARNING] private String message;
20:22:13 [2026-10-14T18:22:13.148Z] [WARNING] ^
20:22:13 [2026-10-14T18:22:13.148Z] [WARNING] /var/lib/jenkins/workspace/Silverpeas_Master_AutoDeploy/Silverpeas-Core/core-services/comment/src/main/java/org/silverpeas/core/comment/model/Comment.java:46: warning: no comment
20:22:13 [2026-10-14T18:22:13.148Z] [WARNING] private final ResourceReference resource;
20:22:13 [2026-10-14T18:22:13.148Z] [WARNING] ^
20:22:13 [2026-10-14T18:22:13.148Z] [WARNING] /var/lib/jenkins/workspace/Silverpeas_Master_AutoDeploy/Silverpeas-Core/core-services/comment/src/main/java/org/silverpeas/core/comment/model/Comment.java:45: warning: no comment
20:22:13 [2026-10-14T18:22:13.148Z] [WARNING] private final String resourceType;
20:22:13 [2026-10-14T18:22:13.148Z] [WARNING] ^
20:22:13 [2026-10-14T18:22:13.148Z] [WARNING] /var/lib/jenkins/workspace/Silverpeas_Master_AutoDeploy/Silverpeas-Core/core-services/comment/src/main/java/org/silverpeas/core/comment/model/Comment.java:49: warning: no comment
20:22:13 [2026-10-14T18:22:13.148Z] [WARNING] private Date updateDate;
20:22:13 [2026-10-14T18:22:13.148Z] [WARNING] ^
20:22:13 [2026-10-14T18:22:13.148Z] [WARNING] /var/lib/jenkins/workspace/Silverpeas_Master_AutoDeploy/Silverpeas-Core/core-services/comment/src/main/java/org/silverpeas/core/comment/model/CommentedPublicationInfo.java:34: warning: no comment
20:22:13 [2026-10-14T18:22:13.148Z] [WARNING] private int commentCount;
20:22:13 [2026-10-14T18:22:13.148Z] [WARNING] ^
20:22:13 [2026-10-14T18:22:13.148Z] [WARNING] /var/lib/jenkins/workspace/Silverpeas_Master_AutoDeploy/Silverpeas-Core/core-services/comment/src/main/java/org/silverpeas/core/comment/model/CommentedPublicationInfo.java:35: warning: no comment
20:22:13 [2026-10-14T18:22:13.148Z] [WARNING] private String componentId;
20:22:13 [2026-10-14T18:22:13.148Z] [WARNING] ^
20:22:13 [2026-10-14T18:22:13.148Z] [WARNING] /var/lib/jenkins/workspace/Silverpeas_Master_AutoDeploy/Silverpeas-Core/core-services/comment/src/main/java/org/silverpeas/core/comment/model/CommentedPublicationInfo.java:37: warning: no comment
20:22:13 [2026-10-14T18:22:13.148Z] [WARNING] private String elementId;
20:22:13 [2026-10-14T18:22:13.148Z] [WARNING] ^
20:22:13 [2026-10-14T18:22:13.148Z] [WARNING] /var/lib/jenkins/workspace/Silverpeas_Master_AutoDeploy/Silverpeas-Core/core-services/comment/src/main/java/org/silverpeas/core/comment/model/CommentedPublicationInfo.java:36: warning: no comment
20:22:13 [2026-10-14T18:22:13.148Z] [WARNING] private String elementType;
20:22:13 [2026-10-14T18:22:13.148Z] [WARNING] ^
20:22:13 [2026-10-14T18:22:13.148Z] [WARNING] 63 warnings
20:22:13 [2026-10-14T18:22:13.398Z] [INFO] Building jar: /var/lib/jenkins/workspace/Silverpeas_Master_AutoDeploy/Silverpeas-Core/core-services/comment/target/silverpeas-core-comment-6.5-build261014-javadoc.jar
20:22:13 [2026-10-14T18:22:13.398Z] [INFO]
20:22:13 [2026-10-14T18:22:13.398Z] [INFO] --- source:3.2.1:jar-no-fork (attach-sources) @ silverpeas-core-comment ---
20:22:13 [2026-10-14T18:22:13.398Z] [INFO] Building jar: /var/lib/jenkins/workspace/Silverpeas_Master_AutoDeploy/Silverpeas-Core/core-services/comment/target/silverpeas-core-comment-6.5-build261014-sources.jar
20:22:13 [2026-10-14T18:22:13.398Z] [WARNING] artifact org.silverpeas.core.services:silverpeas-core-comment:java-source:sources:6.5-build261014 already attached, replace previous instance
20:22:13 [2026-10-14T18:22:13.398Z] [INFO]
20:22:13 [2026-10-14T18:22:13.398Z] [INFO] --- jacoco:0.8.13:report (tests-coverage) @ silverpeas-core-comment ---
20:22:13 [2026-10-14T18:22:13.398Z] [INFO] Loading execution data file /var/lib/jenkins/workspace/Silverpeas_Master_AutoDeploy/Silverpeas-Core/core-services/comment/target/jacoco.exec
20:22:13 [2026-10-14T18:22:13.398Z] [INFO] Analyzed bundle 'Silverpeas Commenting Engine 6.5-build261014' with 17 classes
20:22:13 [2026-10-14T18:22:13.398Z] [INFO]
20:22:13 [2026-10-14T18:22:13.399Z] [INFO] --- failsafe:3.5.2:verify (default) @ silverpeas-core-comment ---
20:22:13 [2026-10-14T18:22:13.399Z] [INFO]
20:22:13 [2026-10-14T18:22:13.399Z] [INFO] --- install:3.0.1:install (default-install) @ silverpeas-core-comment ---
20:22:13 [2026-10-14T18:22:13.399Z] [INFO] Installing /var/lib/jenkins/workspace/Silverpeas_Master_AutoDeploy/Silverpeas-Core/core-services/comment/pom.xml to /home/silverbuild/.m2/repository/org/silverpeas/core/services/silverpeas-core-comment/6.5-build261014/silverpeas-core-comment-6.5-build261014.pom
20:22:13 [2026-10-14T18:22:13.399Z] [INFO] Installing /var/lib/jenkins/workspace/Silverpeas_Master_AutoDeploy/Silverpeas-Core/core-services/comment/target/silverpeas-core-comment-6.5-build261014.jar to /home/silverbuild/.m2/repository/org/silverpeas/core/services/silverpeas-core-comment/6.5-build261014/silverpeas-core-comment-6.5-build261014.jar
20:22:13 [2026-10-14T18:22:13.399Z] [INFO] Installing /var/lib/jenkins/workspace/Silverpeas_Master_AutoDeploy/Silverpeas-Core/core-services/comment/target/silverpeas-core-comment-6.5-build261014-sources.jar to /home/silverbuild/.m2/repository/org/silverpeas/core/services/silverpeas-core-comment/6.5-build261014/silverpeas-core-comment-6.5-build261014-sources.jar
20:22:13 [2026-10-14T18:22:13.399Z] [INFO] Installing /var/lib/jenkins/workspace/Silverpeas_Master_AutoDeploy/Silverpeas-Core/core-services/comment/target/silverpeas-core-comment-6.5-build261014-javadoc.jar to /home/silverbuild/.m2/repository/org/silverpeas/core/services/silverpeas-core-comment/6.5-build261014/silverpeas-core-comment-6.5-build261014-javadoc.jar
20:22:13 [2026-10-14T18:22:13.399Z] [INFO]
20:22:13 [2026-10-14T18:22:13.399Z] [INFO] ----------< org.silverpeas.core.services:silverpeas-core-pdc >----------
20:22:13 [2026-10-14T18:22:13.399Z] [INFO] Building Silverpeas PdC Engine 6.5-build261014 6.5-build261014 [13/26]
20:22:13 [2026-10-14T18:22:13.399Z] [INFO] from core-services/pdc/pom.xml
20:22:13 [2026-10-14T18:22:13.399Z] [INFO] --------------------------------[ jar ]---------------------------------
20:22:13 [2026-10-14T18:22:13.399Z] [INFO]
20:22:13 [2026-10-14T18:22:13.399Z] [INFO] --- clean:3.2.0:clean (default-clean) @ silverpeas-core-pdc ---
20:22:13 [2026-10-14T18:22:13.399Z] [INFO] Deleting /var/lib/jenkins/workspace/Silverpeas_Master_AutoDeploy/Silverpeas-Core/core-services/pdc/target
20:22:13 [2026-10-14T18:22:13.649Z] [INFO]
20:22:13 [2026-10-14T18:22:13.649Z] [INFO] --- git-commit-id:10.0.0:revision (default) @ silverpeas-core-pdc ---
20:22:15 [2026-10-14T18:22:15.511Z] [INFO]
20:22:15 [2026-10-14T18:22:15.511Z] [INFO] --- jacoco:0.8.13:prepare-agent (default) @ silverpeas-core-pdc ---
20:22:15 [2026-10-14T18:22:15.511Z] [INFO] argLine set to -javaagent:/home/silverbuild/.m2/repository/org/jacoco/org.jacoco.agent/0.8.13/org.jacoco.agent-0.8.13-runtime.jar=destfile=/var/lib/jenkins/workspace/Silverpeas_Master_AutoDeploy/Silverpeas-Core/core-services/pdc/target/jacoco.exec
20:22:15 [2026-10-14T18:22:15.511Z] [INFO]
20:22:15 [2026-10-14T18:22:15.511Z] [INFO] --- resources:3.3.0:resources (default-resources) @ silverpeas-core-pdc ---
20:22:15 [2026-10-14T18:22:15.511Z] [INFO] Copying 1 resource
20:22:15 [2026-10-14T18:22:15.511Z] [INFO]
20:22:15 [2026-10-14T18:22:15.511Z] [INFO] --- compiler:3.13.0:compile (default-compile) @ silverpeas-core-pdc ---
20:22:15 [2026-10-14T18:22:15.511Z] [WARNING] Parameter 'forceJavacCompilerUse' (user property 'maven.compiler.forceJavacCompilerUse') is deprecated: Use forceLegacyJavacApi instead
20:22:15 [2026-10-14T18:22:15.511Z] [INFO] Recompiling the module because of changed dependency.
20:22:15 [2026-10-14T18:22:15.511Z] [INFO] Compiling 97 source files with javac [debug deprecation release 21] to target/classes
20:22:16 [2026-10-14T18:22:16.061Z] [WARNING] /var/lib/jenkins/workspace/Silverpeas_Master_AutoDeploy/Silverpeas-Core/core-services/pdc/src/main/java/org/silverpeas/core/pdc/pdc/model/UsedAxisPK.java:[33,32] [deprecation] WAPrimaryKey in org.silverpeas.core has been deprecated
20:22:16 [2026-10-14T18:22:16.061Z] [WARNING] /var/lib/jenkins/workspace/Silverpeas_Master_AutoDeploy/Silverpeas-Core/core-services/pdc/src/main/java/org/silverpeas/core/pdc/pdc/model/UsedAxisPK.java:[58,31] [deprecation] WAPrimaryKey in org.silverpeas.core has been deprecated
20:22:16 [2026-10-14T18:22:16.061Z] [WARNING] /var/lib/jenkins/workspace/Silverpeas_Master_AutoDeploy/Silverpeas-Core/core-services/pdc/src/main/java/org/silverpeas/core/pdc/pdc/model/ValuePK.java:[32,29] [deprecation] WAPrimaryKey in org.silverpeas.core has been deprecated
20:22:16 [2026-10-14T18:22:16.061Z] [WARNING] /var/lib/jenkins/workspace/Silverpeas_Master_AutoDeploy/Silverpeas-Core/core-services/pdc/src/main/java/org/silverpeas/core/pdc/pdc/model/ValuePK.java:[57,28] [deprecation] WAPrimaryKey in org.silverpeas.core has been deprecated
20:22:16 [2026-10-14T18:22:16.061Z] [WARNING] /var/lib/jenkins/workspace/Silverpeas_Master_AutoDeploy/Silverpeas-Core/core-services/pdc/src/main/java/org/silverpeas/core/pdc/pdc/model/AxisPK.java:[32,28] [deprecation] WAPrimaryKey in org.silverpeas.core has been deprecated
20:22:16 [2026-10-14T18:22:16.061Z] [WARNING] /var/lib/jenkins/workspace/Silverpeas_Master_AutoDeploy/Silverpeas-Core/core-services/pdc/src/main/java/org/silverpeas/core/pdc/pdc/model/AxisPK.java:[57,27] [deprecation] WAPrimaryKey in org.silverpeas.core has been deprecated
20:22:16 [2026-10-14T18:22:16.062Z] [WARNING] /var/lib/jenkins/workspace/Silverpeas_Master_AutoDeploy/Silverpeas-Core/core-services/pdc/src/main/java/org/silverpeas/core/pdc/interests/service/InterestsDAOException.java:[32,43] [deprecation] SilverpeasException in org.silverpeas.core.exception has been deprecated
20:22:16 [2026-10-14T18:22:16.062Z] [WARNING] /var/lib/jenkins/workspace/Silverpeas_Master_AutoDeploy/Silverpeas-Core/core-services/pdc/src/main/java/org/silverpeas/core/pdc/interests/service/InterestsRuntimeException.java:[32,47] [deprecation] SilverpeasRuntimeException in org.silverpeas.core.exception has been deprecated
20:22:16 [2026-10-14T18:22:16.062Z] [WARNING] /var/lib/jenkins/workspace/Silverpeas_Master_AutoDeploy/Silverpeas-Core/core-services/pdc/src/main/java/org/silverpeas/core/pdc/thesaurus/model/ThesaurusBmRuntimeException.java:[28,49] [deprecation] SilverpeasRuntimeException in org.silverpeas.core.exception has been deprecated
20:22:16 [2026-10-14T18:22:16.062Z] [INFO]
20:22:16 [2026-10-14T18:22:16.062Z] [INFO] --- build-helper:3.3.0:add-test-source (add-integration-test-sources) @ silverpeas-core-pdc ---
20:22:16 [2026-10-14T18:22:16.062Z] [INFO] Test Source directory: /var/lib/jenkins/workspace/Silverpeas_Master_AutoDeploy/Silverpeas-Core/core-services/pdc/src/integration-test/java added.
20:22:16 [2026-10-14T18:22:16.062Z] [INFO]
20:22:16 [2026-10-14T18:22:16.062Z] [INFO] --- build-helper:3.3.0:add-test-resource (add-integration-test-sources) @ silverpeas-core-pdc ---
20:22:16 [2026-10-14T18:22:16.062Z] [INFO]
20:22:16 [2026-10-14T18:22:16.062Z] [INFO] --- resources:3.3.0:testResources (default-testResources) @ silverpeas-core-pdc ---
20:22:16 [2026-10-14T18:22:16.062Z] [INFO] Copying 1 resource
20:22:16 [2026-10-14T18:22:16.062Z] [INFO] Copying 0 resource
20:22:16 [2026-10-14T18:22:16.062Z] [INFO] Copying 1 resource
20:22:16 [2026-10-14T18:22:16.062Z] [INFO] Copying 0 resource
20:22:16 [2026-10-14T18:22:16.062Z] [INFO] Copying 3 resources
20:22:16 [2026-10-14T18:22:16.062Z] [INFO] Copying 4 resources
20:22:16 [2026-10-14T18:22:16.062Z] [INFO] Copying 7 resources
20:22:16 [2026-10-14T18:22:16.062Z] [INFO] The encoding used to copy filtered properties files have not been set. This means that the same encoding will be used to copy filtered properties files as when copying other filtered resources. This might not be what you want! Run your build with --debug to see which files might be affected. Read more at https://maven.apache.org/plugins/maven-resources-plugin/examples/filtering-properties-files.html
20:22:16 [2026-10-14T18:22:16.062Z] [INFO]
20:22:16 [2026-10-14T18:22:16.062Z] [INFO] --- compiler:3.13.0:testCompile (default-testCompile) @ silverpeas-core-pdc ---
20:22:16 [2026-10-14T18:22:16.062Z] [WARNING] Parameter 'forceJavacCompilerUse' (user property 'maven.compiler.forceJavacCompilerUse') is deprecated: Use forceLegacyJavacApi instead
20:22:16 [2026-10-14T18:22:16.062Z] [INFO] Recompiling the module because of changed dependency.
20:22:16 [2026-10-14T18:22:16.062Z] [INFO] Compiling 13 source files with javac [debug deprecation release 21] to target/test-classes
20:22:16 [2026-10-14T18:22:16.613Z] [WARNING] on the class path. A future release of javac may disable annotation processing
20:22:16 [2026-10-14T18:22:16.613Z] unless at least one processor is specified by name (-processor), or a search
20:22:16 [2026-10-14T18:22:16.613Z] path is specified (--processor-path, --processor-module-path), or annotation
20:22:16 [2026-10-14T18:22:16.613Z] processing is enabled explicitly (-proc:only, -proc:full).
20:22:16 [2026-10-14T18:22:16.613Z] Use -Xlint:-options to suppress this message.
20:22:16 [2026-10-14T18:22:16.613Z] Use -proc:none to disable annotation processing.
20:22:16 [2026-10-14T18:22:16.613Z] /var/lib/jenkins/workspace/Silverpeas_Master_AutoDeploy/Silverpeas-Core/core-services/pdc/src/test/java/org/silverpeas/core/pdc/pdc/service/PdcSubscriptionsCheckOnDeletionTest.java:[114,10] [deprecation] SilverpeasBeanDAO in org.silverpeas.core.persistence.jdbc.bean has been deprecated
20:22:16 [2026-10-14T18:22:16.613Z] [WARNING] /var/lib/jenkins/workspace/Silverpeas_Master_AutoDeploy/Silverpeas-Core/core-services/pdc/src/test/java/org/silverpeas/core/pdc/pdc/service/PdcSubscriptionsCheckOnDeletionTest.java:[114,66] [deprecation] SilverpeasBeanDAO in org.silverpeas.core.persistence.jdbc.bean has been deprecated
20:22:16 [2026-10-14T18:22:16.613Z] [INFO]
20:22:16 [2026-10-14T18:22:16.613Z] [INFO] --- surefire:3.5.2:test (default-test) @ silverpeas-core-pdc ---
20:22:16 [2026-10-14T18:22:16.613Z] [INFO] Using auto detected provider org.apache.maven.surefire.junitplatform.JUnitPlatformProvider
20:22:16 [2026-10-14T18:22:16.613Z] [INFO]
20:22:16 [2026-10-14T18:22:16.613Z] [INFO] -------------------------------------------------------
20:22:16 [2026-10-14T18:22:16.613Z] [INFO] T E S T S
20:22:16 [2026-10-14T18:22:16.613Z] [INFO] -------------------------------------------------------
20:22:18 [2026-10-14T18:22:18.474Z] [INFO] Running org.silverpeas.core.pdc.pdc.service.PdcSubscriptionsCheckOnDeletionTest
20:22:18 [2026-10-14T18:22:18.474Z] Mockito is currently self-attaching to enable the inline-mock-maker. This will no longer work in future releases of the JDK. Please add Mockito as an agent to your build as described in Mockito's documentation: https://javadoc.io/doc/org.mockito/mockito-core/latest/org.mockito/org/mockito/Mockito.html#0.3
20:22:18 [2026-10-14T18:22:18.474Z] WARNING: A Java agent has been loaded dynamically (/home/silverbuild/.m2/repository/net/bytebuddy/byte-buddy-agent/1.18.1/byte-buddy-agent-1.18.1.jar)
20:22:18 [2026-10-14T18:22:18.474Z] WARNING: If a serviceability tool is in use, please run with -XX:+EnableDynamicAgentLoading to hide this warning
20:22:18 [2026-10-14T18:22:18.474Z] WARNING: If a serviceability tool is not in use, please run with -Djdk.instrument.traceUsage for more information
20:22:18 [2026-10-14T18:22:18.474Z] WARNING: Dynamic loading of agents will be disallowed by default in a future release
20:22:18 [2026-10-14T18:22:18.725Z] SLF4J(W): No SLF4J providers were found.
20:22:18 [2026-10-14T18:22:18.725Z] SLF4J(W): Defaulting to no-operation (NOP) logger implementation
20:22:18 [2026-10-14T18:22:18.725Z] SLF4J(W): See https://www.slf4j.org/codes.html#noProviders for further details.
20:22:18 [2026-10-14T18:22:18.725Z] OpenJDK 64-Bit Server VM warning: Sharing is only supported for boot loader classes because bootstrap classpath has been appended
20:22:21 [2026-10-14T18:22:21.953Z] oct. 14, 2026 8:22:21 PM org.silverpeas.kernel.logging.LoggerConfigurationManager loadAllConfigurationFiles
20:22:21 [2026-10-14T18:22:21.953Z] INFOS: Silverpeas Logging Engine initialization...
20:22:21 [2026-10-14T18:22:21.953Z] oct. 14, 2026 8:22:21 PM org.silverpeas.kernel.logging.LoggerConfigurationManager loadAllConfigurationFiles
20:22:21 [2026-10-14T18:22:21.953Z] AVERTISSEMENT: /var/lib/jenkins/workspace/Silverpeas_Master_AutoDeploy/Silverpeas-Core/core-test/target/test-classes/org/silverpeas/util/logging
20:22:21 [2026-10-14T18:22:21.953Z] java.nio.file.NoSuchFileException: /var/lib/jenkins/workspace/Silverpeas_Master_AutoDeploy/Silverpeas-Core/core-test/target/test-classes/org/silverpeas/util/logging
20:22:21 [2026-10-14T18:22:21.953Z] at java.base/sun.nio.fs.UnixException.translateToIOException(UnixException.java:92)
20:22:21 [2026-10-14T18:22:21.953Z] at java.base/sun.nio.fs.UnixException.asIOException(UnixException.java:115)
20:22:21 [2026-10-14T18:22:21.953Z] at java.base/sun.nio.fs.UnixFileSystemProvider.newDirectoryStream(UnixFileSystemProvider.java:501)
20:22:21 [2026-10-14T18:22:21.953Z] at java.base/java.nio.file.Files.newDirectoryStream(Files.java:482)
20:22:21 [2026-10-14T18:22:21.953Z] at java.base/java.nio.file.Files.list(Files.java:3785)
20:22:21 [2026-10-14T18:22:21.953Z] at org.silverpeas.kernel.logging.LoggerConfigurationManager.loadAllConfigurationFiles(LoggerConfigurationManager.java:100)
20:22:21 [2026-10-14T18:22:21.953Z] at org.silverpeas.kernel.logging.SilverLoggerProvider.<init>(SilverLoggerProvider.java:62)
20:22:21 [2026-10-14T18:22:21.953Z] at org.silverpeas.kernel.logging.SilverLoggerProvider.getInstance(SilverLoggerProvider.java:55)
20:22:21 [2026-10-14T18:22:21.953Z] at org.silverpeas.kernel.logging.SilverLogger.getLogger(SilverLogger.java:91)
20:22:21 [2026-10-14T18:22:21.953Z] at org.silverpeas.core.persistence.jdbc.bean.SilverpeasBeanDAOImpl.lambda$new$0(SilverpeasBeanDAOImpl.java:68)
20:22:21 [2026-10-14T18:22:21.953Z] at java.base/java.util.stream.ReferencePipeline$2$1.accept(ReferencePipeline.java:178)
20:22:21 [2026-10-14T18:22:21.953Z] at java.base/java.util.Spliterators$ArraySpliterator.forEachRemaining(Spliterators.java:1024)
20:22:21 [2026-10-14T18:22:21.953Z] at java.base/java.util.stream.AbstractPipeline.copyInto(AbstractPipeline.java:509)
20:22:21 [2026-10-14T18:22:21.953Z] at java.base/java.util.stream.AbstractPipeline.wrapAndCopyInto(AbstractPipeline.java:499)
20:22:21 [2026-10-14T18:22:21.953Z] at java.base/java.util.stream.ReduceOps$ReduceOp.evaluateSequential(ReduceOps.java:921)
20:22:21 [2026-10-14T18:22:21.953Z] at java.base/java.util.stream.AbstractPipeline.evaluate(AbstractPipeline.java:234)
20:22:21 [2026-10-14T18:22:21.953Z] at java.base/java.util.stream.ReferencePipeline.collect(ReferencePipeline.java:682)
20:22:21 [2026-10-14T18:22:21.953Z] at org.silverpeas.core.persistence.jdbc.bean.SilverpeasBeanDAOImpl.<init>(SilverpeasBeanDAOImpl.java:81)
20:22:21 [2026-10-14T18:22:21.953Z] at org.silverpeas.core.persistence.jdbc.bean.SilverpeasBeanDAOFactory.getDAO(SilverpeasBeanDAOFactory.java:46)
20:22:21 [2026-10-14T18:22:21.953Z] at org.silverpeas.core.pdc.pdc.service.GlobalPdcManager.<init>(GlobalPdcManager.java:116)
20:22:21 [2026-10-14T18:22:21.953Z] at org.silverpeas.core.pdc.pdc.service.PdcSubscriptionsCheckOnDeletionTest.setUpThePdcManager(PdcSubscriptionsCheckOnDeletionTest.java:93)
20:22:21 [2026-10-14T18:22:21.953Z] at java.base/jdk.internal.reflect.DirectMethodHandleAccessor.invoke(DirectMethodHandleAccessor.java:103)
20:22:21 [2026-10-14T18:22:21.953Z] at java.base/java.lang.reflect.Method.invoke(Method.java:580)
20:22:21 [2026-10-14T18:22:21.953Z] at org.junit.platform.commons.util.ReflectionUtils.invokeMethod(ReflectionUtils.java:767)
20:22:21 [2026-10-14T18:22:21.953Z] at org.junit.jupiter.engine.execution.MethodInvocation.proceed(MethodInvocation.java:60)
20:22:21 [2026-10-14T18:22:21.953Z] at org.junit.jupiter.engine.execution.InvocationInterceptorChain$ValidatingInvocation.proceed(InvocationInterceptorChain.java:131)
20:22:21 [2026-10-14T18:22:21.953Z] at org.junit.jupiter.engine.extension.TimeoutExtension.intercept(TimeoutExtension.java:156)
20:22:21 [2026-10-14T18:22:21.953Z] at org.junit.jupiter.engine.extension.TimeoutExtension.interceptLifecycleMethod(TimeoutExtension.java:128)
20:22:21 [2026-10-14T18:22:21.953Z] at org.junit.jupiter.engine.extension.TimeoutExtension.interceptBeforeEachMethod(TimeoutExtension.java:78)
20:22:21 [2026-10-14T18:22:21.953Z] at org.junit.jupiter.engine.execution.InterceptingExecutableInvoker$ReflectiveInterceptorCall.lambda$ofVoidMethod$0(InterceptingExecutableInvoker.java:103)
20:22:21 [2026-10-14T18:22:21.953Z] at org.junit.jupiter.engine.execution.InterceptingExecutableInvoker.lambda$invoke$0(InterceptingExecutableInvoker.java:93)
20:22:21 [2026-10-14T18:22:21.953Z] at org.junit.jupiter.engine.execution.InvocationInterceptorChain$InterceptedInvocation.proceed(InvocationInterceptorChain.java:106)
20:22:21 [2026-10-14T18:22:21.953Z] at org.junit.jupiter.engine.execution.InvocationInterceptorChain.proceed(InvocationInterceptorChain.java:64)
20:22:21 [2026-10-14T18:22:21.953Z] at org.junit.jupiter.engine.execution.InvocationInterceptorChain.chainAndInvoke(InvocationInterceptorChain.java:45)
20:22:21 [2026-10-14T18:22:21.953Z] at org.junit.jupiter.engine.execution.InvocationInterceptorChain.invoke(InvocationInterceptorChain.java:37)
20:22:21 [2026-10-14T18:22:21.953Z] at org.junit.jupiter.engine.execution.InterceptingExecutableInvoker.invoke(InterceptingExecutableInvoker.java:92)
20:22:21 [2026-10-14T18:22:21.953Z] at org.junit.jupiter.engine.execution.InterceptingExecutableInvoker.invoke(InterceptingExecutableInvoker.java:86)
20:22:21 [2026-10-14T18:22:21.953Z] at org.junit.jupiter.engine.descriptor.ClassBasedTestDescriptor.invokeMethodInExtensionContext(ClassBasedTestDescriptor.java:521)
20:22:21 [2026-10-14T18:22:21.953Z] at org.junit.jupiter.engine.descriptor.ClassBasedTestDescriptor.lambda$synthesizeBeforeEachMethodAdapter$24(ClassBasedTestDescriptor.java:506)
20:22:21 [2026-10-14T18:22:21.953Z] at org.junit.jupiter.engine.descriptor.TestMethodTestDescriptor.lambda$invokeBeforeEachMethods$4(TestMethodTestDescriptor.java:174)
20:22:21 [2026-10-14T18:22:21.953Z] at org.junit.jupiter.engine.descriptor.TestMethodTestDescriptor.lambda$invokeBeforeMethodsOrCallbacksUntilExceptionOccurs$7(TestMethodTestDescriptor.java:202)
20:22:21 [2026-10-14T18:22:21.953Z] at org.junit.platform.engine.support.hierarchical.ThrowableCollector.execute(ThrowableCollector.java:73)
20:22:21 [2026-10-14T18:22:21.953Z] at org.junit.jupiter.engine.descriptor.TestMethodTestDescriptor.invokeBeforeMethodsOrCallbacksUntilExceptionOccurs(TestMethodTestDescriptor.java:202)
20:22:21 [2026-10-14T18:22:21.953Z] at org.junit.jupiter.engine.descriptor.TestMethodTestDescriptor.invokeBeforeEachMethods(TestMethodTestDescriptor.java:171)
20:22:21 [2026-10-14T18:22:21.953Z] at org.junit.jupiter.engine.descriptor.TestMethodTestDescriptor.execute(TestMethodTestDescriptor.java:134)
20:22:21 [2026-10-14T18:22:21.954Z] at org.junit.jupiter.engine.descriptor.TestMethodTestDescriptor.execute(TestMethodTestDescriptor.java:68)
20:22:21 [2026-10-14T18:22:21.954Z] at org.junit.platform.engine.support.hierarchical.NodeTestTask.lambda$executeRecursively$6(NodeTestTask.java:156)
20:22:21 [2026-10-14T18:22:21.954Z] at org.junit.platform.engine.support.hierarchical.ThrowableCollector.execute(ThrowableCollector.java:73)
20:22:21 [2026-10-14T18:22:21.954Z] at org.junit.platform.engine.support.hierarchical.NodeTestTask.lambda$executeRecursively$8(NodeTestTask.java:146)
20:22:21 [2026-10-14T18:22:21.954Z] at org.junit.platform.engine.support.hierarchical.Node.around(Node.java:137)
20:22:21 [2026-10-14T18:22:21.954Z] at org.junit.platform.engine.support.hierarchical.NodeTestTask.lambda$executeRecursively$9(NodeTestTask.java:144)
20:22:21 [2026-10-14T18:22:21.954Z] at org.junit.platform.engine.support.hierarchical.ThrowableCollector.execute(ThrowableCollector.java:73)
20:22:21 [2026-10-14T18:22:21.954Z] at org.junit.platform.engine.support.hierarchical.NodeTestTask.executeRecursively(NodeTestTask.java:143)
20:22:21 [2026-10-14T18:22:21.954Z] at org.junit.platform.engine.support.hierarchical.NodeTestTask.execute(NodeTestTask.java:100)
20:22:21 [2026-10-14T18:22:21.954Z] at java.base/java.util.ArrayList.forEach(ArrayList.java:1596)
20:22:21 [2026-10-14T18:22:21.954Z] at org.junit.platform.engine.support.hierarchical.SameThreadHierarchicalTestExecutorService.invokeAll(SameThreadHierarchicalTestExecutorService.java:41)
20:22:21 [2026-10-14T18:22:21.954Z] at org.junit.platform.engine.support.hierarchical.NodeTestTask.lambda$executeRecursively$6(NodeTestTask.java:160)
20:22:21 [2026-10-14T18:22:21.954Z] at org.junit.platform.engine.support.hierarchical.ThrowableCollector.execute(ThrowableCollector.java:73)
20:22:21 [2026-10-14T18:22:21.954Z] at org.junit.platform.engine.support.hierarchical.NodeTestTask.lambda$executeRecursively$8(NodeTestTask.java:146)
20:22:21 [2026-10-14T18:22:21.954Z] at org.junit.platform.engine.support.hierarchical.Node.around(Node.java:137)
20:22:21 [2026-10-14T18:22:21.954Z] at org.junit.platform.engine.support.hierarchical.NodeTestTask.lambda$executeRecursively$9(NodeTestTask.java:144)
20:22:21 [2026-10-14T18:22:21.954Z] at org.junit.platform.engine.support.hierarchical.ThrowableCollector.execute(ThrowableCollector.java:73)
20:22:21 [2026-10-14T18:22:21.954Z] at org.junit.platform.engine.support.hierarchical.NodeTestTask.executeRecursively(NodeTestTask.java:143)
20:22:21 [2026-10-14T18:22:21.954Z] at org.junit.platform.engine.support.hierarchical.NodeTestTask.execute(NodeTestTask.java:100)
20:22:21 [2026-10-14T18:22:21.954Z] at java.base/java.util.ArrayList.forEach(ArrayList.java:1596)
20:22:21 [2026-10-14T18:22:21.954Z] at org.junit.platform.engine.support.hierarchical.SameThreadHierarchicalTestExecutorService.invokeAll(SameThreadHierarchicalTestExecutorService.java:41)
20:22:21 [2026-10-14T18:22:21.954Z] at org.junit.platform.engine.support.hierarchical.NodeTestTask.lambda$executeRecursively$6(NodeTestTask.java:160)
20:22:21 [2026-10-14T18:22:21.954Z] at org.junit.platform.engine.support.hierarchical.ThrowableCollector.execute(ThrowableCollector.java:73)
20:22:21 [2026-10-14T18:22:21.954Z] at org.junit.platform.engine.support.hierarchical.NodeTestTask.lambda$executeRecursively$8(NodeTestTask.java:146)
20:22:21 [2026-10-14T18:22:21.954Z] at org.junit.platform.engine.support.hierarchical.Node.around(Node.java:137)
20:22:21 [2026-10-14T18:22:21.954Z] at org.junit.platform.engine.support.hierarchical.NodeTestTask.lambda$executeRecursively$9(NodeTestTask.java:144)
20:22:21 [2026-10-14T18:22:21.954Z] at org.junit.platform.engine.support.hierarchical.ThrowableCollector.execute(ThrowableCollector.java:73)
20:22:21 [2026-10-14T18:22:21.954Z] at org.junit.platform.engine.support.hierarchical.NodeTestTask.executeRecursively(NodeTestTask.java:143)
20:22:21 [2026-10-14T18:22:21.954Z] at org.junit.platform.engine.support.hierarchical.NodeTestTask.execute(NodeTestTask.java:100)
20:22:21 [2026-10-14T18:22:21.954Z] at org.junit.platform.engine.support.hierarchical.SameThreadHierarchicalTestExecutorService.submit(SameThreadHierarchicalTestExecutorService.java:35)
20:22:21 [2026-10-14T18:22:21.954Z] at org.junit.platform.engine.support.hierarchical.HierarchicalTestExecutor.execute(HierarchicalTestExecutor.java:57)
20:22:21 [2026-10-14T18:22:21.954Z] at org.junit.platform.engine.support.hierarchical.HierarchicalTestEngine.execute(HierarchicalTestEngine.java:54)
20:22:21 [2026-10-14T18:22:21.954Z] at org.junit.platform.launcher.core.EngineExecutionOrchestrator.execute(EngineExecutionOrchestrator.java:198)
20:22:21 [2026-10-14T18:22:21.954Z] at org.junit.platform.launcher.core.EngineExecutionOrchestrator.execute(EngineExecutionOrchestrator.java:169)
20:22:21 [2026-10-14T18:22:21.954Z] at org.junit.platform.launcher.core.EngineExecutionOrchestrator.execute(EngineExecutionOrchestrator.java:93)
20:22:21 [2026-10-14T18:22:21.954Z] at org.junit.platform.launcher.core.EngineExecutionOrchestrator.lambda$execute$0(EngineExecutionOrchestrator.java:58)
20:22:21 [2026-10-14T18:22:21.954Z] at org.junit.platform.launcher.core.EngineExecutionOrchestrator.withInterceptedStreams(EngineExecutionOrchestrator.java:141)
20:22:21 [2026-10-14T18:22:21.954Z] at org.junit.platform.launcher.core.EngineExecutionOrchestrator.execute(EngineExecutionOrchestrator.java:57)
20:22:21 [2026-10-14T18:22:21.954Z] at org.junit.platform.launcher.core.DefaultLauncher.execute(DefaultLauncher.java:103)
20:22:21 [2026-10-14T18:22:21.954Z] at org.junit.platform.launcher.core.DefaultLauncher.execute(DefaultLauncher.java:85)
20:22:21 [2026-10-14T18:22:21.954Z] at org.junit.platform.launcher.core.DelegatingLauncher.execute(DelegatingLauncher.java:47)
20:22:21 [2026-10-14T18:22:21.954Z] at org.apache.maven.surefire.junitplatform.LazyLauncher.execute(LazyLauncher.java:56)
20:22:21 [2026-10-14T18:22:21.954Z] at org.apache.maven.surefire.junitplatform.JUnitPlatformProvider.execute(JUnitPlatformProvider.java:184)
20:22:21 [2026-10-14T18:22:21.954Z] at org.apache.maven.surefire.junitplatform.JUnitPlatformProvider.invokeAllTests(JUnitPlatformProvider.java:148)
20:22:21 [2026-10-14T18:22:21.954Z] at org.apache.maven.surefire.junitplatform.JUnitPlatformProvider.invoke(JUnitPlatformProvider.java:122)
20:22:21 [2026-10-14T18:22:21.954Z] at org.apache.maven.surefire.booter.ForkedBooter.runSuitesInProcess(ForkedBooter.java:385)
20:22:21 [2026-10-14T18:22:21.954Z] at org.apache.maven.surefire.booter.ForkedBooter.execute(ForkedBooter.java:162)
20:22:21 [2026-10-14T18:22:21.954Z] at org.apache.maven.surefire.booter.ForkedBooter.run(ForkedBooter.java:507)
20:22:21 [2026-10-14T18:22:21.954Z] at org.apache.maven.surefire.booter.ForkedBooter.main(ForkedBooter.java:495)
20:22:21 [2026-10-14T18:22:21.954Z]
20:22:21 [2026-10-14T18:22:21.954Z] oct. 14, 2026 8:22:21 PM org.silverpeas.kernel.logging.LoggerConfigurationManager loadAllConfigurationFiles
20:22:21 [2026-10-14T18:22:21.954Z] AVERTISSEMENT: No logging configuration files found for Silverpeas
20:22:22 [2026-10-14T18:22:22.505Z] [INFO] Tests run: 4, Failures: 0, Errors: 0, Skipped: 0, Time elapsed: 4.364 s -- in org.silverpeas.core.pdc.pdc.service.PdcSubscriptionsCheckOnDeletionTest
20:22:22 [2026-10-14T18:22:22.505Z] [INFO] Running org.silverpeas.core.pdc.pdc.service.PdcSubscribersAlertOnClassificationTest
20:22:22 [2026-10-14T18:22:22.505Z] [INFO] Tests run: 6, Failures: 0, Errors: 0, Skipped: 0, Time elapsed: 0.066 s -- in org.silverpeas.core.pdc.pdc.service.PdcSubscribersAlertOnClassificationTest
20:22:22 [2026-10-14T18:22:22.505Z] [INFO] Running org.silverpeas.core.pdc.pdc.service.PdcPertinentValuesFilteringTest
20:22:22 [2026-10-14T18:22:22.756Z] [INFO] Tests run: 3, Failures: 0, Errors: 0, Skipped: 0, Time elapsed: 0.202 s -- in org.silverpeas.core.pdc.pdc.service.PdcPertinentValuesFilteringTest
20:22:22 [2026-10-14T18:22:22.756Z] [INFO] Running org.silverpeas.core.pdc.subscription.service.PdcResourceClassificationUserNotificationTest
20:22:24 [2026-10-14T18:22:24.617Z] context [/classified_fr] 1:4 attribute thumbnail isn't defined
20:22:24 [2026-10-14T18:22:24.617Z] context [/classified_en] 1:4 attribute thumbnail isn't defined
20:22:24 [2026-10-14T18:22:24.617Z] context [/classified_de] 1:4 attribute thumbnail isn't defined
20:22:24 [2026-10-14T18:22:24.617Z] context [/classified_fr] 1:4 attribute thumbnail isn't defined
20:22:24 [2026-10-14T18:22:24.617Z] context [/classified_en] 1:4 attribute thumbnail isn't defined
20:22:24 [2026-10-14T18:22:24.617Z] context [/classified_en] 1:4 attribute thumbnail isn't defined
20:22:24 [2026-10-14T18:22:24.617Z] context [/classified_de] 1:4 attribute thumbnail isn't defined
20:22:24 [2026-10-14T18:22:24.617Z] context [/classified_fr] 1:4 attribute thumbnail isn't defined
20:22:24 [2026-10-14T18:22:24.617Z] context [/classified_en] 1:4 attribute thumbnail isn't defined
20:22:24 [2026-10-14T18:22:24.617Z] context [/classified_de] 1:4 attribute thumbnail isn't defined
20:22:24 [2026-10-14T18:22:24.617Z] oct. 14, 2026 8:22:24 PM org.silverpeas.kernel.logging.sys.SysLogger log
20:22:24 [2026-10-14T18:22:24.617Z] INFOS: No user or groups to notify!
20:22:24 [2026-10-14T18:22:24.617Z] context [/classified_de] 1:4 attribute thumbnail isn't defined
20:22:24 [2026-10-14T18:22:24.867Z] [ERROR] Tests run: 13, Failures: 1, Errors: 0, Skipped: 0, Time elapsed: 1.996 s <<< FAILURE! -- in org.silverpeas.core.pdc.subscription.service.PdcResourceClassificationUserNotificationTest
20:22:24 [2026-10-14T18:22:24.867Z] [ERROR] org.silverpeas.core.pdc.subscription.service.PdcResourceClassificationUserNotificationTest.theThumbnailOfTheClassifiedContributionIsCarriedByTheNotification(Path) -- Time elapsed: 1.420 s <<< FAILURE!
20:22:24 [2026-10-14T18:22:24.867Z] java.lang.AssertionError:
20:22:24 [2026-10-14T18:22:24.867Z]
20:22:24 [2026-10-14T18:22:24.867Z] Expected: a string containing "<img src=\"data:image/png;base64,iVBORw0KGgo=\""
20:22:24 [2026-10-14T18:22:24.867Z] but: was "<img style="margin:20px 0;" src="data:image/png;base64,iVBORw0KGgo=" alt="A contribution in fr" height="30"/> <br/><p>La contribution <b>A contribution in fr</b> vient d'être classée dans votre centre d'intérêt <b>Legal & <tax> watch</b>.</p><!--BEFORE_MESSAGE_FOOTER--><!--AFTER_MESSAGE_FOOTER-->"
20:22:24 [2026-10-14T18:22:24.867Z] at org.hamcrest.MatcherAssert.assertThat(MatcherAssert.java:20)
20:22:24 [2026-10-14T18:22:24.867Z] at org.hamcrest.MatcherAssert.assertThat(MatcherAssert.java:6)
20:22:24 [2026-10-14T18:22:24.867Z] at org.silverpeas.core.pdc.subscription.service.PdcResourceClassificationUserNotificationTest.theThumbnailOfTheClassifiedContributionIsCarriedByTheNotification(PdcResourceClassificationUserNotificationTest.java:281)
20:22:24 [2026-10-14T18:22:24.867Z] at java.base/java.lang.reflect.Method.invoke(Method.java:580)
20:22:24 [2026-10-14T18:22:24.867Z] at java.base/java.util.ArrayList.forEach(ArrayList.java:1596)
20:22:24 [2026-10-14T18:22:24.867Z] at java.base/java.util.ArrayList.forEach(ArrayList.java:1596)
20:22:24 [2026-10-14T18:22:24.867Z]
20:22:24 [2026-10-14T18:22:24.867Z] [INFO] Running org.silverpeas.core.pdc.subscription.service.PdcContributionSubscribersProviderTest
20:22:25 [2026-10-14T18:22:25.118Z] oct. 14, 2026 8:22:24 PM org.silverpeas.kernel.logging.sys.SysLogger log
20:22:25 [2026-10-14T18:22:25.118Z] GRAVE: Cannot get the subscribers on the PdC concerned by the contribution kmelia42:Publication:23
20:22:25 [2026-10-14T18:22:25.118Z] org.silverpeas.core.pdc.pdc.model.PdcException: failure
20:22:25 [2026-10-14T18:22:25.118Z] at org.silverpeas.core.pdc.subscription.service.PdcContributionSubscribersProvider.getClassificationOf(PdcContributionSubscribersProvider.java:104)
20:22:25 [2026-10-14T18:22:25.118Z] at org.silverpeas.core.pdc.subscription.service.PdcContributionSubscribersProvider.getSubscribersOf(PdcContributionSubscribersProvider.java:73)
20:22:25 [2026-10-14T18:22:25.118Z] at org.silverpeas.core.pdc.subscription.service.PdcContributionSubscribersProviderTest.nobodyIsConcernedWhenThePdcFails(PdcContributionSubscribersProviderTest.java:186)
20:22:25 [2026-10-14T18:22:25.118Z] at java.base/jdk.internal.reflect.DirectMethodHandleAccessor.invoke(DirectMethodHandleAccessor.java:103)
20:22:25 [2026-10-14T18:22:25.118Z] at java.base/java.lang.reflect.Method.invoke(Method.java:580)
20:22:25 [2026-10-14T18:22:25.118Z] at org.junit.platform.commons.util.ReflectionUtils.invokeMethod(ReflectionUtils.java:767)
20:22:25 [2026-10-14T18:22:25.118Z] at org.junit.jupiter.engine.execution.MethodInvocation.proceed(MethodInvocation.java:60)
20:22:25 [2026-10-14T18:22:25.118Z] at org.junit.jupiter.engine.execution.InvocationInterceptorChain$ValidatingInvocation.proceed(InvocationInterceptorChain.java:131)
20:22:25 [2026-10-14T18:22:25.118Z] at org.junit.jupiter.engine.extension.TimeoutExtension.intercept(TimeoutExtension.java:156)
20:22:25 [2026-10-14T18:22:25.118Z] at org.junit.jupiter.engine.extension.TimeoutExtension.interceptTestableMethod(TimeoutExtension.java:147)
20:22:25 [2026-10-14T18:22:25.118Z] at org.junit.jupiter.engine.extension.TimeoutExtension.interceptTestMethod(TimeoutExtension.java:86)
20:22:25 [2026-10-14T18:22:25.118Z] at org.junit.jupiter.engine.execution.InterceptingExecutableInvoker$ReflectiveInterceptorCall.lambda$ofVoidMethod$0(InterceptingExecutableInvoker.java:103)
20:22:25 [2026-10-14T18:22:25.118Z] at org.junit.jupiter.engine.execution.InterceptingExecutableInvoker.lambda$invoke$0(InterceptingExecutableInvoker.java:93)
20:22:25 [2026-10-14T18:22:25.118Z] at org.junit.jupiter.engine.execution.InvocationInterceptorChain$InterceptedInvocation.proceed(InvocationInterceptorChain.java:106)
20:22:25 [2026-10-14T18:22:25.118Z] at org.junit.jupiter.engine.execution.InvocationInterceptorChain.proceed(InvocationInterceptorChain.java:64)
20:22:25 [2026-10-14T18:22:25.118Z] at org.junit.jupiter.engine.execution.InvocationInterceptorChain.chainAndInvoke(InvocationInterceptorChain.java:45)
20:22:25 [2026-10-14T18:22:25.118Z] at org.junit.jupiter.engine.execution.InvocationInterceptorChain.invoke(InvocationInterceptorChain.java:37)
20:22:25 [2026-10-14T18:22:25.118Z] at org.junit.jupiter.engine.execution.InterceptingExecutableInvoker.invoke(InterceptingExecutableInvoker.java:92)
20:22:25 [2026-10-14T18:22:25.118Z] at org.junit.jupiter.engine.execution.InterceptingExecutableInvoker.invoke(InterceptingExecutableInvoker.java:86)
20:22:25 [2026-10-14T18:22:25.118Z] at org.junit.jupiter.engine.descriptor.TestMethodTestDescriptor.lambda$invokeTestMethod$8(TestMethodTestDescriptor.java:217)
20:22:25 [2026-10-14T18:22:25.118Z] at org.junit.platform.engine.support.hierarchical.ThrowableCollector.execute(ThrowableCollector.java:73)
20:22:25 [2026-10-14T18:22:25.118Z] at org.junit.jupiter.engine.descriptor.TestMethodTestDescriptor.invokeTestMethod(TestMethodTestDescriptor.java:213)
20:22:25 [2026-10-14T18:22:25.118Z] at org.junit.jupiter.engine.descriptor.TestMethodTestDescriptor.execute(TestMethodTestDescriptor.java:138)
20:22:25 [2026-10-14T18:22:25.118Z] at org.junit.jupiter.engine.descriptor.TestMethodTestDescriptor.execute(TestMethodTestDescriptor.java:68)
20:22:25 [2026-10-14T18:22:25.118Z] at org.junit.platform.engine.support.hierarchical.NodeTestTask.lambda$executeRecursively$6(NodeTestTask.java:156)
20:22:25 [2026-10-14T18:22:25.118Z] at org.junit.platform.engine.support.hierarchical.ThrowableCollector.execute(ThrowableCollector.java:73)
20:22:25 [2026-10-14T18:22:25.118Z] at org.junit.platform.engine.support.hierarchical.NodeTestTask.lambda$executeRecursively$8(NodeTestTask.java:146)
20:22:25 [2026-10-14T18:22:25.118Z] at org.junit.platform.engine.support.hierarchical.Node.around(Node.java:137)
20:22:25 [2026-10-14T18:22:25.118Z] at org.junit.platform.engine.support.hierarchical.NodeTestTask.lambda$executeRecursively$9(NodeTestTask.java:144)
20:22:25 [2026-10-14T18:22:25.118Z] at org.junit.platform.engine.support.hierarchical.ThrowableCollector.execute(ThrowableCollector.java:73)
20:22:25 [2026-10-14T18:22:25.118Z] at org.junit.platform.engine.support.hierarchical.NodeTestTask.executeRecursively(NodeTestTask.java:143)
20:22:25 [2026-10-14T18:22:25.118Z] at org.junit.platform.engine.support.hierarchical.NodeTestTask.execute(NodeTestTask.java:100)
20:22:25 [2026-10-14T18:22:25.118Z] at java.base/java.util.ArrayList.forEach(ArrayList.java:1596)
20:22:25 [2026-10-14T18:22:25.118Z] at org.junit.platform.engine.support.hierarchical.SameThreadHierarchicalTestExecutorService.invokeAll(SameThreadHierarchicalTestExecutorService.java:41)
20:22:25 [2026-10-14T18:22:25.118Z] at org.junit.platform.engine.support.hierarchical.NodeTestTask.lambda$executeRecursively$6(NodeTestTask.java:160)
20:22:25 [2026-10-14T18:22:25.118Z] at org.junit.platform.engine.support.hierarchical.ThrowableCollector.execute(ThrowableCollector.java:73)
20:22:25 [2026-10-14T18:22:25.118Z] at org.junit.platform.engine.support.hierarchical.NodeTestTask.lambda$executeRecursively$8(NodeTestTask.java:146)
20:22:25 [2026-10-14T18:22:25.118Z] at org.junit.platform.engine.support.hierarchical.Node.around(Node.java:137)
20:22:25 [2026-10-14T18:22:25.118Z] at org.junit.platform.engine.support.hierarchical.NodeTestTask.lambda$executeRecursively$9(NodeTestTask.java:144)
20:22:25 [2026-10-14T18:22:25.118Z] at org.junit.platform.engine.support.hierarchical.ThrowableCollector.execute(ThrowableCollector.java:73)
20:22:25 [2026-10-14T18:22:25.118Z] at org.junit.platform.engine.support.hierarchical.NodeTestTask.executeRecursively(NodeTestTask.java:143)
20:22:25 [2026-10-14T18:22:25.118Z] at org.junit.platform.engine.support.hierarchical.NodeTestTask.execute(NodeTestTask.java:100)
20:22:25 [2026-10-14T18:22:25.118Z] at java.base/java.util.ArrayList.forEach(ArrayList.java:1596)
20:22:25 [2026-10-14T18:22:25.118Z] at org.junit.platform.engine.support.hierarchical.SameThreadHierarchicalTestExecutorService.invokeAll(SameThreadHierarchicalTestExecutorService.java:41)
20:22:25 [2026-10-14T18:22:25.118Z] at org.junit.platform.engine.support.hierarchical.NodeTestTask.lambda$executeRecursively$6(NodeTestTask.java:160)
20:22:25 [2026-10-14T18:22:25.118Z] at org.junit.platform.engine.support.hierarchical.ThrowableCollector.execute(ThrowableCollector.java:73)
20:22:25 [2026-10-14T18:22:25.118Z] at org.junit.platform.engine.support.hierarchical.NodeTestTask.lambda$executeRecursively$8(NodeTestTask.java:146)
20:22:25 [2026-10-14T18:22:25.118Z] at org.junit.platform.engine.support.hierarchical.Node.around(Node.java:137)
20:22:25 [2026-10-14T18:22:25.118Z] at org.junit.platform.engine.support.hierarchical.NodeTestTask.lambda$executeRecursively$9(NodeTestTask.java:144)
20:22:25 [2026-10-14T18:22:25.118Z] at org.junit.platform.engine.support.hierarchical.ThrowableCollector.execute(ThrowableCollector.java:73)
20:22:25 [2026-10-14T18:22:25.118Z] at org.junit.platform.engine.support.hierarchical.NodeTestTask.executeRecursively(NodeTestTask.java:143)
20:22:25 [2026-10-14T18:22:25.118Z] at org.junit.platform.engine.support.hierarchical.NodeTestTask.execute(NodeTestTask.java:100)
20:22:25 [2026-10-14T18:22:25.118Z] at org.junit.platform.engine.support.hierarchical.SameThreadHierarchicalTestExecutorService.submit(SameThreadHierarchicalTestExecutorService.java:35)
20:22:25 [2026-10-14T18:22:25.118Z] at org.junit.platform.engine.support.hierarchical.HierarchicalTestExecutor.execute(HierarchicalTestExecutor.java:57)
20:22:25 [2026-10-14T18:22:25.118Z] at org.junit.platform.engine.support.hierarchical.HierarchicalTestEngine.execute(HierarchicalTestEngine.java:54)
20:22:25 [2026-10-14T18:22:25.118Z] at org.junit.platform.launcher.core.EngineExecutionOrchestrator.execute(EngineExecutionOrchestrator.java:198)
20:22:25 [2026-10-14T18:22:25.118Z] at org.junit.platform.launcher.core.EngineExecutionOrchestrator.execute(EngineExecutionOrchestrator.java:169)
20:22:25 [2026-10-14T18:22:25.118Z] at org.junit.platform.launcher.core.EngineExecutionOrchestrator.execute(EngineExecutionOrchestrator.java:93)
20:22:25 [2026-10-14T18:22:25.118Z] at org.junit.platform.launcher.core.EngineExecutionOrchestrator.lambda$execute$0(EngineExecutionOrchestrator.java:58)
20:22:25 [2026-10-14T18:22:25.118Z] at org.junit.platform.launcher.core.EngineExecutionOrchestrator.withInterceptedStreams(EngineExecutionOrchestrator.java:141)
20:22:25 [2026-10-14T18:22:25.118Z] at org.junit.platform.launcher.core.EngineExecutionOrchestrator.execute(EngineExecutionOrchestrator.java:57)
20:22:25 [2026-10-14T18:22:25.118Z] at org.junit.platform.launcher.core.DefaultLauncher.execute(DefaultLauncher.java:103)
20:22:25 [2026-10-14T18:22:25.118Z] at org.junit.platform.launcher.core.DefaultLauncher.execute(DefaultLauncher.java:85)
20:22:25 [2026-10-14T18:22:25.118Z] at org.junit.platform.launcher.core.DelegatingLauncher.execute(DelegatingLauncher.java:47)
20:22:25 [2026-10-14T18:22:25.118Z] at org.apache.maven.surefire.junitplatform.LazyLauncher.execute(LazyLauncher.java:56)
20:22:25 [2026-10-14T18:22:25.118Z] at org.apache.maven.surefire.junitplatform.JUnitPlatformProvider.execute(JUnitPlatformProvider.java:184)
20:22:25 [2026-10-14T18:22:25.118Z] at org.apache.maven.surefire.junitplatform.JUnitPlatformProvider.invokeAllTests(JUnitPlatformProvider.java:148)
20:22:25 [2026-10-14T18:22:25.118Z] at org.apache.maven.surefire.junitplatform.JUnitPlatformProvider.invoke(JUnitPlatformProvider.java:122)
20:22:25 [2026-10-14T18:22:25.118Z] at org.apache.maven.surefire.booter.ForkedBooter.runSuitesInProcess(ForkedBooter.java:385)
20:22:25 [2026-10-14T18:22:25.118Z] at org.apache.maven.surefire.booter.ForkedBooter.execute(ForkedBooter.java:162)
20:22:25 [2026-10-14T18:22:25.118Z] at org.apache.maven.surefire.booter.ForkedBooter.run(ForkedBooter.java:507)
20:22:25 [2026-10-14T18:22:25.118Z] at org.apache.maven.surefire.booter.ForkedBooter.main(ForkedBooter.java:495)
20:22:25 [2026-10-14T18:22:25.118Z]
20:22:25 [2026-10-14T18:22:25.118Z] oct. 14, 2026 8:22:24 PM org.silverpeas.kernel.logging.sys.SysLogger log
20:22:25 [2026-10-14T18:22:25.118Z] GRAVE: Cannot get the subscribers on the PdC concerned by the contribution kmelia42:Publication:23
20:22:25 [2026-10-14T18:22:25.118Z] org.silverpeas.core.contribution.contentcontainer.content.ContentManagerException: failure
20:22:25 [2026-10-14T18:22:25.118Z] at org.silverpeas.core.contribution.contentcontainer.content.ContentManagementEngine.getSilverContentId(ContentManagementEngine.java:364)
20:22:25 [2026-10-14T18:22:25.118Z] at org.silverpeas.core.pdc.subscription.service.PdcContributionSubscribersProvider.getClassificationOf(PdcContributionSubscribersProvider.java:98)
20:22:25 [2026-10-14T18:22:25.118Z] at org.silverpeas.core.pdc.subscription.service.PdcContributionSubscribersProvider.getSubscribersOf(PdcContributionSubscribersProvider.java:73)
20:22:25 [2026-10-14T18:22:25.118Z] at org.silverpeas.core.pdc.subscription.service.PdcContributionSubscribersProviderTest.nobodyIsConcernedWhenTheContentManagementFails(PdcContributionSubscribersProviderTest.java:194)
20:22:25 [2026-10-14T18:22:25.118Z] at java.base/jdk.internal.reflect.DirectMethodHandleAccessor.invoke(DirectMethodHandleAccessor.java:103)
20:22:25 [2026-10-14T18:22:25.118Z] at java.base/java.lang.reflect.Method.invoke(Method.java:580)
20:22:25 [2026-10-14T18:22:25.118Z] at org.junit.platform.commons.util.ReflectionUtils.invokeMethod(ReflectionUtils.java:767)
20:22:25 [2026-10-14T18:22:25.118Z] at org.junit.jupiter.engine.execution.MethodInvocation.proceed(MethodInvocation.java:60)
20:22:25 [2026-10-14T18:22:25.118Z] at org.junit.jupiter.engine.execution.InvocationInterceptorChain$ValidatingInvocation.proceed(InvocationInterceptorChain.java:131)
20:22:25 [2026-10-14T18:22:25.118Z] at org.junit.jupiter.engine.extension.TimeoutExtension.intercept(TimeoutExtension.java:156)
20:22:25 [2026-10-14T18:22:25.118Z] at org.junit.jupiter.engine.extension.TimeoutExtension.interceptTestableMethod(TimeoutExtension.java:147)
20:22:25 [2026-10-14T18:22:25.118Z] at org.junit.jupiter.engine.extension.TimeoutExtension.interceptTestMethod(TimeoutExtension.java:86)
20:22:25 [2026-10-14T18:22:25.118Z] at org.junit.jupiter.engine.execution.InterceptingExecutableInvoker$ReflectiveInterceptorCall.lambda$ofVoidMethod$0(InterceptingExecutableInvoker.java:103)
20:22:25 [2026-10-14T18:22:25.118Z] at org.junit.jupiter.engine.execution.InterceptingExecutableInvoker.lambda$invoke$0(InterceptingExecutableInvoker.java:93)
20:22:25 [2026-10-14T18:22:25.118Z] at org.junit.jupiter.engine.execution.InvocationInterceptorChain$InterceptedInvocation.proceed(InvocationInterceptorChain.java:106)
20:22:25 [2026-10-14T18:22:25.118Z] at org.junit.jupiter.engine.execution.InvocationInterceptorChain.proceed(InvocationInterceptorChain.java:64)
20:22:25 [2026-10-14T18:22:25.118Z] at org.junit.jupiter.engine.execution.InvocationInterceptorChain.chainAndInvoke(InvocationInterceptorChain.java:45)
20:22:25 [2026-10-14T18:22:25.118Z] at org.junit.jupiter.engine.execution.InvocationInterceptorChain.invoke(InvocationInterceptorChain.java:37)
20:22:25 [2026-10-14T18:22:25.118Z] at org.junit.jupiter.engine.execution.InterceptingExecutableInvoker.invoke(InterceptingExecutableInvoker.java:92)
20:22:25 [2026-10-14T18:22:25.118Z] at org.junit.jupiter.engine.execution.InterceptingExecutableInvoker.invoke(InterceptingExecutableInvoker.java:86)
20:22:25 [2026-10-14T18:22:25.118Z] at org.junit.jupiter.engine.descriptor.TestMethodTestDescriptor.lambda$invokeTestMethod$8(TestMethodTestDescriptor.java:217)
20:22:25 [2026-10-14T18:22:25.118Z] at org.junit.platform.engine.support.hierarchical.ThrowableCollector.execute(ThrowableCollector.java:73)
20:22:25 [2026-10-14T18:22:25.118Z] at org.junit.jupiter.engine.descriptor.TestMethodTestDescriptor.invokeTestMethod(TestMethodTestDescriptor.java:213)
20:22:25 [2026-10-14T18:22:25.118Z] at org.junit.jupiter.engine.descriptor.TestMethodTestDescriptor.execute(TestMethodTestDescriptor.java:138)
20:22:25 [2026-10-14T18:22:25.118Z] at org.junit.jupiter.engine.descriptor.TestMethodTestDescriptor.execute(TestMethodTestDescriptor.java:68)
20:22:25 [2026-10-14T18:22:25.118Z] at org.junit.platform.engine.support.hierarchical.NodeTestTask.lambda$executeRecursively$6(NodeTestTask.java:156)
20:22:25 [2026-10-14T18:22:25.118Z] at org.junit.platform.engine.support.hierarchical.ThrowableCollector.execute(ThrowableCollector.java:73)
20:22:25 [2026-10-14T18:22:25.118Z] at org.junit.platform.engine.support.hierarchical.NodeTestTask.lambda$executeRecursively$8(NodeTestTask.java:146)
20:22:25 [2026-10-14T18:22:25.118Z] at org.junit.platform.engine.support.hierarchical.Node.around(Node.java:137)
20:22:25 [2026-10-14T18:22:25.118Z] at org.junit.platform.engine.support.hierarchical.NodeTestTask.lambda$executeRecursively$9(NodeTestTask.java:144)
20:22:25 [2026-10-14T18:22:25.118Z] at org.junit.platform.engine.support.hierarchical.ThrowableCollector.execute(ThrowableCollector.java:73)
20:22:25 [2026-10-14T18:22:25.118Z] at org.junit.platform.engine.support.hierarchical.NodeTestTask.executeRecursively(NodeTestTask.java:143)
20:22:25 [2026-10-14T18:22:25.118Z] at org.junit.platform.engine.support.hierarchical.NodeTestTask.execute(NodeTestTask.java:100)
20:22:25 [2026-10-14T18:22:25.118Z] at java.base/java.util.ArrayList.forEach(ArrayList.java:1596)
20:22:25 [2026-10-14T18:22:25.118Z] at org.junit.platform.engine.support.hierarchical.SameThreadHierarchicalTestExecutorService.invokeAll(SameThreadHierarchicalTestExecutorService.java:41)
20:22:25 [2026-10-14T18:22:25.118Z] at org.junit.platform.engine.support.hierarchical.NodeTestTask.lambda$executeRecursively$6(NodeTestTask.java:160)
20:22:25 [2026-10-14T18:22:25.118Z] at org.junit.platform.engine.support.hierarchical.ThrowableCollector.execute(ThrowableCollector.java:73)
20:22:25 [2026-10-14T18:22:25.118Z] at org.junit.platform.engine.support.hierarchical.NodeTestTask.lambda$executeRecursively$8(NodeTestTask.java:146)
20:22:25 [2026-10-14T18:22:25.118Z] at org.junit.platform.engine.support.hierarchical.Node.around(Node.java:137)
20:22:25 [2026-10-14T18:22:25.118Z] at org.junit.platform.engine.support.hierarchical.NodeTestTask.lambda$executeRecursively$9(NodeTestTask.java:144)
20:22:25 [2026-10-14T18:22:25.118Z] at org.junit.platform.engine.support.hierarchical.ThrowableCollector.execute(ThrowableCollector.java:73)
20:22:25 [2026-10-14T18:22:25.118Z] at org.junit.platform.engine.support.hierarchical.NodeTestTask.executeRecursively(NodeTestTask.java:143)
20:22:25 [2026-10-14T18:22:25.118Z] at org.junit.platform.engine.support.hierarchical.NodeTestTask.execute(NodeTestTask.java:100)
20:22:25 [2026-10-14T18:22:25.118Z] at java.base/java.util.ArrayList.forEach(ArrayList.java:1596)
20:22:25 [2026-10-14T18:22:25.118Z] at org.junit.platform.engine.support.hierarchical.SameThreadHierarchicalTestExecutorService.invokeAll(SameThreadHierarchicalTestExecutorService.java:41)
20:22:25 [2026-10-14T18:22:25.118Z] at org.junit.platform.engine.support.hierarchical.NodeTestTask.lambda$executeRecursively$6(NodeTestTask.java:160)
20:22:25 [2026-10-14T18:22:25.118Z] at org.junit.platform.engine.support.hierarchical.ThrowableCollector.execute(ThrowableCollector.java:73)
20:22:25 [2026-10-14T18:22:25.118Z] at org.junit.platform.engine.support.hierarchical.NodeTestTask.lambda$executeRecursively$8(NodeTestTask.java:146)
20:22:25 [2026-10-14T18:22:25.119Z] at org.junit.platform.engine.support.hierarchical.Node.around(Node.java:137)
20:22:25 [2026-10-14T18:22:25.119Z] at org.junit.platform.engine.support.hierarchical.NodeTestTask.lambda$executeRecursively$9(NodeTestTask.java:144)
20:22:25 [2026-10-14T18:22:25.119Z] at org.junit.platform.engine.support.hierarchical.ThrowableCollector.execute(ThrowableCollector.java:73)
20:22:25 [2026-10-14T18:22:25.119Z] at org.junit.platform.engine.support.hierarchical.NodeTestTask.executeRecursively(NodeTestTask.java:143)
20:22:25 [2026-10-14T18:22:25.119Z] at org.junit.platform.engine.support.hierarchical.NodeTestTask.execute(NodeTestTask.java:100)
20:22:25 [2026-10-14T18:22:25.119Z] at org.junit.platform.engine.support.hierarchical.SameThreadHierarchicalTestExecutorService.submit(SameThreadHierarchicalTestExecutorService.java:35)
20:22:25 [2026-10-14T18:22:25.119Z] at org.junit.platform.engine.support.hierarchical.HierarchicalTestExecutor.execute(HierarchicalTestExecutor.java:57)
20:22:25 [2026-10-14T18:22:25.119Z] at org.junit.platform.engine.support.hierarchical.HierarchicalTestEngine.execute(HierarchicalTestEngine.java:54)
20:22:25 [2026-10-14T18:22:25.119Z] at org.junit.platform.launcher.core.EngineExecutionOrchestrator.execute(EngineExecutionOrchestrator.java:198)
20:22:25 [2026-10-14T18:22:25.119Z] at org.junit.platform.launcher.core.EngineExecutionOrchestrator.execute(EngineExecutionOrchestrator.java:169)
20:22:25 [2026-10-14T18:22:25.119Z] at org.junit.platform.launcher.core.EngineExecutionOrchestrator.execute(EngineExecutionOrchestrator.java:93)
20:22:25 [2026-10-14T18:22:25.119Z] at org.junit.platform.launcher.core.EngineExecutionOrchestrator.lambda$execute$0(EngineExecutionOrchestrator.java:58)
20:22:25 [2026-10-14T18:22:25.119Z] at org.junit.platform.launcher.core.EngineExecutionOrchestrator.withInterceptedStreams(EngineExecutionOrchestrator.java:141)
20:22:25 [2026-10-14T18:22:25.119Z] at org.junit.platform.launcher.core.EngineExecutionOrchestrator.execute(EngineExecutionOrchestrator.java:57)
20:22:25 [2026-10-14T18:22:25.119Z] at org.junit.platform.launcher.core.DefaultLauncher.execute(DefaultLauncher.java:103)
20:22:25 [2026-10-14T18:22:25.119Z] at org.junit.platform.launcher.core.DefaultLauncher.execute(DefaultLauncher.java:85)
20:22:25 [2026-10-14T18:22:25.119Z] at org.junit.platform.launcher.core.DelegatingLauncher.execute(DelegatingLauncher.java:47)
20:22:25 [2026-10-14T18:22:25.119Z] at org.apache.maven.surefire.junitplatform.LazyLauncher.execute(LazyLauncher.java:56)
20:22:25 [2026-10-14T18:22:25.119Z] at org.apache.maven.surefire.junitplatform.JUnitPlatformProvider.execute(JUnitPlatformProvider.java:184)
20:22:25 [2026-10-14T18:22:25.119Z] at org.apache.maven.surefire.junitplatform.JUnitPlatformProvider.invokeAllTests(JUnitPlatformProvider.java:148)
20:22:25 [2026-10-14T18:22:25.119Z] at org.apache.maven.surefire.junitplatform.JUnitPlatformProvider.invoke(JUnitPlatformProvider.java:122)
20:22:25 [2026-10-14T18:22:25.119Z] at org.apache.maven.surefire.booter.ForkedBooter.runSuitesInProcess(ForkedBooter.java:385)
20:22:25 [2026-10-14T18:22:25.119Z] at org.apache.maven.surefire.booter.ForkedBooter.execute(ForkedBooter.java:162)
20:22:25 [2026-10-14T18:22:25.119Z] at org.apache.maven.surefire.booter.ForkedBooter.run(ForkedBooter.java:507)
20:22:25 [2026-10-14T18:22:25.119Z] at org.apache.maven.surefire.booter.ForkedBooter.main(ForkedBooter.java:495)
20:22:25 [2026-10-14T18:22:25.119Z]
20:22:25 [2026-10-14T18:22:25.119Z] [INFO] Tests run: 9, Failures: 0, Errors: 0, Skipped: 0, Time elapsed: 0.302 s -- in org.silverpeas.core.pdc.subscription.service.PdcContributionSubscribersProviderTest
20:22:25 [2026-10-14T18:22:25.119Z] [INFO] Running org.silverpeas.core.pdc.subscription.service.PdcSubscribersNotificationTest
20:22:25 [2026-10-14T18:22:25.369Z] oct. 14, 2026 8:22:25 PM org.silverpeas.kernel.logging.sys.SysLogger log
20:22:25 [2026-10-14T18:22:25.369Z] AVERTISSEMENT: User 5 not allowed to see the content 1 024
20:22:25 [2026-10-14T18:22:25.619Z] [INFO] Tests run: 10, Failures: 0, Errors: 0, Skipped: 0, Time elapsed: 0.430 s -- in org.silverpeas.core.pdc.subscription.service.PdcSubscribersNotificationTest
20:22:25 [2026-10-14T18:22:25.619Z] [INFO] Running org.silverpeas.core.pdc.subscription.service.DefaultPdcSubscriptionServiceTest
20:22:25 [2026-10-14T18:22:25.619Z] [INFO] Tests run: 17, Failures: 0, Errors: 0, Skipped: 0, Time elapsed: 0.031 s -- in org.silverpeas.core.pdc.subscription.service.DefaultPdcSubscriptionServiceTest
20:22:25 [2026-10-14T18:22:25.619Z] [INFO]
20:22:25 [2026-10-14T18:22:25.619Z] [INFO] Results:
20:22:25 [2026-10-14T18:22:25.619Z] [INFO]
20:22:25 [2026-10-14T18:22:25.619Z] [ERROR] Failures:
20:22:25 [2026-10-14T18:22:25.619Z] [ERROR] PdcResourceClassificationUserNotificationTest.theThumbnailOfTheClassifiedContributionIsCarriedByTheNotification:281
20:22:25 [2026-10-14T18:22:25.619Z] Expected: a string containing "<img src=\"data:image/png;base64,iVBORw0KGgo=\""
20:22:25 [2026-10-14T18:22:25.619Z] but: was "<img style="margin:20px 0;" src="data:image/png;base64,iVBORw0KGgo=" alt="A contribution in fr" height="30"/> <br/><p>La contribution <b>A contribution in fr</b> vient d'être classée dans votre centre d'intérêt <b>Legal & <tax> watch</b>.</p><!--BEFORE_MESSAGE_FOOTER--><!--AFTER_MESSAGE_FOOTER-->"
20:22:25 [2026-10-14T18:22:25.619Z] [INFO]
20:22:25 [2026-10-14T18:22:25.619Z] [ERROR] Tests run: 62, Failures: 1, Errors: 0, Skipped: 0
20:22:25 [2026-10-14T18:22:25.619Z] [INFO]
20:22:25 [2026-10-14T18:22:25.619Z] [INFO] ------------------------------------------------------------------------
20:22:25 [2026-10-14T18:22:25.619Z] [INFO] Reactor Summary for Silverpeas Core 6.5-build261014:
20:22:25 [2026-10-14T18:22:25.619Z] [INFO]
20:22:25 [2026-10-14T18:22:25.619Z] [INFO] Silverpeas Core .................................... SUCCESS [ 37.387 s]
20:22:25 [2026-10-14T18:22:25.619Z] [INFO] Silverpeas Core Configuration 6.5-build261014 ...... SUCCESS [ 9.247 s]
20:22:25 [2026-10-14T18:22:25.619Z] [INFO] Silverpeas Core Api 6.5-build261014 ................ SUCCESS [01:13 min]
20:22:25 [2026-10-14T18:22:25.619Z] [INFO] Silverpeas Core Test 6.5-build261014 ............... SUCCESS [ 12.535 s]
20:22:25 [2026-10-14T18:22:25.619Z] [INFO] Silverpeas Core JCR Provider 6.5-build261014 ....... SUCCESS [ 42.806 s]
20:22:25 [2026-10-14T18:22:25.619Z] [INFO] Silverpeas Core Library 6.5-build261014 ............ SUCCESS [49:27 min]
20:22:25 [2026-10-14T18:22:25.619Z] [INFO] Silverpeas Core Services 6.5-build261014 ........... SUCCESS [ 0.186 s]
20:22:25 [2026-10-14T18:22:25.619Z] [INFO] Silverpeas Tagcloud Service 6.5-build261014 ........ SUCCESS [ 5.878 s]
20:22:25 [2026-10-14T18:22:25.619Z] [INFO] Silverpeas Statistics Service 6.5-build261014 ...... SUCCESS [01:55 min]
20:22:25 [2026-10-14T18:22:25.619Z] [INFO] Silverpeas Contact Service 6.5-build261014 ......... SUCCESS [ 4.986 s]
20:22:25 [2026-10-14T18:22:25.619Z] [INFO] Silverpeas Personal Calendar Service 6.5-build261014 SUCCESS [01:19 min]
20:22:25 [2026-10-14T18:22:25.619Z] [INFO] Silverpeas Commenting Engine 6.5-build261014 ....... SUCCESS [01:52 min]
20:22:25 [2026-10-14T18:22:25.620Z] [INFO] Silverpeas PdC Engine 6.5-build261014 .............. FAILURE [ 12.232 s]
20:22:25 [2026-10-14T18:22:25.620Z] [INFO] Silverpeas My Links API 6.5-build261014 ............ SKIPPED
20:22:25 [2026-10-14T18:22:25.620Z] [INFO] Silverpeas Questions/Answers Container API 6.5-build261014 SKIPPED
20:22:25 [2026-10-14T18:22:25.620Z] [INFO] Silverpeas ImportExport Engine 6.5-build261014 ..... SKIPPED
20:22:25 [2026-10-14T18:22:25.620Z] [INFO] Silverpeas Document Viewer Service 6.5-build261014 . SKIPPED
20:22:25 [2026-10-14T18:22:25.620Z] [INFO] Silverpeas Workflow Engine 6.5-build261014 ......... SKIPPED
20:22:25 [2026-10-14T18:22:25.620Z] [INFO] Silverpeas Sharing Service 6.5-build261014 ......... SKIPPED
20:22:25 [2026-10-14T18:22:25.620Z] [INFO] Silverpeas Search Engine 6.5-build261014 ........... SKIPPED
20:22:25 [2026-10-14T18:22:25.620Z] [INFO] Silverpeas Chat Engine 6.5-build261014 ............. SKIPPED
20:22:25 [2026-10-14T18:22:25.620Z] [INFO] Silverpeas Document Templating Engine 6.5-build261014 SKIPPED
20:22:25 [2026-10-14T18:22:25.620Z] [INFO] Silverpeas Core JAX-RS API 6.5-build261014 ......... SKIPPED
20:22:25 [2026-10-14T18:22:25.620Z] [INFO] Silverpeas Core Web Test 6.5-build261014 ........... SKIPPED
20:22:25 [2026-10-14T18:22:25.620Z] [INFO] Silverpeas Core Web 6.5-build261014 ................ SKIPPED
20:22:25 [2026-10-14T18:22:25.620Z] [INFO] Silverpeas Core Web Archive 6.5-build261014 ........ SKIPPED
20:22:25 [2026-10-14T18:22:25.620Z] [INFO] ------------------------------------------------------------------------
20:22:25 [2026-10-14T18:22:25.620Z] [INFO] BUILD FAILURE
20:22:25 [2026-10-14T18:22:25.620Z] [INFO] ------------------------------------------------------------------------
20:22:25 [2026-10-14T18:22:25.620Z] [INFO] Total time: 57:54 min
20:22:25 [2026-10-14T18:22:25.620Z] [INFO] Finished at: 2026-10-14T20:22:25+02:00
20:22:25 [2026-10-14T18:22:25.620Z] [INFO] ------------------------------------------------------------------------
20:22:25 [2026-10-14T18:22:25.620Z] [ERROR] Failed to execute goal org.apache.maven.plugins:maven-surefire-plugin:3.5.2:test (default-test) on project silverpeas-core-pdc: There are test failures.
20:22:25 [2026-10-14T18:22:25.620Z] [ERROR]
20:22:25 [2026-10-14T18:22:25.620Z] [ERROR] See /var/lib/jenkins/workspace/Silverpeas_Master_AutoDeploy/Silverpeas-Core/core-services/pdc/target/surefire-reports for the individual test results.
20:22:25 [2026-10-14T18:22:25.620Z] [ERROR] See dump files (if any exist) [date].dump, [date]-jvmRun[N].dump and [date].dumpstream.
20:22:25 [2026-10-14T18:22:25.620Z] [ERROR] -> [Help 1]
20:22:25 [2026-10-14T18:22:25.620Z] [ERROR]
20:22:25 [2026-10-14T18:22:25.620Z] [ERROR] To see the full stack trace of the errors, re-run Maven with the -e switch.
20:22:25 [2026-10-14T18:22:25.620Z] [ERROR] Re-run Maven using the -X switch to enable full debug logging.
20:22:25 [2026-10-14T18:22:25.620Z] [ERROR]
20:22:25 [2026-10-14T18:22:25.620Z] [ERROR] For more information about the errors and possible solutions, please read the following articles:
20:22:25 [2026-10-14T18:22:25.620Z] [ERROR] [Help 1] http://cwiki.apache.org/confluence/display/MAVEN/MojoFailureException
20:22:25 [2026-10-14T18:22:25.620Z] [ERROR]
20:22:25 [2026-10-14T18:22:25.620Z] [ERROR] After correcting the problems, you can resume the build with the command
20:22:25 [2026-10-14T18:22:25.620Z] [ERROR] mvn <args> -rf :silverpeas-core-pdc