Console Output
Skipping 1 549 KB..
Full Log26-10-20T12:49:01.001Z] Progress (1): 3.4/9.0 MB
14:49:01 [2026-10-20T12:49:01.001Z] Progress (1): 3.4/9.0 MB
14:49:01 [2026-10-20T12:49:01.001Z] Progress (1): 3.4/9.0 MB
14:49:01 [2026-10-20T12:49:01.001Z] Progress (1): 3.4/9.0 MB
14:49:01 [2026-10-20T12:49:01.001Z] Progress (1): 3.4/9.0 MB
14:49:01 [2026-10-20T12:49:01.001Z] Progress (1): 3.4/9.0 MB
14:49:01 [2026-10-20T12:49:01.001Z] Progress (1): 3.4/9.0 MB
14:49:01 [2026-10-20T12:49:01.001Z] Progress (1): 3.4/9.0 MB
14:49:01 [2026-10-20T12:49:01.001Z] Progress (1): 3.4/9.0 MB
14:49:01 [2026-10-20T12:49:01.001Z] Progress (1): 3.4/9.0 MB
14:49:01 [2026-10-20T12:49:01.001Z] Progress (1): 3.4/9.0 MB
14:49:01 [2026-10-20T12:49:01.001Z] Progress (1): 3.4/9.0 MB
14:49:01 [2026-10-20T12:49:01.001Z] Progress (1): 3.4/9.0 MB
14:49:01 [2026-10-20T12:49:01.001Z] Progress (1): 3.4/9.0 MB
14:49:01 [2026-10-20T12:49:01.001Z] Progress (1): 3.4/9.0 MB
14:49:01 [2026-10-20T12:49:01.001Z] Progress (1): 3.4/9.0 MB
14:49:01 [2026-10-20T12:49:01.001Z] Progress (1): 3.5/9.0 MB
14:49:01 [2026-10-20T12:49:01.001Z] Progress (1): 3.5/9.0 MB
14:49:01 [2026-10-20T12:49:01.001Z] Progress (1): 3.5/9.0 MB
14:49:01 [2026-10-20T12:49:01.001Z] Progress (1): 3.5/9.0 MB
14:49:01 [2026-10-20T12:49:01.001Z] Progress (1): 3.5/9.0 MB
14:49:01 [2026-10-20T12:49:01.001Z] Progress (1): 3.5/9.0 MB
14:49:01 [2026-10-20T12:49:01.001Z] Progress (1): 3.5/9.0 MB
14:49:01 [2026-10-20T12:49:01.001Z] Progress (1): 3.5/9.0 MB
14:49:01 [2026-10-20T12:49:01.001Z] Progress (1): 3.5/9.0 MB
14:49:01 [2026-10-20T12:49:01.001Z] Progress (1): 3.5/9.0 MB
14:49:01 [2026-10-20T12:49:01.001Z] Progress (1): 3.5/9.0 MB
14:49:01 [2026-10-20T12:49:01.001Z] Progress (1): 3.5/9.0 MB
14:49:01 [2026-10-20T12:49:01.001Z] Progress (1): 3.5/9.0 MB
14:49:01 [2026-10-20T12:49:01.001Z] Progress (1): 3.5/9.0 MB
14:49:01 [2026-10-20T12:49:01.001Z] Progress (1): 3.5/9.0 MB
14:49:01 [2026-10-20T12:49:01.001Z] Progress (1): 3.5/9.0 MB
14:49:01 [2026-10-20T12:49:01.001Z] Progress (1): 3.5/9.0 MB
14:49:01 [2026-10-20T12:49:01.001Z] Progress (1): 3.5/9.0 MB
14:49:01 [2026-10-20T12:49:01.001Z] Progress (1): 3.5/9.0 MB
14:49:01 [2026-10-20T12:49:01.001Z] Progress (1): 3.6/9.0 MB
14:49:01 [2026-10-20T12:49:01.001Z] Progress (1): 3.6/9.0 MB
14:49:01 [2026-10-20T12:49:01.001Z] Progress (1): 3.6/9.0 MB
14:49:01 [2026-10-20T12:49:01.001Z] Progress (1): 3.6/9.0 MB
14:49:01 [2026-10-20T12:49:01.001Z] Progress (1): 3.6/9.0 MB
14:49:01 [2026-10-20T12:49:01.001Z] Progress (1): 3.6/9.0 MB
14:49:01 [2026-10-20T12:49:01.001Z] Progress (1): 3.6/9.0 MB
14:49:01 [2026-10-20T12:49:01.001Z] Progress (1): 3.6/9.0 MB
14:49:01 [2026-10-20T12:49:01.001Z] Progress (1): 3.6/9.0 MB
14:49:01 [2026-10-20T12:49:01.001Z] Progress (1): 3.6/9.0 MB
14:49:01 [2026-10-20T12:49:01.001Z] Progress (1): 3.6/9.0 MB
14:49:01 [2026-10-20T12:49:01.001Z] Progress (1): 3.6/9.0 MB
14:49:01 [2026-10-20T12:49:01.001Z] Progress (1): 3.6/9.0 MB
14:49:01 [2026-10-20T12:49:01.001Z] Progress (1): 3.6/9.0 MB
14:49:01 [2026-10-20T12:49:01.001Z] Progress (1): 3.6/9.0 MB
14:49:01 [2026-10-20T12:49:01.001Z] Progress (1): 3.6/9.0 MB
14:49:01 [2026-10-20T12:49:01.001Z] Progress (1): 3.6/9.0 MB
14:49:01 [2026-10-20T12:49:01.001Z] Progress (1): 3.7/9.0 MB
14:49:01 [2026-10-20T12:49:01.001Z] Progress (1): 3.7/9.0 MB
14:49:01 [2026-10-20T12:49:01.001Z] Progress (1): 3.7/9.0 MB
14:49:01 [2026-10-20T12:49:01.001Z] Progress (1): 3.7/9.0 MB
14:49:01 [2026-10-20T12:49:01.001Z] Progress (1): 3.7/9.0 MB
14:49:01 [2026-10-20T12:49:01.002Z] Progress (1): 3.7/9.0 MB
14:49:01 [2026-10-20T12:49:01.002Z] Progress (1): 3.7/9.0 MB
14:49:01 [2026-10-20T12:49:01.002Z] Progress (1): 3.7/9.0 MB
14:49:01 [2026-10-20T12:49:01.002Z] Progress (1): 3.7/9.0 MB
14:49:01 [2026-10-20T12:49:01.002Z] Progress (1): 3.7/9.0 MB
14:49:01 [2026-10-20T12:49:01.002Z] Progress (1): 3.7/9.0 MB
14:49:01 [2026-10-20T12:49:01.002Z] Progress (1): 3.7/9.0 MB
14:49:01 [2026-10-20T12:49:01.002Z] Progress (1): 3.7/9.0 MB
14:49:01 [2026-10-20T12:49:01.002Z] Progress (1): 3.7/9.0 MB
14:49:01 [2026-10-20T12:49:01.002Z] Progress (1): 3.7/9.0 MB
14:49:01 [2026-10-20T12:49:01.002Z] Progress (1): 3.7/9.0 MB
14:49:01 [2026-10-20T12:49:01.002Z] Progress (1): 3.7/9.0 MB
14:49:01 [2026-10-20T12:49:01.002Z] Progress (1): 3.7/9.0 MB
14:49:01 [2026-10-20T12:49:01.002Z] Progress (1): 3.7/9.0 MB
14:49:01 [2026-10-20T12:49:01.002Z] Progress (1): 3.8/9.0 MB
14:49:01 [2026-10-20T12:49:01.002Z] Progress (1): 3.8/9.0 MB
14:49:01 [2026-10-20T12:49:01.002Z] Progress (1): 3.8/9.0 MB
14:49:01 [2026-10-20T12:49:01.002Z] Progress (1): 3.8/9.0 MB
14:49:01 [2026-10-20T12:49:01.002Z] Progress (1): 3.8/9.0 MB
14:49:01 [2026-10-20T12:49:01.002Z] Progress (1): 3.8/9.0 MB
14:49:01 [2026-10-20T12:49:01.002Z] Progress (1): 3.8/9.0 MB
14:49:01 [2026-10-20T12:49:01.002Z] Progress (1): 3.8/9.0 MB
14:49:01 [2026-10-20T12:49:01.002Z] Progress (1): 3.8/9.0 MB
14:49:01 [2026-10-20T12:49:01.002Z] Progress (1): 3.8/9.0 MB
14:49:01 [2026-10-20T12:49:01.002Z] Progress (1): 3.8/9.0 MB
14:49:01 [2026-10-20T12:49:01.002Z] Progress (1): 3.8/9.0 MB
14:49:01 [2026-10-20T12:49:01.002Z] Progress (1): 3.8/9.0 MB
14:49:01 [2026-10-20T12:49:01.002Z] Progress (1): 3.8/9.0 MB
14:49:01 [2026-10-20T12:49:01.002Z] Progress (1): 3.8/9.0 MB
14:49:01 [2026-10-20T12:49:01.002Z] Progress (1): 3.8/9.0 MB
14:49:01 [2026-10-20T12:49:01.002Z] Progress (1): 3.8/9.0 MB
14:49:01 [2026-10-20T12:49:01.002Z] Progress (1): 3.8/9.0 MB
14:49:01 [2026-10-20T12:49:01.002Z] Progress (1): 3.9/9.0 MB
14:49:01 [2026-10-20T12:49:01.002Z] Progress (1): 3.9/9.0 MB
14:49:01 [2026-10-20T12:49:01.002Z] Progress (1): 3.9/9.0 MB
14:49:01 [2026-10-20T12:49:01.002Z] Progress (1): 3.9/9.0 MB
14:49:01 [2026-10-20T12:49:01.002Z] Progress (1): 3.9/9.0 MB
14:49:01 [2026-10-20T12:49:01.002Z] Progress (1): 3.9/9.0 MB
14:49:01 [2026-10-20T12:49:01.002Z] Progress (1): 3.9/9.0 MB
14:49:01 [2026-10-20T12:49:01.002Z] Progress (1): 3.9/9.0 MB
14:49:01 [2026-10-20T12:49:01.002Z] Progress (1): 3.9/9.0 MB
14:49:01 [2026-10-20T12:49:01.002Z] Progress (1): 3.9/9.0 MB
14:49:01 [2026-10-20T12:49:01.002Z] Progress (1): 3.9/9.0 MB
14:49:01 [2026-10-20T12:49:01.002Z] Progress (1): 3.9/9.0 MB
14:49:01 [2026-10-20T12:49:01.002Z] Progress (1): 3.9/9.0 MB
14:49:01 [2026-10-20T12:49:01.002Z] Progress (1): 3.9/9.0 MB
14:49:01 [2026-10-20T12:49:01.002Z] Progress (1): 3.9/9.0 MB
14:49:01 [2026-10-20T12:49:01.002Z] Progress (1): 3.9/9.0 MB
14:49:01 [2026-10-20T12:49:01.002Z] Progress (1): 3.9/9.0 MB
14:49:01 [2026-10-20T12:49:01.002Z] Progress (1): 3.9/9.0 MB
14:49:01 [2026-10-20T12:49:01.002Z] Progress (1): 3.9/9.0 MB
14:49:01 [2026-10-20T12:49:01.002Z] Progress (1): 4.0/9.0 MB
14:49:01 [2026-10-20T12:49:01.002Z] Progress (1): 4.0/9.0 MB
14:49:01 [2026-10-20T12:49:01.002Z] Progress (1): 4.0/9.0 MB
14:49:01 [2026-10-20T12:49:01.002Z] Progress (1): 4.0/9.0 MB
14:49:01 [2026-10-20T12:49:01.002Z] Progress (1): 4.0/9.0 MB
14:49:01 [2026-10-20T12:49:01.002Z] Progress (1): 4.0/9.0 MB
14:49:01 [2026-10-20T12:49:01.002Z] Progress (1): 4.0/9.0 MB
14:49:01 [2026-10-20T12:49:01.002Z] Progress (1): 4.0/9.0 MB
14:49:01 [2026-10-20T12:49:01.002Z] Progress (1): 4.0/9.0 MB
14:49:01 [2026-10-20T12:49:01.002Z] Progress (1): 4.0/9.0 MB
14:49:01 [2026-10-20T12:49:01.002Z] Progress (1): 4.0/9.0 MB
14:49:01 [2026-10-20T12:49:01.002Z] Progress (1): 4.0/9.0 MB
14:49:01 [2026-10-20T12:49:01.002Z] Progress (1): 4.0/9.0 MB
14:49:01 [2026-10-20T12:49:01.002Z] Progress (1): 4.0/9.0 MB
14:49:01 [2026-10-20T12:49:01.002Z] Progress (1): 4.0/9.0 MB
14:49:01 [2026-10-20T12:49:01.002Z] Progress (1): 4.0/9.0 MB
14:49:01 [2026-10-20T12:49:01.002Z] Progress (1): 4.0/9.0 MB
14:49:01 [2026-10-20T12:49:01.002Z] Progress (1): 4.0/9.0 MB
14:49:01 [2026-10-20T12:49:01.002Z] Progress (1): 4.1/9.0 MB
14:49:01 [2026-10-20T12:49:01.002Z] Progress (1): 4.1/9.0 MB
14:49:01 [2026-10-20T12:49:01.002Z] Progress (1): 4.1/9.0 MB
14:49:01 [2026-10-20T12:49:01.002Z] Progress (1): 4.1/9.0 MB
14:49:01 [2026-10-20T12:49:01.002Z] Progress (1): 4.1/9.0 MB
14:49:01 [2026-10-20T12:49:01.002Z] Progress (1): 4.1/9.0 MB
14:49:01 [2026-10-20T12:49:01.002Z] Progress (1): 4.1/9.0 MB
14:49:01 [2026-10-20T12:49:01.002Z] Progress (1): 4.1/9.0 MB
14:49:01 [2026-10-20T12:49:01.002Z] Progress (1): 4.1/9.0 MB
14:49:01 [2026-10-20T12:49:01.002Z] Progress (1): 4.1/9.0 MB
14:49:01 [2026-10-20T12:49:01.002Z] Progress (1): 4.1/9.0 MB
14:49:01 [2026-10-20T12:49:01.002Z] Progress (1): 4.1/9.0 MB
14:49:01 [2026-10-20T12:49:01.002Z] Progress (1): 4.1/9.0 MB
14:49:01 [2026-10-20T12:49:01.002Z] Progress (1): 4.1/9.0 MB
14:49:01 [2026-10-20T12:49:01.002Z] Progress (1): 4.1/9.0 MB
14:49:01 [2026-10-20T12:49:01.002Z] Progress (1): 4.1/9.0 MB
14:49:01 [2026-10-20T12:49:01.002Z] Progress (1): 4.1/9.0 MB
14:49:01 [2026-10-20T12:49:01.002Z] Progress (1): 4.1/9.0 MB
14:49:01 [2026-10-20T12:49:01.002Z] Progress (1): 4.2/9.0 MB
14:49:01 [2026-10-20T12:49:01.002Z] Progress (1): 4.2/9.0 MB
14:49:01 [2026-10-20T12:49:01.002Z] Progress (1): 4.2/9.0 MB
14:49:01 [2026-10-20T12:49:01.002Z] Progress (1): 4.2/9.0 MB
14:49:01 [2026-10-20T12:49:01.002Z] Progress (1): 4.2/9.0 MB
14:49:01 [2026-10-20T12:49:01.002Z] Progress (1): 4.2/9.0 MB
14:49:01 [2026-10-20T12:49:01.002Z] Progress (1): 4.2/9.0 MB
14:49:01 [2026-10-20T12:49:01.002Z] Progress (1): 4.2/9.0 MB
14:49:01 [2026-10-20T12:49:01.002Z] Progress (1): 4.2/9.0 MB
14:49:01 [2026-10-20T12:49:01.002Z] Progress (1): 4.2/9.0 MB
14:49:01 [2026-10-20T12:49:01.002Z] Progress (1): 4.2/9.0 MB
14:49:01 [2026-10-20T12:49:01.002Z] Progress (1): 4.2/9.0 MB
14:49:01 [2026-10-20T12:49:01.002Z] Progress (1): 4.2/9.0 MB
14:49:01 [2026-10-20T12:49:01.002Z] Progress (1): 4.2/9.0 MB
14:49:01 [2026-10-20T12:49:01.002Z] Progress (1): 4.2/9.0 MB
14:49:01 [2026-10-20T12:49:01.002Z] Progress (1): 4.2/9.0 MB
14:49:01 [2026-10-20T12:49:01.002Z] Progress (1): 4.2/9.0 MB
14:49:01 [2026-10-20T12:49:01.002Z] Progress (1): 4.2/9.0 MB
14:49:01 [2026-10-20T12:49:01.002Z] Progress (1): 4.3/9.0 MB
14:49:01 [2026-10-20T12:49:01.002Z] Progress (1): 4.3/9.0 MB
14:49:01 [2026-10-20T12:49:01.002Z] Progress (1): 4.3/9.0 MB
14:49:01 [2026-10-20T12:49:01.002Z] Progress (1): 4.3/9.0 MB
14:49:01 [2026-10-20T12:49:01.002Z] Progress (1): 4.3/9.0 MB
14:49:01 [2026-10-20T12:49:01.002Z] Progress (1): 4.3/9.0 MB
14:49:01 [2026-10-20T12:49:01.002Z] Progress (1): 4.3/9.0 MB
14:49:01 [2026-10-20T12:49:01.002Z] Progress (1): 4.3/9.0 MB
14:49:01 [2026-10-20T12:49:01.002Z] Progress (1): 4.3/9.0 MB
14:49:01 [2026-10-20T12:49:01.002Z] Progress (1): 4.3/9.0 MB
14:49:01 [2026-10-20T12:49:01.002Z] Progress (1): 4.3/9.0 MB
14:49:01 [2026-10-20T12:49:01.002Z] Progress (1): 4.3/9.0 MB
14:49:01 [2026-10-20T12:49:01.002Z] Progress (1): 4.3/9.0 MB
14:49:01 [2026-10-20T12:49:01.002Z] Progress (1): 4.3/9.0 MB
14:49:01 [2026-10-20T12:49:01.002Z] Progress (1): 4.3/9.0 MB
14:49:01 [2026-10-20T12:49:01.002Z] Progress (1): 4.3/9.0 MB
14:49:01 [2026-10-20T12:49:01.002Z] Progress (1): 4.3/9.0 MB
14:49:01 [2026-10-20T12:49:01.002Z] Progress (1): 4.3/9.0 MB
14:49:01 [2026-10-20T12:49:01.002Z] Progress (1): 4.3/9.0 MB
14:49:01 [2026-10-20T12:49:01.002Z] Progress (1): 4.4/9.0 MB
14:49:01 [2026-10-20T12:49:01.002Z] Progress (1): 4.4/9.0 MB
14:49:01 [2026-10-20T12:49:01.002Z] Progress (1): 4.4/9.0 MB
14:49:01 [2026-10-20T12:49:01.002Z] Progress (1): 4.4/9.0 MB
14:49:01 [2026-10-20T12:49:01.002Z] Progress (1): 4.4/9.0 MB
14:49:01 [2026-10-20T12:49:01.002Z] Progress (1): 4.4/9.0 MB
14:49:01 [2026-10-20T12:49:01.002Z] Progress (1): 4.4/9.0 MB
14:49:01 [2026-10-20T12:49:01.002Z] Progress (1): 4.4/9.0 MB
14:49:01 [2026-10-20T12:49:01.002Z] Progress (1): 4.4/9.0 MB
14:49:01 [2026-10-20T12:49:01.002Z] Progress (1): 4.4/9.0 MB
14:49:01 [2026-10-20T12:49:01.002Z] Progress (1): 4.4/9.0 MB
14:49:01 [2026-10-20T12:49:01.002Z] Progress (1): 4.4/9.0 MB
14:49:01 [2026-10-20T12:49:01.002Z] Progress (1): 4.4/9.0 MB
14:49:01 [2026-10-20T12:49:01.002Z] Progress (1): 4.4/9.0 MB
14:49:01 [2026-10-20T12:49:01.002Z] Progress (1): 4.4/9.0 MB
14:49:01 [2026-10-20T12:49:01.002Z] Progress (1): 4.4/9.0 MB
14:49:01 [2026-10-20T12:49:01.002Z] Progress (1): 4.4/9.0 MB
14:49:01 [2026-10-20T12:49:01.002Z] Progress (1): 4.4/9.0 MB
14:49:01 [2026-10-20T12:49:01.002Z] Progress (1): 4.5/9.0 MB
14:49:01 [2026-10-20T12:49:01.002Z] Progress (1): 4.5/9.0 MB
14:49:01 [2026-10-20T12:49:01.002Z] Progress (1): 4.5/9.0 MB
14:49:01 [2026-10-20T12:49:01.002Z] Progress (1): 4.5/9.0 MB
14:49:01 [2026-10-20T12:49:01.002Z] Progress (1): 4.5/9.0 MB
14:49:01 [2026-10-20T12:49:01.002Z] Progress (1): 4.5/9.0 MB
14:49:01 [2026-10-20T12:49:01.002Z] Progress (1): 4.5/9.0 MB
14:49:01 [2026-10-20T12:49:01.002Z] Progress (1): 4.5/9.0 MB
14:49:01 [2026-10-20T12:49:01.002Z] Progress (1): 4.5/9.0 MB
14:49:01 [2026-10-20T12:49:01.002Z] Progress (1): 4.5/9.0 MB
14:49:01 [2026-10-20T12:49:01.002Z] Progress (1): 4.5/9.0 MB
14:49:01 [2026-10-20T12:49:01.002Z] Progress (1): 4.5/9.0 MB
14:49:01 [2026-10-20T12:49:01.002Z] Progress (1): 4.5/9.0 MB
14:49:01 [2026-10-20T12:49:01.002Z] Progress (1): 4.5/9.0 MB
14:49:01 [2026-10-20T12:49:01.002Z] Progress (1): 4.5/9.0 MB
14:49:01 [2026-10-20T12:49:01.002Z] Progress (1): 4.5/9.0 MB
14:49:01 [2026-10-20T12:49:01.002Z] Progress (1): 4.5/9.0 MB
14:49:01 [2026-10-20T12:49:01.002Z] Progress (1): 4.5/9.0 MB
14:49:01 [2026-10-20T12:49:01.002Z] Progress (1): 4.5/9.0 MB
14:49:01 [2026-10-20T12:49:01.002Z] Progress (1): 4.6/9.0 MB
14:49:01 [2026-10-20T12:49:01.002Z] Progress (1): 4.6/9.0 MB
14:49:01 [2026-10-20T12:49:01.002Z] Progress (1): 4.6/9.0 MB
14:49:01 [2026-10-20T12:49:01.002Z] Progress (1): 4.6/9.0 MB
14:49:01 [2026-10-20T12:49:01.002Z] Progress (1): 4.6/9.0 MB
14:49:01 [2026-10-20T12:49:01.002Z] Progress (1): 4.6/9.0 MB
14:49:01 [2026-10-20T12:49:01.002Z] Progress (1): 4.6/9.0 MB
14:49:01 [2026-10-20T12:49:01.002Z] Progress (1): 4.6/9.0 MB
14:49:01 [2026-10-20T12:49:01.002Z] Progress (1): 4.6/9.0 MB
14:49:01 [2026-10-20T12:49:01.002Z] Progress (1): 4.6/9.0 MB
14:49:01 [2026-10-20T12:49:01.002Z] Progress (1): 4.6/9.0 MB
14:49:01 [2026-10-20T12:49:01.002Z] Progress (1): 4.6/9.0 MB
14:49:01 [2026-10-20T12:49:01.002Z] Progress (1): 4.6/9.0 MB
14:49:01 [2026-10-20T12:49:01.002Z] Progress (1): 4.6/9.0 MB
14:49:01 [2026-10-20T12:49:01.002Z] Progress (1): 4.6/9.0 MB
14:49:01 [2026-10-20T12:49:01.002Z] Progress (1): 4.6/9.0 MB
14:49:01 [2026-10-20T12:49:01.002Z] Progress (1): 4.6/9.0 MB
14:49:01 [2026-10-20T12:49:01.002Z] Progress (1): 4.6/9.0 MB
14:49:01 [2026-10-20T12:49:01.002Z] Progress (1): 4.7/9.0 MB
14:49:01 [2026-10-20T12:49:01.002Z] Progress (1): 4.7/9.0 MB
14:49:01 [2026-10-20T12:49:01.002Z] Progress (1): 4.7/9.0 MB
14:49:01 [2026-10-20T12:49:01.002Z] Progress (1): 4.7/9.0 MB
14:49:01 [2026-10-20T12:49:01.002Z] Progress (1): 4.7/9.0 MB
14:49:01 [2026-10-20T12:49:01.002Z] Progress (1): 4.7/9.0 MB
14:49:01 [2026-10-20T12:49:01.002Z] Progress (1): 4.7/9.0 MB
14:49:01 [2026-10-20T12:49:01.002Z] Progress (1): 4.7/9.0 MB
14:49:01 [2026-10-20T12:49:01.002Z] Progress (1): 4.7/9.0 MB
14:49:01 [2026-10-20T12:49:01.002Z] Progress (1): 4.7/9.0 MB
14:49:01 [2026-10-20T12:49:01.002Z] Progress (1): 4.7/9.0 MB
14:49:01 [2026-10-20T12:49:01.002Z] Progress (1): 4.7/9.0 MB
14:49:01 [2026-10-20T12:49:01.002Z] Progress (1): 4.7/9.0 MB
14:49:01 [2026-10-20T12:49:01.002Z] Progress (1): 4.7/9.0 MB
14:49:01 [2026-10-20T12:49:01.002Z] Progress (1): 4.7/9.0 MB
14:49:01 [2026-10-20T12:49:01.002Z] Progress (1): 4.7/9.0 MB
14:49:01 [2026-10-20T12:49:01.002Z] Progress (1): 4.7/9.0 MB
14:49:01 [2026-10-20T12:49:01.002Z] Progress (1): 4.7/9.0 MB
14:49:01 [2026-10-20T12:49:01.002Z] Progress (1): 4.7/9.0 MB
14:49:01 [2026-10-20T12:49:01.002Z] Progress (1): 4.8/9.0 MB
14:49:01 [2026-10-20T12:49:01.002Z] Progress (1): 4.8/9.0 MB
14:49:01 [2026-10-20T12:49:01.002Z] Progress (1): 4.8/9.0 MB
14:49:01 [2026-10-20T12:49:01.002Z] Progress (1): 4.8/9.0 MB
14:49:01 [2026-10-20T12:49:01.002Z] Progress (1): 4.8/9.0 MB
14:49:01 [2026-10-20T12:49:01.002Z] Progress (1): 4.8/9.0 MB
14:49:01 [2026-10-20T12:49:01.002Z] Progress (1): 4.8/9.0 MB
14:49:01 [2026-10-20T12:49:01.002Z] Progress (1): 4.8/9.0 MB
14:49:01 [2026-10-20T12:49:01.002Z] Progress (1): 4.8/9.0 MB
14:49:01 [2026-10-20T12:49:01.002Z] Progress (1): 4.8/9.0 MB
14:49:01 [2026-10-20T12:49:01.002Z] Progress (1): 4.8/9.0 MB
14:49:01 [2026-10-20T12:49:01.002Z] Progress (1): 4.8/9.0 MB
14:49:01 [2026-10-20T12:49:01.002Z] Progress (1): 4.8/9.0 MB
14:49:01 [2026-10-20T12:49:01.002Z] Progress (1): 4.8/9.0 MB
14:49:01 [2026-10-20T12:49:01.002Z] Progress (1): 4.8/9.0 MB
14:49:01 [2026-10-20T12:49:01.002Z] Progress (1): 4.8/9.0 MB
14:49:01 [2026-10-20T12:49:01.002Z] Progress (1): 4.8/9.0 MB
14:49:01 [2026-10-20T12:49:01.002Z] Progress (1): 4.8/9.0 MB
14:49:01 [2026-10-20T12:49:01.002Z] Progress (1): 4.8/9.0 MB
14:49:01 [2026-10-20T12:49:01.002Z] Progress (1): 4.9/9.0 MB
14:49:01 [2026-10-20T12:49:01.002Z] Progress (1): 4.9/9.0 MB
14:49:01 [2026-10-20T12:49:01.002Z] Progress (1): 4.9/9.0 MB
14:49:01 [2026-10-20T12:49:01.002Z] Progress (1): 4.9/9.0 MB
14:49:01 [2026-10-20T12:49:01.002Z] Progress (1): 4.9/9.0 MB
14:49:01 [2026-10-20T12:49:01.002Z] Progress (1): 4.9/9.0 MB
14:49:01 [2026-10-20T12:49:01.002Z] Progress (1): 4.9/9.0 MB
14:49:01 [2026-10-20T12:49:01.002Z] Progress (1): 4.9/9.0 MB
14:49:01 [2026-10-20T12:49:01.002Z] Progress (1): 4.9/9.0 MB
14:49:01 [2026-10-20T12:49:01.002Z] Progress (1): 4.9/9.0 MB
14:49:01 [2026-10-20T12:49:01.002Z] Progress (1): 4.9/9.0 MB
14:49:01 [2026-10-20T12:49:01.002Z] Progress (1): 4.9/9.0 MB
14:49:01 [2026-10-20T12:49:01.002Z] Progress (1): 4.9/9.0 MB
14:49:01 [2026-10-20T12:49:01.002Z] Progress (1): 4.9/9.0 MB
14:49:01 [2026-10-20T12:49:01.002Z] Progress (1): 4.9/9.0 MB
14:49:01 [2026-10-20T12:49:01.002Z] Progress (1): 4.9/9.0 MB
14:49:01 [2026-10-20T12:49:01.002Z] Progress (1): 4.9/9.0 MB
14:49:01 [2026-10-20T12:49:01.002Z] Progress (1): 4.9/9.0 MB
14:49:01 [2026-10-20T12:49:01.002Z] Progress (1): 4.9/9.0 MB
14:49:01 [2026-10-20T12:49:01.002Z] Progress (1): 5.0/9.0 MB
14:49:01 [2026-10-20T12:49:01.002Z] Progress (1): 5.0/9.0 MB
14:49:01 [2026-10-20T12:49:01.002Z] Progress (1): 5.0/9.0 MB
14:49:01 [2026-10-20T12:49:01.002Z] Progress (1): 5.0/9.0 MB
14:49:01 [2026-10-20T12:49:01.002Z] Progress (1): 5.0/9.0 MB
14:49:01 [2026-10-20T12:49:01.002Z] Progress (1): 5.0/9.0 MB
14:49:01 [2026-10-20T12:49:01.002Z] Progress (1): 5.0/9.0 MB
14:49:01 [2026-10-20T12:49:01.002Z] Progress (1): 5.0/9.0 MB
14:49:01 [2026-10-20T12:49:01.002Z] Progress (1): 5.0/9.0 MB
14:49:01 [2026-10-20T12:49:01.002Z] Progress (1): 5.0/9.0 MB
14:49:01 [2026-10-20T12:49:01.002Z] Progress (1): 5.0/9.0 MB
14:49:01 [2026-10-20T12:49:01.002Z] Progress (1): 5.0/9.0 MB
14:49:01 [2026-10-20T12:49:01.002Z] Progress (1): 5.0/9.0 MB
14:49:01 [2026-10-20T12:49:01.002Z] Progress (1): 5.0/9.0 MB
14:49:01 [2026-10-20T12:49:01.002Z] Progress (1): 5.0/9.0 MB
14:49:01 [2026-10-20T12:49:01.002Z] Progress (1): 5.0/9.0 MB
14:49:01 [2026-10-20T12:49:01.002Z] Progress (1): 5.0/9.0 MB
14:49:01 [2026-10-20T12:49:01.002Z] Progress (1): 5.0/9.0 MB
14:49:01 [2026-10-20T12:49:01.002Z] Progress (1): 5.1/9.0 MB
14:49:01 [2026-10-20T12:49:01.002Z] Progress (1): 5.1/9.0 MB
14:49:01 [2026-10-20T12:49:01.002Z] Progress (1): 5.1/9.0 MB
14:49:01 [2026-10-20T12:49:01.002Z] Progress (1): 5.1/9.0 MB
14:49:01 [2026-10-20T12:49:01.002Z] Progress (1): 5.1/9.0 MB
14:49:01 [2026-10-20T12:49:01.002Z] Progress (1): 5.1/9.0 MB
14:49:01 [2026-10-20T12:49:01.002Z] Progress (1): 5.1/9.0 MB
14:49:01 [2026-10-20T12:49:01.002Z] Progress (1): 5.1/9.0 MB
14:49:01 [2026-10-20T12:49:01.002Z] Progress (1): 5.1/9.0 MB
14:49:01 [2026-10-20T12:49:01.002Z] Progress (1): 5.1/9.0 MB
14:49:01 [2026-10-20T12:49:01.002Z] Progress (1): 5.1/9.0 MB
14:49:01 [2026-10-20T12:49:01.002Z] Progress (1): 5.1/9.0 MB
14:49:01 [2026-10-20T12:49:01.002Z] Progress (1): 5.1/9.0 MB
14:49:01 [2026-10-20T12:49:01.002Z] Progress (1): 5.1/9.0 MB
14:49:01 [2026-10-20T12:49:01.002Z] Progress (1): 5.1/9.0 MB
14:49:01 [2026-10-20T12:49:01.002Z] Progress (1): 5.1/9.0 MB
14:49:01 [2026-10-20T12:49:01.002Z] Progress (1): 5.1/9.0 MB
14:49:01 [2026-10-20T12:49:01.002Z] Progress (1): 5.1/9.0 MB
14:49:01 [2026-10-20T12:49:01.002Z] Progress (1): 5.2/9.0 MB
14:49:01 [2026-10-20T12:49:01.002Z] Progress (1): 5.2/9.0 MB
14:49:01 [2026-10-20T12:49:01.002Z] Progress (1): 5.2/9.0 MB
14:49:01 [2026-10-20T12:49:01.002Z] Progress (1): 5.2/9.0 MB
14:49:01 [2026-10-20T12:49:01.002Z] Progress (1): 5.2/9.0 MB
14:49:01 [2026-10-20T12:49:01.002Z] Progress (1): 5.2/9.0 MB
14:49:01 [2026-10-20T12:49:01.002Z] Progress (1): 5.2/9.0 MB
14:49:01 [2026-10-20T12:49:01.002Z] Progress (1): 5.2/9.0 MB
14:49:01 [2026-10-20T12:49:01.002Z] Progress (1): 5.2/9.0 MB
14:49:01 [2026-10-20T12:49:01.002Z] Progress (1): 5.2/9.0 MB
14:49:01 [2026-10-20T12:49:01.002Z] Progress (1): 5.2/9.0 MB
14:49:01 [2026-10-20T12:49:01.002Z] Progress (1): 5.2/9.0 MB
14:49:01 [2026-10-20T12:49:01.002Z] Progress (1): 5.2/9.0 MB
14:49:01 [2026-10-20T12:49:01.002Z] Progress (1): 5.2/9.0 MB
14:49:01 [2026-10-20T12:49:01.002Z] Progress (1): 5.2/9.0 MB
14:49:01 [2026-10-20T12:49:01.002Z] Progress (1): 5.2/9.0 MB
14:49:01 [2026-10-20T12:49:01.002Z] Progress (1): 5.2/9.0 MB
14:49:01 [2026-10-20T12:49:01.002Z] Progress (1): 5.2/9.0 MB
14:49:01 [2026-10-20T12:49:01.002Z] Progress (1): 5.3/9.0 MB
14:49:01 [2026-10-20T12:49:01.002Z] Progress (1): 5.3/9.0 MB
14:49:01 [2026-10-20T12:49:01.002Z] Progress (1): 5.3/9.0 MB
14:49:01 [2026-10-20T12:49:01.002Z] Progress (1): 5.3/9.0 MB
14:49:01 [2026-10-20T12:49:01.002Z] Progress (1): 5.3/9.0 MB
14:49:01 [2026-10-20T12:49:01.002Z] Progress (1): 5.3/9.0 MB
14:49:01 [2026-10-20T12:49:01.002Z] Progress (1): 5.3/9.0 MB
14:49:01 [2026-10-20T12:49:01.002Z] Progress (1): 5.3/9.0 MB
14:49:01 [2026-10-20T12:49:01.002Z] Progress (1): 5.3/9.0 MB
14:49:01 [2026-10-20T12:49:01.002Z] Progress (1): 5.3/9.0 MB
14:49:01 [2026-10-20T12:49:01.002Z] Progress (1): 5.3/9.0 MB
14:49:01 [2026-10-20T12:49:01.002Z] Progress (1): 5.3/9.0 MB
14:49:01 [2026-10-20T12:49:01.002Z] Progress (1): 5.3/9.0 MB
14:49:01 [2026-10-20T12:49:01.002Z] Progress (1): 5.3/9.0 MB
14:49:01 [2026-10-20T12:49:01.002Z] Progress (1): 5.3/9.0 MB
14:49:01 [2026-10-20T12:49:01.002Z] Progress (1): 5.3/9.0 MB
14:49:01 [2026-10-20T12:49:01.002Z] Progress (1): 5.3/9.0 MB
14:49:01 [2026-10-20T12:49:01.002Z] Progress (1): 5.3/9.0 MB
14:49:01 [2026-10-20T12:49:01.002Z] Progress (1): 5.3/9.0 MB
14:49:01 [2026-10-20T12:49:01.002Z] Progress (1): 5.4/9.0 MB
14:49:01 [2026-10-20T12:49:01.002Z] Progress (1): 5.4/9.0 MB
14:49:01 [2026-10-20T12:49:01.002Z] Progress (1): 5.4/9.0 MB
14:49:01 [2026-10-20T12:49:01.002Z] Progress (1): 5.4/9.0 MB
14:49:01 [2026-10-20T12:49:01.002Z] Progress (1): 5.4/9.0 MB
14:49:01 [2026-10-20T12:49:01.002Z] Progress (1): 5.4/9.0 MB
14:49:01 [2026-10-20T12:49:01.002Z] Progress (1): 5.4/9.0 MB
14:49:01 [2026-10-20T12:49:01.002Z] Progress (1): 5.4/9.0 MB
14:49:01 [2026-10-20T12:49:01.002Z] Progress (1): 5.4/9.0 MB
14:49:01 [2026-10-20T12:49:01.002Z] Progress (1): 5.4/9.0 MB
14:49:01 [2026-10-20T12:49:01.002Z] Progress (1): 5.4/9.0 MB
14:49:01 [2026-10-20T12:49:01.002Z] Progress (1): 5.4/9.0 MB
14:49:01 [2026-10-20T12:49:01.002Z] Progress (1): 5.4/9.0 MB
14:49:01 [2026-10-20T12:49:01.002Z] Progress (1): 5.4/9.0 MB
14:49:01 [2026-10-20T12:49:01.002Z] Progress (1): 5.4/9.0 MB
14:49:01 [2026-10-20T12:49:01.002Z] Progress (1): 5.4/9.0 MB
14:49:01 [2026-10-20T12:49:01.002Z] Progress (1): 5.4/9.0 MB
14:49:01 [2026-10-20T12:49:01.002Z] Progress (1): 5.4/9.0 MB
14:49:01 [2026-10-20T12:49:01.002Z] Progress (1): 5.5/9.0 MB
14:49:01 [2026-10-20T12:49:01.002Z] Progress (1): 5.5/9.0 MB
14:49:01 [2026-10-20T12:49:01.002Z] Progress (1): 5.5/9.0 MB
14:49:01 [2026-10-20T12:49:01.002Z] Progress (1): 5.5/9.0 MB
14:49:01 [2026-10-20T12:49:01.002Z] Progress (1): 5.5/9.0 MB
14:49:01 [2026-10-20T12:49:01.002Z] Progress (1): 5.5/9.0 MB
14:49:01 [2026-10-20T12:49:01.002Z] Progress (1): 5.5/9.0 MB
14:49:01 [2026-10-20T12:49:01.002Z] Progress (1): 5.5/9.0 MB
14:49:01 [2026-10-20T12:49:01.002Z] Progress (1): 5.5/9.0 MB
14:49:01 [2026-10-20T12:49:01.002Z] Progress (1): 5.5/9.0 MB
14:49:01 [2026-10-20T12:49:01.002Z] Progress (1): 5.5/9.0 MB
14:49:01 [2026-10-20T12:49:01.002Z] Progress (1): 5.5/9.0 MB
14:49:01 [2026-10-20T12:49:01.002Z] Progress (1): 5.5/9.0 MB
14:49:01 [2026-10-20T12:49:01.002Z] Progress (1): 5.5/9.0 MB
14:49:01 [2026-10-20T12:49:01.002Z] Progress (1): 5.5/9.0 MB
14:49:01 [2026-10-20T12:49:01.002Z] Progress (1): 5.5/9.0 MB
14:49:01 [2026-10-20T12:49:01.002Z] Progress (1): 5.5/9.0 MB
14:49:01 [2026-10-20T12:49:01.002Z] Progress (1): 5.5/9.0 MB
14:49:01 [2026-10-20T12:49:01.002Z] Progress (1): 5.5/9.0 MB
14:49:01 [2026-10-20T12:49:01.002Z] Progress (1): 5.6/9.0 MB
14:49:01 [2026-10-20T12:49:01.002Z] Progress (1): 5.6/9.0 MB
14:49:01 [2026-10-20T12:49:01.002Z] Progress (1): 5.6/9.0 MB
14:49:01 [2026-10-20T12:49:01.002Z] Progress (1): 5.6/9.0 MB
14:49:01 [2026-10-20T12:49:01.002Z] Progress (1): 5.6/9.0 MB
14:49:01 [2026-10-20T12:49:01.002Z] Progress (1): 5.6/9.0 MB
14:49:01 [2026-10-20T12:49:01.002Z] Progress (1): 5.6/9.0 MB
14:49:01 [2026-10-20T12:49:01.002Z] Progress (1): 5.6/9.0 MB
14:49:01 [2026-10-20T12:49:01.002Z] Progress (1): 5.6/9.0 MB
14:49:01 [2026-10-20T12:49:01.002Z] Progress (1): 5.6/9.0 MB
14:49:01 [2026-10-20T12:49:01.002Z] Progress (1): 5.6/9.0 MB
14:49:01 [2026-10-20T12:49:01.002Z] Progress (1): 5.6/9.0 MB
14:49:01 [2026-10-20T12:49:01.002Z] Progress (1): 5.6/9.0 MB
14:49:01 [2026-10-20T12:49:01.002Z] Progress (1): 5.6/9.0 MB
14:49:01 [2026-10-20T12:49:01.002Z] Progress (1): 5.6/9.0 MB
14:49:01 [2026-10-20T12:49:01.002Z] Progress (1): 5.6/9.0 MB
14:49:01 [2026-10-20T12:49:01.002Z] Progress (1): 5.6/9.0 MB
14:49:01 [2026-10-20T12:49:01.002Z] Progress (1): 5.7/9.0 MB
14:49:01 [2026-10-20T12:49:01.002Z] Progress (1): 5.7/9.0 MB
14:49:01 [2026-10-20T12:49:01.002Z] Progress (1): 5.7/9.0 MB
14:49:01 [2026-10-20T12:49:01.002Z] Progress (1): 5.7/9.0 MB
14:49:01 [2026-10-20T12:49:01.002Z] Progress (1): 5.7/9.0 MB
14:49:01 [2026-10-20T12:49:01.002Z] Progress (1): 5.7/9.0 MB
14:49:01 [2026-10-20T12:49:01.002Z] Progress (1): 5.7/9.0 MB
14:49:01 [2026-10-20T12:49:01.002Z] Progress (1): 5.7/9.0 MB
14:49:01 [2026-10-20T12:49:01.002Z] Progress (1): 5.7/9.0 MB
14:49:01 [2026-10-20T12:49:01.002Z] Progress (1): 5.7/9.0 MB
14:49:01 [2026-10-20T12:49:01.002Z] Progress (1): 5.7/9.0 MB
14:49:01 [2026-10-20T12:49:01.002Z] Progress (1): 5.7/9.0 MB
14:49:01 [2026-10-20T12:49:01.002Z] Progress (1): 5.7/9.0 MB
14:49:01 [2026-10-20T12:49:01.002Z] Progress (1): 5.7/9.0 MB
14:49:01 [2026-10-20T12:49:01.002Z] Progress (1): 5.7/9.0 MB
14:49:01 [2026-10-20T12:49:01.002Z] Progress (1): 5.7/9.0 MB
14:49:01 [2026-10-20T12:49:01.002Z] Progress (1): 5.7/9.0 MB
14:49:01 [2026-10-20T12:49:01.002Z] Progress (1): 5.7/9.0 MB
14:49:01 [2026-10-20T12:49:01.002Z] Progress (1): 5.7/9.0 MB
14:49:01 [2026-10-20T12:49:01.002Z] Progress (1): 5.8/9.0 MB
14:49:01 [2026-10-20T12:49:01.002Z] Progress (1): 5.8/9.0 MB
14:49:01 [2026-10-20T12:49:01.002Z] Progress (1): 5.8/9.0 MB
14:49:01 [2026-10-20T12:49:01.002Z] Progress (1): 5.8/9.0 MB
14:49:01 [2026-10-20T12:49:01.002Z] Progress (1): 5.8/9.0 MB
14:49:01 [2026-10-20T12:49:01.002Z] Progress (1): 5.8/9.0 MB
14:49:01 [2026-10-20T12:49:01.002Z] Progress (1): 5.8/9.0 MB
14:49:01 [2026-10-20T12:49:01.002Z] Progress (1): 5.8/9.0 MB
14:49:01 [2026-10-20T12:49:01.002Z] Progress (1): 5.8/9.0 MB
14:49:01 [2026-10-20T12:49:01.002Z] Progress (1): 5.8/9.0 MB
14:49:01 [2026-10-20T12:49:01.002Z] Progress (1): 5.8/9.0 MB
14:49:01 [2026-10-20T12:49:01.002Z] Progress (1): 5.8/9.0 MB
14:49:01 [2026-10-20T12:49:01.002Z] Progress (1): 5.8/9.0 MB
14:49:01 [2026-10-20T12:49:01.002Z] Progress (1): 5.8/9.0 MB
14:49:01 [2026-10-20T12:49:01.002Z] Progress (1): 5.8/9.0 MB
14:49:01 [2026-10-20T12:49:01.002Z] Progress (1): 5.8/9.0 MB
14:49:01 [2026-10-20T12:49:01.002Z] Progress (1): 5.8/9.0 MB
14:49:01 [2026-10-20T12:49:01.002Z] Progress (1): 5.8/9.0 MB
14:49:01 [2026-10-20T12:49:01.002Z] Progress (1): 5.8/9.0 MB
14:49:01 [2026-10-20T12:49:01.002Z] Progress (1): 5.9/9.0 MB
14:49:01 [2026-10-20T12:49:01.002Z] Progress (1): 5.9/9.0 MB
14:49:01 [2026-10-20T12:49:01.002Z] Progress (1): 5.9/9.0 MB
14:49:01 [2026-10-20T12:49:01.002Z] Progress (1): 5.9/9.0 MB
14:49:01 [2026-10-20T12:49:01.002Z] Progress (1): 5.9/9.0 MB
14:49:01 [2026-10-20T12:49:01.002Z] Progress (1): 5.9/9.0 MB
14:49:01 [2026-10-20T12:49:01.002Z] Progress (1): 5.9/9.0 MB
14:49:01 [2026-10-20T12:49:01.002Z] Progress (1): 5.9/9.0 MB
14:49:01 [2026-10-20T12:49:01.002Z] Progress (1): 5.9/9.0 MB
14:49:01 [2026-10-20T12:49:01.002Z] Progress (1): 5.9/9.0 MB
14:49:01 [2026-10-20T12:49:01.002Z] Progress (1): 5.9/9.0 MB
14:49:01 [2026-10-20T12:49:01.002Z] Progress (1): 5.9/9.0 MB
14:49:01 [2026-10-20T12:49:01.002Z] Progress (1): 5.9/9.0 MB
14:49:01 [2026-10-20T12:49:01.002Z] Progress (1): 5.9/9.0 MB
14:49:01 [2026-10-20T12:49:01.003Z] Progress (1): 5.9/9.0 MB
14:49:01 [2026-10-20T12:49:01.003Z] Progress (1): 5.9/9.0 MB
14:49:01 [2026-10-20T12:49:01.003Z] Progress (1): 5.9/9.0 MB
14:49:01 [2026-10-20T12:49:01.003Z] Progress (1): 5.9/9.0 MB
14:49:01 [2026-10-20T12:49:01.003Z] Progress (1): 6.0/9.0 MB
14:49:01 [2026-10-20T12:49:01.003Z] Progress (1): 6.0/9.0 MB
14:49:01 [2026-10-20T12:49:01.003Z] Progress (1): 6.0/9.0 MB
14:49:01 [2026-10-20T12:49:01.003Z] Progress (1): 6.0/9.0 MB
14:49:01 [2026-10-20T12:49:01.003Z] Progress (1): 6.0/9.0 MB
14:49:01 [2026-10-20T12:49:01.003Z] Progress (1): 6.0/9.0 MB
14:49:01 [2026-10-20T12:49:01.003Z] Progress (1): 6.0/9.0 MB
14:49:01 [2026-10-20T12:49:01.003Z] Progress (1): 6.0/9.0 MB
14:49:01 [2026-10-20T12:49:01.003Z] Progress (1): 6.0/9.0 MB
14:49:01 [2026-10-20T12:49:01.003Z] Progress (1): 6.0/9.0 MB
14:49:01 [2026-10-20T12:49:01.003Z] Progress (1): 6.0/9.0 MB
14:49:01 [2026-10-20T12:49:01.003Z] Progress (1): 6.0/9.0 MB
14:49:01 [2026-10-20T12:49:01.003Z] Progress (1): 6.0/9.0 MB
14:49:01 [2026-10-20T12:49:01.003Z] Progress (1): 6.0/9.0 MB
14:49:01 [2026-10-20T12:49:01.003Z] Progress (1): 6.0/9.0 MB
14:49:01 [2026-10-20T12:49:01.003Z] Progress (1): 6.0/9.0 MB
14:49:01 [2026-10-20T12:49:01.003Z] Progress (1): 6.0/9.0 MB
14:49:01 [2026-10-20T12:49:01.003Z] Progress (1): 6.0/9.0 MB
14:49:01 [2026-10-20T12:49:01.003Z] Progress (1): 6.1/9.0 MB
14:49:01 [2026-10-20T12:49:01.003Z] Progress (1): 6.1/9.0 MB
14:49:01 [2026-10-20T12:49:01.003Z] Progress (1): 6.1/9.0 MB
14:49:01 [2026-10-20T12:49:01.003Z] Progress (1): 6.1/9.0 MB
14:49:01 [2026-10-20T12:49:01.003Z] Progress (1): 6.1/9.0 MB
14:49:01 [2026-10-20T12:49:01.003Z] Progress (1): 6.1/9.0 MB
14:49:01 [2026-10-20T12:49:01.003Z] Progress (1): 6.1/9.0 MB
14:49:01 [2026-10-20T12:49:01.003Z] Progress (1): 6.1/9.0 MB
14:49:01 [2026-10-20T12:49:01.003Z] Progress (1): 6.1/9.0 MB
14:49:01 [2026-10-20T12:49:01.003Z] Progress (1): 6.1/9.0 MB
14:49:01 [2026-10-20T12:49:01.003Z] Progress (1): 6.1/9.0 MB
14:49:01 [2026-10-20T12:49:01.003Z] Progress (1): 6.1/9.0 MB
14:49:01 [2026-10-20T12:49:01.003Z] Progress (1): 6.1/9.0 MB
14:49:01 [2026-10-20T12:49:01.003Z] Progress (1): 6.1/9.0 MB
14:49:01 [2026-10-20T12:49:01.003Z] Progress (1): 6.1/9.0 MB
14:49:01 [2026-10-20T12:49:01.003Z] Progress (1): 6.1/9.0 MB
14:49:01 [2026-10-20T12:49:01.003Z] Progress (1): 6.1/9.0 MB
14:49:01 [2026-10-20T12:49:01.003Z] Progress (1): 6.1/9.0 MB
14:49:01 [2026-10-20T12:49:01.003Z] Progress (1): 6.2/9.0 MB
14:49:01 [2026-10-20T12:49:01.003Z] Progress (1): 6.2/9.0 MB
14:49:01 [2026-10-20T12:49:01.003Z] Progress (1): 6.2/9.0 MB
14:49:01 [2026-10-20T12:49:01.003Z] Progress (1): 6.2/9.0 MB
14:49:01 [2026-10-20T12:49:01.003Z] Progress (1): 6.2/9.0 MB
14:49:01 [2026-10-20T12:49:01.003Z] Progress (1): 6.2/9.0 MB
14:49:01 [2026-10-20T12:49:01.003Z] Progress (1): 6.2/9.0 MB
14:49:01 [2026-10-20T12:49:01.003Z] Progress (1): 6.2/9.0 MB
14:49:01 [2026-10-20T12:49:01.003Z] Progress (1): 6.2/9.0 MB
14:49:01 [2026-10-20T12:49:01.003Z] Progress (1): 6.2/9.0 MB
14:49:01 [2026-10-20T12:49:01.003Z] Progress (1): 6.2/9.0 MB
14:49:01 [2026-10-20T12:49:01.003Z] Progress (1): 6.2/9.0 MB
14:49:01 [2026-10-20T12:49:01.003Z] Progress (1): 6.2/9.0 MB
14:49:01 [2026-10-20T12:49:01.003Z] Progress (1): 6.2/9.0 MB
14:49:01 [2026-10-20T12:49:01.003Z] Progress (1): 6.2/9.0 MB
14:49:01 [2026-10-20T12:49:01.003Z] Progress (1): 6.2/9.0 MB
14:49:01 [2026-10-20T12:49:01.003Z] Progress (1): 6.2/9.0 MB
14:49:01 [2026-10-20T12:49:01.003Z] Progress (1): 6.2/9.0 MB
14:49:01 [2026-10-20T12:49:01.003Z] Progress (1): 6.3/9.0 MB
14:49:01 [2026-10-20T12:49:01.003Z] Progress (1): 6.3/9.0 MB
14:49:01 [2026-10-20T12:49:01.003Z] Progress (1): 6.3/9.0 MB
14:49:01 [2026-10-20T12:49:01.003Z] Progress (1): 6.3/9.0 MB
14:49:01 [2026-10-20T12:49:01.003Z] Progress (1): 6.3/9.0 MB
14:49:01 [2026-10-20T12:49:01.003Z] Progress (1): 6.3/9.0 MB
14:49:01 [2026-10-20T12:49:01.003Z] Progress (1): 6.3/9.0 MB
14:49:01 [2026-10-20T12:49:01.003Z] Progress (1): 6.3/9.0 MB
14:49:01 [2026-10-20T12:49:01.003Z] Progress (1): 6.3/9.0 MB
14:49:01 [2026-10-20T12:49:01.003Z] Progress (1): 6.3/9.0 MB
14:49:01 [2026-10-20T12:49:01.003Z] Progress (1): 6.3/9.0 MB
14:49:01 [2026-10-20T12:49:01.003Z] Progress (1): 6.3/9.0 MB
14:49:01 [2026-10-20T12:49:01.003Z] Progress (1): 6.3/9.0 MB
14:49:01 [2026-10-20T12:49:01.003Z] Progress (1): 6.3/9.0 MB
14:49:01 [2026-10-20T12:49:01.003Z] Progress (1): 6.3/9.0 MB
14:49:01 [2026-10-20T12:49:01.003Z] Progress (1): 6.3/9.0 MB
14:49:01 [2026-10-20T12:49:01.003Z] Progress (1): 6.3/9.0 MB
14:49:01 [2026-10-20T12:49:01.003Z] Progress (1): 6.3/9.0 MB
14:49:01 [2026-10-20T12:49:01.003Z] Progress (1): 6.3/9.0 MB
14:49:01 [2026-10-20T12:49:01.003Z] Progress (1): 6.4/9.0 MB
14:49:01 [2026-10-20T12:49:01.003Z] Progress (1): 6.4/9.0 MB
14:49:01 [2026-10-20T12:49:01.003Z] Progress (1): 6.4/9.0 MB
14:49:01 [2026-10-20T12:49:01.003Z] Progress (1): 6.4/9.0 MB
14:49:01 [2026-10-20T12:49:01.003Z] Progress (1): 6.4/9.0 MB
14:49:01 [2026-10-20T12:49:01.003Z] Progress (1): 6.4/9.0 MB
14:49:01 [2026-10-20T12:49:01.003Z] Progress (1): 6.4/9.0 MB
14:49:01 [2026-10-20T12:49:01.003Z] Progress (1): 6.4/9.0 MB
14:49:01 [2026-10-20T12:49:01.003Z] Progress (1): 6.4/9.0 MB
14:49:01 [2026-10-20T12:49:01.003Z] Progress (1): 6.4/9.0 MB
14:49:01 [2026-10-20T12:49:01.003Z] Progress (1): 6.4/9.0 MB
14:49:01 [2026-10-20T12:49:01.003Z] Progress (1): 6.4/9.0 MB
14:49:01 [2026-10-20T12:49:01.003Z] Progress (1): 6.4/9.0 MB
14:49:01 [2026-10-20T12:49:01.003Z] Progress (1): 6.4/9.0 MB
14:49:01 [2026-10-20T12:49:01.003Z] Progress (1): 6.4/9.0 MB
14:49:01 [2026-10-20T12:49:01.003Z] Progress (1): 6.4/9.0 MB
14:49:01 [2026-10-20T12:49:01.003Z] Progress (1): 6.4/9.0 MB
14:49:01 [2026-10-20T12:49:01.003Z] Progress (1): 6.4/9.0 MB
14:49:01 [2026-10-20T12:49:01.003Z] Progress (1): 6.5/9.0 MB
14:49:01 [2026-10-20T12:49:01.003Z] Progress (1): 6.5/9.0 MB
14:49:01 [2026-10-20T12:49:01.003Z] Progress (1): 6.5/9.0 MB
14:49:01 [2026-10-20T12:49:01.003Z] Progress (1): 6.5/9.0 MB
14:49:01 [2026-10-20T12:49:01.003Z] Progress (1): 6.5/9.0 MB
14:49:01 [2026-10-20T12:49:01.003Z] Progress (1): 6.5/9.0 MB
14:49:01 [2026-10-20T12:49:01.003Z] Progress (1): 6.5/9.0 MB
14:49:01 [2026-10-20T12:49:01.003Z] Progress (1): 6.5/9.0 MB
14:49:01 [2026-10-20T12:49:01.003Z] Progress (1): 6.5/9.0 MB
14:49:01 [2026-10-20T12:49:01.003Z] Progress (1): 6.5/9.0 MB
14:49:01 [2026-10-20T12:49:01.003Z] Progress (1): 6.5/9.0 MB
14:49:01 [2026-10-20T12:49:01.003Z] Progress (1): 6.5/9.0 MB
14:49:01 [2026-10-20T12:49:01.003Z] Progress (1): 6.5/9.0 MB
14:49:01 [2026-10-20T12:49:01.003Z] Progress (1): 6.5/9.0 MB
14:49:01 [2026-10-20T12:49:01.003Z] Progress (1): 6.5/9.0 MB
14:49:01 [2026-10-20T12:49:01.003Z] Progress (1): 6.5/9.0 MB
14:49:01 [2026-10-20T12:49:01.003Z] Progress (1): 6.5/9.0 MB
14:49:01 [2026-10-20T12:49:01.003Z] Progress (1): 6.5/9.0 MB
14:49:01 [2026-10-20T12:49:01.003Z] Progress (1): 6.5/9.0 MB
14:49:01 [2026-10-20T12:49:01.003Z] Progress (1): 6.6/9.0 MB
14:49:01 [2026-10-20T12:49:01.003Z] Progress (1): 6.6/9.0 MB
14:49:01 [2026-10-20T12:49:01.003Z] Progress (1): 6.6/9.0 MB
14:49:01 [2026-10-20T12:49:01.003Z] Progress (1): 6.6/9.0 MB
14:49:01 [2026-10-20T12:49:01.003Z] Progress (1): 6.6/9.0 MB
14:49:01 [2026-10-20T12:49:01.003Z] Progress (1): 6.6/9.0 MB
14:49:01 [2026-10-20T12:49:01.003Z] Progress (1): 6.6/9.0 MB
14:49:01 [2026-10-20T12:49:01.003Z] Progress (1): 6.6/9.0 MB
14:49:01 [2026-10-20T12:49:01.003Z] Progress (1): 6.6/9.0 MB
14:49:01 [2026-10-20T12:49:01.003Z] Progress (1): 6.6/9.0 MB
14:49:01 [2026-10-20T12:49:01.003Z] Progress (1): 6.6/9.0 MB
14:49:01 [2026-10-20T12:49:01.003Z] Progress (1): 6.6/9.0 MB
14:49:01 [2026-10-20T12:49:01.003Z] Progress (1): 6.6/9.0 MB
14:49:01 [2026-10-20T12:49:01.003Z] Progress (1): 6.6/9.0 MB
14:49:01 [2026-10-20T12:49:01.003Z] Progress (1): 6.6/9.0 MB
14:49:01 [2026-10-20T12:49:01.003Z] Progress (1): 6.6/9.0 MB
14:49:01 [2026-10-20T12:49:01.003Z] Progress (1): 6.6/9.0 MB
14:49:01 [2026-10-20T12:49:01.003Z] Progress (1): 6.6/9.0 MB
14:49:01 [2026-10-20T12:49:01.003Z] Progress (1): 6.7/9.0 MB
14:49:01 [2026-10-20T12:49:01.003Z] Progress (1): 6.7/9.0 MB
14:49:01 [2026-10-20T12:49:01.003Z] Progress (1): 6.7/9.0 MB
14:49:01 [2026-10-20T12:49:01.003Z] Progress (1): 6.7/9.0 MB
14:49:01 [2026-10-20T12:49:01.003Z] Progress (1): 6.7/9.0 MB
14:49:01 [2026-10-20T12:49:01.003Z] Progress (1): 6.7/9.0 MB
14:49:01 [2026-10-20T12:49:01.003Z] Progress (1): 6.7/9.0 MB
14:49:01 [2026-10-20T12:49:01.003Z] Progress (1): 6.7/9.0 MB
14:49:01 [2026-10-20T12:49:01.003Z] Progress (1): 6.7/9.0 MB
14:49:01 [2026-10-20T12:49:01.003Z] Progress (1): 6.7/9.0 MB
14:49:01 [2026-10-20T12:49:01.003Z] Progress (1): 6.7/9.0 MB
14:49:01 [2026-10-20T12:49:01.003Z] Progress (1): 6.7/9.0 MB
14:49:01 [2026-10-20T12:49:01.003Z] Progress (1): 6.7/9.0 MB
14:49:01 [2026-10-20T12:49:01.003Z] Progress (1): 6.7/9.0 MB
14:49:01 [2026-10-20T12:49:01.003Z] Progress (1): 6.7/9.0 MB
14:49:01 [2026-10-20T12:49:01.003Z] Progress (1): 6.7/9.0 MB
14:49:01 [2026-10-20T12:49:01.003Z] Progress (1): 6.7/9.0 MB
14:49:01 [2026-10-20T12:49:01.003Z] Progress (1): 6.7/9.0 MB
14:49:01 [2026-10-20T12:49:01.003Z] Progress (1): 6.7/9.0 MB
14:49:01 [2026-10-20T12:49:01.003Z] Progress (1): 6.8/9.0 MB
14:49:01 [2026-10-20T12:49:01.003Z] Progress (1): 6.8/9.0 MB
14:49:01 [2026-10-20T12:49:01.003Z] Progress (1): 6.8/9.0 MB
14:49:01 [2026-10-20T12:49:01.003Z] Progress (1): 6.8/9.0 MB
14:49:01 [2026-10-20T12:49:01.003Z] Progress (1): 6.8/9.0 MB
14:49:01 [2026-10-20T12:49:01.003Z] Progress (1): 6.8/9.0 MB
14:49:01 [2026-10-20T12:49:01.003Z] Progress (1): 6.8/9.0 MB
14:49:01 [2026-10-20T12:49:01.003Z] Progress (1): 6.8/9.0 MB
14:49:01 [2026-10-20T12:49:01.003Z] Progress (1): 6.8/9.0 MB
14:49:01 [2026-10-20T12:49:01.003Z] Progress (1): 6.8/9.0 MB
14:49:01 [2026-10-20T12:49:01.003Z] Progress (1): 6.8/9.0 MB
14:49:01 [2026-10-20T12:49:01.003Z] Progress (1): 6.8/9.0 MB
14:49:01 [2026-10-20T12:49:01.003Z] Progress (1): 6.8/9.0 MB
14:49:01 [2026-10-20T12:49:01.003Z] Progress (1): 6.8/9.0 MB
14:49:01 [2026-10-20T12:49:01.003Z] Progress (1): 6.8/9.0 MB
14:49:01 [2026-10-20T12:49:01.003Z] Progress (1): 6.8/9.0 MB
14:49:01 [2026-10-20T12:49:01.003Z] Progress (1): 6.8/9.0 MB
14:49:01 [2026-10-20T12:49:01.003Z] Progress (1): 6.8/9.0 MB
14:49:01 [2026-10-20T12:49:01.003Z] Progress (1): 6.8/9.0 MB
14:49:01 [2026-10-20T12:49:01.003Z] Progress (1): 6.9/9.0 MB
14:49:01 [2026-10-20T12:49:01.003Z] Progress (1): 6.9/9.0 MB
14:49:01 [2026-10-20T12:49:01.003Z] Progress (1): 6.9/9.0 MB
14:49:01 [2026-10-20T12:49:01.003Z] Progress (1): 6.9/9.0 MB
14:49:01 [2026-10-20T12:49:01.003Z] Progress (1): 6.9/9.0 MB
14:49:01 [2026-10-20T12:49:01.003Z] Progress (1): 6.9/9.0 MB
14:49:01 [2026-10-20T12:49:01.003Z] Progress (1): 6.9/9.0 MB
14:49:01 [2026-10-20T12:49:01.003Z] Progress (1): 6.9/9.0 MB
14:49:01 [2026-10-20T12:49:01.003Z] Progress (1): 6.9/9.0 MB
14:49:01 [2026-10-20T12:49:01.003Z] Progress (1): 6.9/9.0 MB
14:49:01 [2026-10-20T12:49:01.003Z] Progress (1): 6.9/9.0 MB
14:49:01 [2026-10-20T12:49:01.003Z] Progress (1): 6.9/9.0 MB
14:49:01 [2026-10-20T12:49:01.003Z] Progress (1): 6.9/9.0 MB
14:49:01 [2026-10-20T12:49:01.003Z] Progress (1): 6.9/9.0 MB
14:49:01 [2026-10-20T12:49:01.003Z] Progress (1): 6.9/9.0 MB
14:49:01 [2026-10-20T12:49:01.003Z] Progress (1): 6.9/9.0 MB
14:49:01 [2026-10-20T12:49:01.003Z] Progress (1): 6.9/9.0 MB
14:49:01 [2026-10-20T12:49:01.003Z] Progress (1): 6.9/9.0 MB
14:49:01 [2026-10-20T12:49:01.003Z] Progress (1): 7.0/9.0 MB
14:49:01 [2026-10-20T12:49:01.003Z] Progress (1): 7.0/9.0 MB
14:49:01 [2026-10-20T12:49:01.003Z] Progress (1): 7.0/9.0 MB
14:49:01 [2026-10-20T12:49:01.003Z] Progress (1): 7.0/9.0 MB
14:49:01 [2026-10-20T12:49:01.003Z] Progress (1): 7.0/9.0 MB
14:49:01 [2026-10-20T12:49:01.003Z] Progress (1): 7.0/9.0 MB
14:49:01 [2026-10-20T12:49:01.003Z] Progress (1): 7.0/9.0 MB
14:49:01 [2026-10-20T12:49:01.003Z] Progress (1): 7.0/9.0 MB
14:49:01 [2026-10-20T12:49:01.003Z] Progress (1): 7.0/9.0 MB
14:49:01 [2026-10-20T12:49:01.003Z] Progress (1): 7.0/9.0 MB
14:49:01 [2026-10-20T12:49:01.003Z] Progress (1): 7.0/9.0 MB
14:49:01 [2026-10-20T12:49:01.003Z] Progress (1): 7.0/9.0 MB
14:49:01 [2026-10-20T12:49:01.003Z] Progress (1): 7.0/9.0 MB
14:49:01 [2026-10-20T12:49:01.003Z] Progress (1): 7.0/9.0 MB
14:49:01 [2026-10-20T12:49:01.003Z] Progress (1): 7.0/9.0 MB
14:49:01 [2026-10-20T12:49:01.003Z] Progress (1): 7.0/9.0 MB
14:49:01 [2026-10-20T12:49:01.003Z] Progress (1): 7.0/9.0 MB
14:49:01 [2026-10-20T12:49:01.003Z] Progress (1): 7.0/9.0 MB
14:49:01 [2026-10-20T12:49:01.003Z] Progress (1): 7.0/9.0 MB
14:49:01 [2026-10-20T12:49:01.003Z] Progress (1): 7.1/9.0 MB
14:49:01 [2026-10-20T12:49:01.003Z] Progress (1): 7.1/9.0 MB
14:49:01 [2026-10-20T12:49:01.003Z] Progress (1): 7.1/9.0 MB
14:49:01 [2026-10-20T12:49:01.003Z] Progress (1): 7.1/9.0 MB
14:49:01 [2026-10-20T12:49:01.003Z] Progress (1): 7.1/9.0 MB
14:49:01 [2026-10-20T12:49:01.003Z] Progress (1): 7.1/9.0 MB
14:49:01 [2026-10-20T12:49:01.003Z] Progress (1): 7.1/9.0 MB
14:49:01 [2026-10-20T12:49:01.003Z] Progress (1): 7.1/9.0 MB
14:49:01 [2026-10-20T12:49:01.003Z] Progress (1): 7.1/9.0 MB
14:49:01 [2026-10-20T12:49:01.003Z] Progress (1): 7.1/9.0 MB
14:49:01 [2026-10-20T12:49:01.003Z] Progress (1): 7.1/9.0 MB
14:49:01 [2026-10-20T12:49:01.003Z] Progress (1): 7.1/9.0 MB
14:49:01 [2026-10-20T12:49:01.003Z] Progress (1): 7.1/9.0 MB
14:49:01 [2026-10-20T12:49:01.003Z] Progress (1): 7.1/9.0 MB
14:49:01 [2026-10-20T12:49:01.003Z] Progress (1): 7.1/9.0 MB
14:49:01 [2026-10-20T12:49:01.003Z] Progress (1): 7.1/9.0 MB
14:49:01 [2026-10-20T12:49:01.003Z] Progress (1): 7.1/9.0 MB
14:49:01 [2026-10-20T12:49:01.003Z] Progress (1): 7.1/9.0 MB
14:49:01 [2026-10-20T12:49:01.003Z] Progress (1): 7.2/9.0 MB
14:49:01 [2026-10-20T12:49:01.003Z] Progress (1): 7.2/9.0 MB
14:49:01 [2026-10-20T12:49:01.003Z] Progress (1): 7.2/9.0 MB
14:49:01 [2026-10-20T12:49:01.003Z] Progress (1): 7.2/9.0 MB
14:49:01 [2026-10-20T12:49:01.003Z] Progress (1): 7.2/9.0 MB
14:49:01 [2026-10-20T12:49:01.003Z] Progress (1): 7.2/9.0 MB
14:49:01 [2026-10-20T12:49:01.003Z] Progress (1): 7.2/9.0 MB
14:49:01 [2026-10-20T12:49:01.003Z] Progress (1): 7.2/9.0 MB
14:49:01 [2026-10-20T12:49:01.003Z] Progress (1): 7.2/9.0 MB
14:49:01 [2026-10-20T12:49:01.003Z] Progress (1): 7.2/9.0 MB
14:49:01 [2026-10-20T12:49:01.003Z] Progress (1): 7.2/9.0 MB
14:49:01 [2026-10-20T12:49:01.003Z] Progress (1): 7.2/9.0 MB
14:49:01 [2026-10-20T12:49:01.003Z] Progress (1): 7.2/9.0 MB
14:49:01 [2026-10-20T12:49:01.003Z] Progress (1): 7.2/9.0 MB
14:49:01 [2026-10-20T12:49:01.003Z] Progress (1): 7.2/9.0 MB
14:49:01 [2026-10-20T12:49:01.003Z] Progress (1): 7.2/9.0 MB
14:49:01 [2026-10-20T12:49:01.003Z] Progress (1): 7.2/9.0 MB
14:49:01 [2026-10-20T12:49:01.003Z] Progress (1): 7.2/9.0 MB
14:49:01 [2026-10-20T12:49:01.003Z] Progress (1): 7.2/9.0 MB
14:49:01 [2026-10-20T12:49:01.003Z] Progress (1): 7.3/9.0 MB
14:49:01 [2026-10-20T12:49:01.003Z] Progress (1): 7.3/9.0 MB
14:49:01 [2026-10-20T12:49:01.003Z] Progress (1): 7.3/9.0 MB
14:49:01 [2026-10-20T12:49:01.003Z] Progress (1): 7.3/9.0 MB
14:49:01 [2026-10-20T12:49:01.003Z] Progress (1): 7.3/9.0 MB
14:49:01 [2026-10-20T12:49:01.003Z] Progress (1): 7.3/9.0 MB
14:49:01 [2026-10-20T12:49:01.003Z] Progress (1): 7.3/9.0 MB
14:49:01 [2026-10-20T12:49:01.003Z] Progress (1): 7.3/9.0 MB
14:49:01 [2026-10-20T12:49:01.003Z] Progress (1): 7.3/9.0 MB
14:49:01 [2026-10-20T12:49:01.003Z] Progress (1): 7.3/9.0 MB
14:49:01 [2026-10-20T12:49:01.003Z] Progress (1): 7.3/9.0 MB
14:49:01 [2026-10-20T12:49:01.003Z] Progress (1): 7.3/9.0 MB
14:49:01 [2026-10-20T12:49:01.003Z] Progress (1): 7.3/9.0 MB
14:49:01 [2026-10-20T12:49:01.003Z] Progress (1): 7.3/9.0 MB
14:49:01 [2026-10-20T12:49:01.003Z] Progress (1): 7.3/9.0 MB
14:49:01 [2026-10-20T12:49:01.003Z] Progress (1): 7.3/9.0 MB
14:49:01 [2026-10-20T12:49:01.003Z] Progress (1): 7.3/9.0 MB
14:49:01 [2026-10-20T12:49:01.003Z] Progress (1): 7.3/9.0 MB
14:49:01 [2026-10-20T12:49:01.003Z] Progress (1): 7.4/9.0 MB
14:49:01 [2026-10-20T12:49:01.003Z] Progress (1): 7.4/9.0 MB
14:49:01 [2026-10-20T12:49:01.003Z] Progress (1): 7.4/9.0 MB
14:49:01 [2026-10-20T12:49:01.003Z] Progress (1): 7.4/9.0 MB
14:49:01 [2026-10-20T12:49:01.003Z] Progress (1): 7.4/9.0 MB
14:49:01 [2026-10-20T12:49:01.003Z] Progress (1): 7.4/9.0 MB
14:49:01 [2026-10-20T12:49:01.003Z] Progress (1): 7.4/9.0 MB
14:49:01 [2026-10-20T12:49:01.003Z] Progress (1): 7.4/9.0 MB
14:49:01 [2026-10-20T12:49:01.003Z] Progress (1): 7.4/9.0 MB
14:49:01 [2026-10-20T12:49:01.003Z] Progress (1): 7.4/9.0 MB
14:49:01 [2026-10-20T12:49:01.003Z] Progress (1): 7.4/9.0 MB
14:49:01 [2026-10-20T12:49:01.003Z] Progress (1): 7.4/9.0 MB
14:49:01 [2026-10-20T12:49:01.003Z] Progress (1): 7.4/9.0 MB
14:49:01 [2026-10-20T12:49:01.003Z] Progress (1): 7.4/9.0 MB
14:49:01 [2026-10-20T12:49:01.003Z] Progress (1): 7.4/9.0 MB
14:49:01 [2026-10-20T12:49:01.003Z] Progress (1): 7.4/9.0 MB
14:49:01 [2026-10-20T12:49:01.003Z] Progress (1): 7.4/9.0 MB
14:49:01 [2026-10-20T12:49:01.003Z] Progress (1): 7.4/9.0 MB
14:49:01 [2026-10-20T12:49:01.003Z] Progress (1): 7.5/9.0 MB
14:49:01 [2026-10-20T12:49:01.003Z] Progress (1): 7.5/9.0 MB
14:49:01 [2026-10-20T12:49:01.003Z] Progress (1): 7.5/9.0 MB
14:49:01 [2026-10-20T12:49:01.003Z] Progress (1): 7.5/9.0 MB
14:49:01 [2026-10-20T12:49:01.003Z] Progress (1): 7.5/9.0 MB
14:49:01 [2026-10-20T12:49:01.003Z] Progress (1): 7.5/9.0 MB
14:49:01 [2026-10-20T12:49:01.003Z] Progress (1): 7.5/9.0 MB
14:49:01 [2026-10-20T12:49:01.003Z] Progress (1): 7.5/9.0 MB
14:49:01 [2026-10-20T12:49:01.003Z] Progress (1): 7.5/9.0 MB
14:49:01 [2026-10-20T12:49:01.003Z] Progress (1): 7.5/9.0 MB
14:49:01 [2026-10-20T12:49:01.003Z] Progress (1): 7.5/9.0 MB
14:49:01 [2026-10-20T12:49:01.003Z] Progress (1): 7.5/9.0 MB
14:49:01 [2026-10-20T12:49:01.003Z] Progress (1): 7.5/9.0 MB
14:49:01 [2026-10-20T12:49:01.003Z] Progress (1): 7.5/9.0 MB
14:49:01 [2026-10-20T12:49:01.003Z] Progress (1): 7.5/9.0 MB
14:49:01 [2026-10-20T12:49:01.003Z] Progress (1): 7.5/9.0 MB
14:49:01 [2026-10-20T12:49:01.003Z] Progress (1): 7.5/9.0 MB
14:49:01 [2026-10-20T12:49:01.003Z] Progress (1): 7.5/9.0 MB
14:49:01 [2026-10-20T12:49:01.003Z] Progress (1): 7.5/9.0 MB
14:49:01 [2026-10-20T12:49:01.003Z] Progress (1): 7.6/9.0 MB
14:49:01 [2026-10-20T12:49:01.003Z] Progress (1): 7.6/9.0 MB
14:49:01 [2026-10-20T12:49:01.003Z] Progress (1): 7.6/9.0 MB
14:49:01 [2026-10-20T12:49:01.003Z] Progress (1): 7.6/9.0 MB
14:49:01 [2026-10-20T12:49:01.003Z] Progress (1): 7.6/9.0 MB
14:49:01 [2026-10-20T12:49:01.003Z] Progress (1): 7.6/9.0 MB
14:49:01 [2026-10-20T12:49:01.003Z] Progress (1): 7.6/9.0 MB
14:49:01 [2026-10-20T12:49:01.003Z] Progress (1): 7.6/9.0 MB
14:49:01 [2026-10-20T12:49:01.003Z] Progress (1): 7.6/9.0 MB
14:49:01 [2026-10-20T12:49:01.003Z] Progress (1): 7.6/9.0 MB
14:49:01 [2026-10-20T12:49:01.003Z] Progress (1): 7.6/9.0 MB
14:49:01 [2026-10-20T12:49:01.003Z] Progress (1): 7.6/9.0 MB
14:49:01 [2026-10-20T12:49:01.003Z] Progress (1): 7.6/9.0 MB
14:49:01 [2026-10-20T12:49:01.003Z] Progress (1): 7.6/9.0 MB
14:49:01 [2026-10-20T12:49:01.003Z] Progress (1): 7.6/9.0 MB
14:49:01 [2026-10-20T12:49:01.003Z] Progress (1): 7.6/9.0 MB
14:49:01 [2026-10-20T12:49:01.003Z] Progress (1): 7.6/9.0 MB
14:49:01 [2026-10-20T12:49:01.003Z] Progress (1): 7.6/9.0 MB
14:49:01 [2026-10-20T12:49:01.003Z] Progress (1): 7.7/9.0 MB
14:49:01 [2026-10-20T12:49:01.003Z] Progress (1): 7.7/9.0 MB
14:49:01 [2026-10-20T12:49:01.003Z] Progress (1): 7.7/9.0 MB
14:49:01 [2026-10-20T12:49:01.003Z] Progress (1): 7.7/9.0 MB
14:49:01 [2026-10-20T12:49:01.003Z] Progress (1): 7.7/9.0 MB
14:49:01 [2026-10-20T12:49:01.003Z] Progress (1): 7.7/9.0 MB
14:49:01 [2026-10-20T12:49:01.003Z] Progress (1): 7.7/9.0 MB
14:49:01 [2026-10-20T12:49:01.003Z] Progress (1): 7.7/9.0 MB
14:49:01 [2026-10-20T12:49:01.003Z] Progress (1): 7.7/9.0 MB
14:49:01 [2026-10-20T12:49:01.003Z] Progress (1): 7.7/9.0 MB
14:49:01 [2026-10-20T12:49:01.003Z] Progress (1): 7.7/9.0 MB
14:49:01 [2026-10-20T12:49:01.003Z] Progress (1): 7.7/9.0 MB
14:49:01 [2026-10-20T12:49:01.003Z] Progress (1): 7.7/9.0 MB
14:49:01 [2026-10-20T12:49:01.003Z] Progress (1): 7.7/9.0 MB
14:49:01 [2026-10-20T12:49:01.003Z] Progress (1): 7.7/9.0 MB
14:49:01 [2026-10-20T12:49:01.003Z] Progress (1): 7.7/9.0 MB
14:49:01 [2026-10-20T12:49:01.003Z] Progress (1): 7.7/9.0 MB
14:49:01 [2026-10-20T12:49:01.003Z] Progress (1): 7.7/9.0 MB
14:49:01 [2026-10-20T12:49:01.003Z] Progress (1): 7.7/9.0 MB
14:49:01 [2026-10-20T12:49:01.003Z] Progress (1): 7.8/9.0 MB
14:49:01 [2026-10-20T12:49:01.003Z] Progress (1): 7.8/9.0 MB
14:49:01 [2026-10-20T12:49:01.003Z] Progress (1): 7.8/9.0 MB
14:49:01 [2026-10-20T12:49:01.003Z] Progress (1): 7.8/9.0 MB
14:49:01 [2026-10-20T12:49:01.003Z] Progress (1): 7.8/9.0 MB
14:49:01 [2026-10-20T12:49:01.003Z] Progress (1): 7.8/9.0 MB
14:49:01 [2026-10-20T12:49:01.003Z] Progress (1): 7.8/9.0 MB
14:49:01 [2026-10-20T12:49:01.003Z] Progress (1): 7.8/9.0 MB
14:49:01 [2026-10-20T12:49:01.003Z] Progress (1): 7.8/9.0 MB
14:49:01 [2026-10-20T12:49:01.003Z] Progress (1): 7.8/9.0 MB
14:49:01 [2026-10-20T12:49:01.003Z] Progress (1): 7.8/9.0 MB
14:49:01 [2026-10-20T12:49:01.003Z] Progress (1): 7.8/9.0 MB
14:49:01 [2026-10-20T12:49:01.003Z] Progress (1): 7.8/9.0 MB
14:49:01 [2026-10-20T12:49:01.003Z] Progress (1): 7.8/9.0 MB
14:49:01 [2026-10-20T12:49:01.003Z] Progress (1): 7.8/9.0 MB
14:49:01 [2026-10-20T12:49:01.003Z] Progress (1): 7.8/9.0 MB
14:49:01 [2026-10-20T12:49:01.003Z] Progress (1): 7.8/9.0 MB
14:49:01 [2026-10-20T12:49:01.003Z] Progress (1): 7.8/9.0 MB
14:49:01 [2026-10-20T12:49:01.003Z] Progress (1): 7.9/9.0 MB
14:49:01 [2026-10-20T12:49:01.003Z] Progress (1): 7.9/9.0 MB
14:49:01 [2026-10-20T12:49:01.003Z] Progress (1): 7.9/9.0 MB
14:49:01 [2026-10-20T12:49:01.003Z] Progress (1): 7.9/9.0 MB
14:49:01 [2026-10-20T12:49:01.003Z] Progress (1): 7.9/9.0 MB
14:49:01 [2026-10-20T12:49:01.003Z] Progress (1): 7.9/9.0 MB
14:49:01 [2026-10-20T12:49:01.003Z] Progress (1): 7.9/9.0 MB
14:49:01 [2026-10-20T12:49:01.003Z] Progress (1): 7.9/9.0 MB
14:49:01 [2026-10-20T12:49:01.003Z] Progress (1): 7.9/9.0 MB
14:49:01 [2026-10-20T12:49:01.003Z] Progress (1): 7.9/9.0 MB
14:49:01 [2026-10-20T12:49:01.003Z] Progress (1): 7.9/9.0 MB
14:49:01 [2026-10-20T12:49:01.003Z] Progress (1): 7.9/9.0 MB
14:49:01 [2026-10-20T12:49:01.003Z] Progress (1): 7.9/9.0 MB
14:49:01 [2026-10-20T12:49:01.003Z] Progress (1): 7.9/9.0 MB
14:49:01 [2026-10-20T12:49:01.003Z] Progress (1): 7.9/9.0 MB
14:49:01 [2026-10-20T12:49:01.003Z] Progress (1): 7.9/9.0 MB
14:49:01 [2026-10-20T12:49:01.003Z] Progress (1): 7.9/9.0 MB
14:49:01 [2026-10-20T12:49:01.003Z] Progress (1): 7.9/9.0 MB
14:49:01 [2026-10-20T12:49:01.003Z] Progress (1): 8.0/9.0 MB
14:49:01 [2026-10-20T12:49:01.003Z] Progress (1): 8.0/9.0 MB
14:49:01 [2026-10-20T12:49:01.003Z] Progress (1): 8.0/9.0 MB
14:49:01 [2026-10-20T12:49:01.003Z] Progress (1): 8.0/9.0 MB
14:49:01 [2026-10-20T12:49:01.003Z] Progress (1): 8.0/9.0 MB
14:49:01 [2026-10-20T12:49:01.003Z] Progress (1): 8.0/9.0 MB
14:49:01 [2026-10-20T12:49:01.003Z] Progress (1): 8.0/9.0 MB
14:49:01 [2026-10-20T12:49:01.003Z] Progress (1): 8.0/9.0 MB
14:49:01 [2026-10-20T12:49:01.003Z] Progress (1): 8.0/9.0 MB
14:49:01 [2026-10-20T12:49:01.003Z] Progress (1): 8.0/9.0 MB
14:49:01 [2026-10-20T12:49:01.003Z] Progress (1): 8.0/9.0 MB
14:49:01 [2026-10-20T12:49:01.003Z] Progress (1): 8.0/9.0 MB
14:49:01 [2026-10-20T12:49:01.003Z] Progress (1): 8.0/9.0 MB
14:49:01 [2026-10-20T12:49:01.003Z] Progress (1): 8.0/9.0 MB
14:49:01 [2026-10-20T12:49:01.003Z] Progress (1): 8.0/9.0 MB
14:49:01 [2026-10-20T12:49:01.003Z] Progress (1): 8.0/9.0 MB
14:49:01 [2026-10-20T12:49:01.003Z] Progress (1): 8.0/9.0 MB
14:49:01 [2026-10-20T12:49:01.003Z] Progress (1): 8.0/9.0 MB
14:49:01 [2026-10-20T12:49:01.003Z] Progress (1): 8.1/9.0 MB
14:49:01 [2026-10-20T12:49:01.003Z] Progress (1): 8.1/9.0 MB
14:49:01 [2026-10-20T12:49:01.003Z] Progress (1): 8.1/9.0 MB
14:49:01 [2026-10-20T12:49:01.003Z] Progress (1): 8.1/9.0 MB
14:49:01 [2026-10-20T12:49:01.003Z] Progress (1): 8.1/9.0 MB
14:49:01 [2026-10-20T12:49:01.003Z] Progress (1): 8.1/9.0 MB
14:49:01 [2026-10-20T12:49:01.003Z] Progress (1): 8.1/9.0 MB
14:49:01 [2026-10-20T12:49:01.003Z] Progress (1): 8.1/9.0 MB
14:49:01 [2026-10-20T12:49:01.003Z] Progress (1): 8.1/9.0 MB
14:49:01 [2026-10-20T12:49:01.003Z] Progress (1): 8.1/9.0 MB
14:49:01 [2026-10-20T12:49:01.003Z] Progress (1): 8.1/9.0 MB
14:49:01 [2026-10-20T12:49:01.003Z] Progress (1): 8.1/9.0 MB
14:49:01 [2026-10-20T12:49:01.003Z] Progress (1): 8.1/9.0 MB
14:49:01 [2026-10-20T12:49:01.003Z] Progress (1): 8.1/9.0 MB
14:49:01 [2026-10-20T12:49:01.003Z] Progress (1): 8.1/9.0 MB
14:49:01 [2026-10-20T12:49:01.003Z] Progress (1): 8.1/9.0 MB
14:49:01 [2026-10-20T12:49:01.003Z] Progress (1): 8.1/9.0 MB
14:49:01 [2026-10-20T12:49:01.003Z] Progress (1): 8.1/9.0 MB
14:49:01 [2026-10-20T12:49:01.003Z] Progress (1): 8.2/9.0 MB
14:49:01 [2026-10-20T12:49:01.003Z] Progress (1): 8.2/9.0 MB
14:49:01 [2026-10-20T12:49:01.003Z] Progress (1): 8.2/9.0 MB
14:49:01 [2026-10-20T12:49:01.003Z] Progress (1): 8.2/9.0 MB
14:49:01 [2026-10-20T12:49:01.003Z] Progress (1): 8.2/9.0 MB
14:49:01 [2026-10-20T12:49:01.003Z] Progress (1): 8.2/9.0 MB
14:49:01 [2026-10-20T12:49:01.003Z] Progress (1): 8.2/9.0 MB
14:49:01 [2026-10-20T12:49:01.003Z] Progress (1): 8.2/9.0 MB
14:49:01 [2026-10-20T12:49:01.003Z] Progress (1): 8.2/9.0 MB
14:49:01 [2026-10-20T12:49:01.003Z] Progress (1): 8.2/9.0 MB
14:49:01 [2026-10-20T12:49:01.003Z] Progress (1): 8.2/9.0 MB
14:49:01 [2026-10-20T12:49:01.003Z] Progress (1): 8.2/9.0 MB
14:49:01 [2026-10-20T12:49:01.003Z] Progress (1): 8.2/9.0 MB
14:49:01 [2026-10-20T12:49:01.003Z] Progress (1): 8.2/9.0 MB
14:49:01 [2026-10-20T12:49:01.003Z] Progress (1): 8.2/9.0 MB
14:49:01 [2026-10-20T12:49:01.003Z] Progress (1): 8.2/9.0 MB
14:49:01 [2026-10-20T12:49:01.003Z] Progress (1): 8.2/9.0 MB
14:49:01 [2026-10-20T12:49:01.003Z] Progress (1): 8.2/9.0 MB
14:49:01 [2026-10-20T12:49:01.003Z] Progress (1): 8.2/9.0 MB
14:49:01 [2026-10-20T12:49:01.003Z] Progress (1): 8.3/9.0 MB
14:49:01 [2026-10-20T12:49:01.003Z] Progress (1): 8.3/9.0 MB
14:49:01 [2026-10-20T12:49:01.003Z] Progress (1): 8.3/9.0 MB
14:49:01 [2026-10-20T12:49:01.003Z] Progress (1): 8.3/9.0 MB
14:49:01 [2026-10-20T12:49:01.003Z] Progress (1): 8.3/9.0 MB
14:49:01 [2026-10-20T12:49:01.003Z] Progress (1): 8.3/9.0 MB
14:49:01 [2026-10-20T12:49:01.003Z] Progress (1): 8.3/9.0 MB
14:49:01 [2026-10-20T12:49:01.003Z] Progress (1): 8.3/9.0 MB
14:49:01 [2026-10-20T12:49:01.003Z] Progress (1): 8.3/9.0 MB
14:49:01 [2026-10-20T12:49:01.003Z] Progress (1): 8.3/9.0 MB
14:49:01 [2026-10-20T12:49:01.003Z] Progress (1): 8.3/9.0 MB
14:49:01 [2026-10-20T12:49:01.003Z] Progress (1): 8.3/9.0 MB
14:49:01 [2026-10-20T12:49:01.003Z] Progress (1): 8.3/9.0 MB
14:49:01 [2026-10-20T12:49:01.003Z] Progress (1): 8.3/9.0 MB
14:49:01 [2026-10-20T12:49:01.003Z] Progress (1): 8.3/9.0 MB
14:49:01 [2026-10-20T12:49:01.003Z] Progress (1): 8.3/9.0 MB
14:49:01 [2026-10-20T12:49:01.003Z] Progress (1): 8.3/9.0 MB
14:49:01 [2026-10-20T12:49:01.003Z] Progress (1): 8.3/9.0 MB
14:49:01 [2026-10-20T12:49:01.003Z] Progress (1): 8.3/9.0 MB
14:49:01 [2026-10-20T12:49:01.003Z] Progress (1): 8.4/9.0 MB
14:49:01 [2026-10-20T12:49:01.003Z] Progress (1): 8.4/9.0 MB
14:49:01 [2026-10-20T12:49:01.003Z] Progress (1): 8.4/9.0 MB
14:49:01 [2026-10-20T12:49:01.003Z] Progress (1): 8.4/9.0 MB
14:49:01 [2026-10-20T12:49:01.003Z] Progress (1): 8.4/9.0 MB
14:49:01 [2026-10-20T12:49:01.003Z] Progress (1): 8.4/9.0 MB
14:49:01 [2026-10-20T12:49:01.003Z] Progress (1): 8.4/9.0 MB
14:49:01 [2026-10-20T12:49:01.003Z] Progress (1): 8.4/9.0 MB
14:49:01 [2026-10-20T12:49:01.003Z] Progress (1): 8.4/9.0 MB
14:49:01 [2026-10-20T12:49:01.003Z] Progress (1): 8.4/9.0 MB
14:49:01 [2026-10-20T12:49:01.003Z] Progress (1): 8.4/9.0 MB
14:49:01 [2026-10-20T12:49:01.003Z] Progress (1): 8.4/9.0 MB
14:49:01 [2026-10-20T12:49:01.003Z] Progress (1): 8.4/9.0 MB
14:49:01 [2026-10-20T12:49:01.003Z] Progress (1): 8.4/9.0 MB
14:49:01 [2026-10-20T12:49:01.003Z] Progress (1): 8.4/9.0 MB
14:49:01 [2026-10-20T12:49:01.003Z] Progress (1): 8.4/9.0 MB
14:49:01 [2026-10-20T12:49:01.003Z] Progress (1): 8.4/9.0 MB
14:49:01 [2026-10-20T12:49:01.003Z] Progress (1): 8.5/9.0 MB
14:49:01 [2026-10-20T12:49:01.004Z] Progress (1): 8.5/9.0 MB
14:49:01 [2026-10-20T12:49:01.004Z] Progress (1): 8.5/9.0 MB
14:49:01 [2026-10-20T12:49:01.004Z] Progress (1): 8.5/9.0 MB
14:49:01 [2026-10-20T12:49:01.004Z] Progress (1): 8.5/9.0 MB
14:49:01 [2026-10-20T12:49:01.004Z] Progress (1): 8.5/9.0 MB
14:49:01 [2026-10-20T12:49:01.004Z] Progress (1): 8.5/9.0 MB
14:49:01 [2026-10-20T12:49:01.004Z] Progress (1): 8.5/9.0 MB
14:49:01 [2026-10-20T12:49:01.004Z] Progress (1): 8.5/9.0 MB
14:49:01 [2026-10-20T12:49:01.004Z] Progress (1): 8.5/9.0 MB
14:49:01 [2026-10-20T12:49:01.004Z] Progress (1): 8.5/9.0 MB
14:49:01 [2026-10-20T12:49:01.004Z] Progress (1): 8.5/9.0 MB
14:49:01 [2026-10-20T12:49:01.004Z] Progress (1): 8.5/9.0 MB
14:49:01 [2026-10-20T12:49:01.004Z] Progress (1): 8.5/9.0 MB
14:49:01 [2026-10-20T12:49:01.004Z] Progress (1): 8.5/9.0 MB
14:49:01 [2026-10-20T12:49:01.004Z] Progress (1): 8.5/9.0 MB
14:49:01 [2026-10-20T12:49:01.004Z] Progress (1): 8.5/9.0 MB
14:49:01 [2026-10-20T12:49:01.004Z] Progress (1): 8.5/9.0 MB
14:49:01 [2026-10-20T12:49:01.004Z] Progress (1): 8.5/9.0 MB
14:49:01 [2026-10-20T12:49:01.004Z] Progress (1): 8.6/9.0 MB
14:49:01 [2026-10-20T12:49:01.004Z] Progress (1): 8.6/9.0 MB
14:49:01 [2026-10-20T12:49:01.004Z] Progress (1): 8.6/9.0 MB
14:49:01 [2026-10-20T12:49:01.004Z] Progress (1): 8.6/9.0 MB
14:49:01 [2026-10-20T12:49:01.004Z] Progress (1): 8.6/9.0 MB
14:49:01 [2026-10-20T12:49:01.004Z] Progress (1): 8.6/9.0 MB
14:49:01 [2026-10-20T12:49:01.004Z] Progress (1): 8.6/9.0 MB
14:49:01 [2026-10-20T12:49:01.004Z] Progress (1): 8.6/9.0 MB
14:49:01 [2026-10-20T12:49:01.004Z] Progress (1): 8.6/9.0 MB
14:49:01 [2026-10-20T12:49:01.004Z] Progress (1): 8.6/9.0 MB
14:49:01 [2026-10-20T12:49:01.004Z] Progress (1): 8.6/9.0 MB
14:49:01 [2026-10-20T12:49:01.004Z] Progress (1): 8.6/9.0 MB
14:49:01 [2026-10-20T12:49:01.004Z] Progress (1): 8.6/9.0 MB
14:49:01 [2026-10-20T12:49:01.004Z] Progress (1): 8.6/9.0 MB
14:49:01 [2026-10-20T12:49:01.004Z] Progress (1): 8.6/9.0 MB
14:49:01 [2026-10-20T12:49:01.004Z] Progress (1): 8.6/9.0 MB
14:49:01 [2026-10-20T12:49:01.004Z] Progress (1): 8.6/9.0 MB
14:49:01 [2026-10-20T12:49:01.004Z] Progress (1): 8.6/9.0 MB
14:49:01 [2026-10-20T12:49:01.004Z] Progress (1): 8.7/9.0 MB
14:49:01 [2026-10-20T12:49:01.004Z] Progress (1): 8.7/9.0 MB
14:49:01 [2026-10-20T12:49:01.004Z] Progress (1): 8.7/9.0 MB
14:49:01 [2026-10-20T12:49:01.004Z] Progress (1): 8.7/9.0 MB
14:49:01 [2026-10-20T12:49:01.004Z] Progress (1): 8.7/9.0 MB
14:49:01 [2026-10-20T12:49:01.004Z] Progress (1): 8.7/9.0 MB
14:49:01 [2026-10-20T12:49:01.004Z] Progress (1): 8.7/9.0 MB
14:49:01 [2026-10-20T12:49:01.004Z] Progress (1): 8.7/9.0 MB
14:49:01 [2026-10-20T12:49:01.004Z] Progress (1): 8.7/9.0 MB
14:49:01 [2026-10-20T12:49:01.004Z] Progress (1): 8.7/9.0 MB
14:49:01 [2026-10-20T12:49:01.004Z] Progress (1): 8.7/9.0 MB
14:49:01 [2026-10-20T12:49:01.004Z] Progress (1): 8.7/9.0 MB
14:49:01 [2026-10-20T12:49:01.004Z] Progress (1): 8.7/9.0 MB
14:49:01 [2026-10-20T12:49:01.004Z] Progress (1): 8.7/9.0 MB
14:49:01 [2026-10-20T12:49:01.004Z] Progress (1): 8.7/9.0 MB
14:49:01 [2026-10-20T12:49:01.004Z] Progress (1): 8.7/9.0 MB
14:49:01 [2026-10-20T12:49:01.004Z] Progress (1): 8.7/9.0 MB
14:49:01 [2026-10-20T12:49:01.004Z] Progress (1): 8.7/9.0 MB
14:49:01 [2026-10-20T12:49:01.004Z] Progress (1): 8.7/9.0 MB
14:49:01 [2026-10-20T12:49:01.004Z] Progress (1): 8.7/9.0 MB
14:49:01 [2026-10-20T12:49:01.004Z] Progress (1): 8.8/9.0 MB
14:49:01 [2026-10-20T12:49:01.004Z] Progress (1): 8.8/9.0 MB
14:49:01 [2026-10-20T12:49:01.004Z] Progress (1): 8.8/9.0 MB
14:49:01 [2026-10-20T12:49:01.004Z] Progress (1): 8.8/9.0 MB
14:49:01 [2026-10-20T12:49:01.004Z] Progress (1): 8.8/9.0 MB
14:49:01 [2026-10-20T12:49:01.004Z] Progress (1): 8.8/9.0 MB
14:49:01 [2026-10-20T12:49:01.004Z] Progress (1): 8.8/9.0 MB
14:49:01 [2026-10-20T12:49:01.004Z] Progress (1): 8.8/9.0 MB
14:49:01 [2026-10-20T12:49:01.004Z] Progress (1): 8.8/9.0 MB
14:49:01 [2026-10-20T12:49:01.004Z] Progress (1): 8.8/9.0 MB
14:49:01 [2026-10-20T12:49:01.004Z] Progress (1): 8.8/9.0 MB
14:49:01 [2026-10-20T12:49:01.004Z] Progress (1): 8.8/9.0 MB
14:49:01 [2026-10-20T12:49:01.004Z] Progress (1): 8.8/9.0 MB
14:49:01 [2026-10-20T12:49:01.004Z] Progress (1): 8.8/9.0 MB
14:49:01 [2026-10-20T12:49:01.004Z] Progress (1): 8.8/9.0 MB
14:49:01 [2026-10-20T12:49:01.004Z] Progress (1): 8.8/9.0 MB
14:49:01 [2026-10-20T12:49:01.004Z] Progress (1): 8.8/9.0 MB
14:49:01 [2026-10-20T12:49:01.004Z] Progress (1): 8.8/9.0 MB
14:49:01 [2026-10-20T12:49:01.004Z] Progress (1): 8.9/9.0 MB
14:49:01 [2026-10-20T12:49:01.004Z] Progress (1): 8.9/9.0 MB
14:49:01 [2026-10-20T12:49:01.004Z] Progress (1): 8.9/9.0 MB
14:49:01 [2026-10-20T12:49:01.004Z] Progress (1): 8.9/9.0 MB
14:49:01 [2026-10-20T12:49:01.004Z] Progress (1): 8.9/9.0 MB
14:49:01 [2026-10-20T12:49:01.004Z] Progress (1): 8.9/9.0 MB
14:49:01 [2026-10-20T12:49:01.004Z] Progress (1): 8.9/9.0 MB
14:49:01 [2026-10-20T12:49:01.004Z] Progress (1): 8.9/9.0 MB
14:49:01 [2026-10-20T12:49:01.004Z] Progress (1): 8.9/9.0 MB
14:49:01 [2026-10-20T12:49:01.004Z] Progress (1): 8.9/9.0 MB
14:49:01 [2026-10-20T12:49:01.004Z] Progress (1): 8.9/9.0 MB
14:49:01 [2026-10-20T12:49:01.004Z] Progress (1): 8.9/9.0 MB
14:49:01 [2026-10-20T12:49:01.004Z] Progress (1): 8.9/9.0 MB
14:49:01 [2026-10-20T12:49:01.004Z] Progress (1): 8.9/9.0 MB
14:49:01 [2026-10-20T12:49:01.004Z] Progress (1): 8.9/9.0 MB
14:49:01 [2026-10-20T12:49:01.004Z] Progress (1): 8.9/9.0 MB
14:49:01 [2026-10-20T12:49:01.004Z] Progress (1): 8.9/9.0 MB
14:49:01 [2026-10-20T12:49:01.004Z] Progress (1): 8.9/9.0 MB
14:49:01 [2026-10-20T12:49:01.004Z] Progress (1): 9.0/9.0 MB
14:49:01 [2026-10-20T12:49:01.004Z] Progress (1): 9.0/9.0 MB
14:49:01 [2026-10-20T12:49:01.004Z] Progress (1): 9.0/9.0 MB
14:49:01 [2026-10-20T12:49:01.004Z] Progress (1): 9.0/9.0 MB
14:49:01 [2026-10-20T12:49:01.004Z] Progress (1): 9.0/9.0 MB
14:49:01 [2026-10-20T12:49:01.004Z] Progress (1): 9.0/9.0 MB
14:49:01 [2026-10-20T12:49:01.004Z] Progress (1): 9.0/9.0 MB
14:49:01 [2026-10-20T12:49:01.004Z] Progress (1): 9.0/9.0 MB
14:49:01 [2026-10-20T12:49:01.004Z] Progress (1): 9.0/9.0 MB
14:49:01 [2026-10-20T12:49:01.004Z] Progress (1): 9.0/9.0 MB
14:49:01 [2026-10-20T12:49:01.004Z] Progress (1): 9.0/9.0 MB
14:49:01 [2026-10-20T12:49:01.004Z] Progress (1): 9.0/9.0 MB
14:49:01 [2026-10-20T12:49:01.004Z] Progress (1): 9.0 MB
14:49:01 [2026-10-20T12:49:01.004Z]
14:49:01 [2026-10-20T12:49:01.004Z] Downloaded from Silverpeas: https://nexus3.silverpeas.org/repository/silverpeas/net/bytebuddy/byte-buddy/1.17.7/byte-buddy-1.17.7.jar (9.0 MB at 36 MB/s)
14:49:01 [2026-10-20T12:49:01.004Z] [INFO]
14:49:01 [2026-10-20T12:49:01.004Z] [INFO] --- clean:3.2.0:clean (default-clean) @ silverpeas-kernel-test ---
14:49:01 [2026-10-20T12:49:01.004Z] [INFO]
14:49:01 [2026-10-20T12:49:01.004Z] [INFO] --- git-commit-id:4.9.10:revision (default) @ silverpeas-kernel-test ---
14:49:01 [2026-10-20T12:49:01.555Z] [INFO]
14:49:01 [2026-10-20T12:49:01.555Z] [INFO] --- jacoco:0.8.8:prepare-agent (default) @ silverpeas-kernel-test ---
14:49:01 [2026-10-20T12:49:01.555Z] [INFO] argLine set to -javaagent:/home/silverbuild/.m2/repository/org/jacoco/org.jacoco.agent/0.8.8/org.jacoco.agent-0.8.8-runtime.jar=destfile=/var/lib/jenkins/workspace/Silverpeas_Kernel_AutoDeploy/kernel-test/target/jacoco.exec
14:49:01 [2026-10-20T12:49:01.555Z] [INFO]
14:49:01 [2026-10-20T12:49:01.555Z] [INFO] --- resources:3.3.0:resources (default-resources) @ silverpeas-kernel-test ---
14:49:01 [2026-10-20T12:49:01.555Z] [INFO] Copying 4 resources
14:49:01 [2026-10-20T12:49:01.555Z] [INFO]
14:49:01 [2026-10-20T12:49:01.555Z] [INFO] --- compiler:3.10.1:compile (default-compile) @ silverpeas-kernel-test ---
14:49:01 [2026-10-20T12:49:01.555Z] [INFO] Changes detected - recompiling the module!
14:49:01 [2026-10-20T12:49:01.555Z] [INFO] Compiling 24 source files to /var/lib/jenkins/workspace/Silverpeas_Kernel_AutoDeploy/kernel-test/target/classes
14:49:02 [2026-10-20T12:49:02.105Z] [WARNING] unknown enum constant When.ALWAYS
14:49:02 [2026-10-20T12:49:02.105Z] [INFO]
14:49:02 [2026-10-20T12:49:02.105Z] [INFO] --- resources:3.3.0:testResources (default-testResources) @ silverpeas-kernel-test ---
14:49:02 [2026-10-20T12:49:02.105Z] [INFO] skip non existing resourceDirectory /var/lib/jenkins/workspace/Silverpeas_Kernel_AutoDeploy/kernel-test/src/test/resources
14:49:02 [2026-10-20T12:49:02.105Z] [INFO] skip non existing resourceDirectory /var/lib/jenkins/workspace/Silverpeas_Kernel_AutoDeploy/kernel-test/src/test/resources
14:49:02 [2026-10-20T12:49:02.105Z] [INFO]
14:49:02 [2026-10-20T12:49:02.105Z] [INFO] --- compiler:3.10.1:testCompile (default-testCompile) @ silverpeas-kernel-test ---
14:49:02 [2026-10-20T12:49:02.105Z] [INFO] Changes detected - recompiling the module!
14:49:02 [2026-10-20T12:49:02.105Z] [INFO] Compiling 16 source files to /var/lib/jenkins/workspace/Silverpeas_Kernel_AutoDeploy/kernel-test/target/test-classes
14:49:02 [2026-10-20T12:49:02.356Z] [INFO]
14:49:02 [2026-10-20T12:49:02.356Z] [INFO] --- surefire:2.22.2:test (default-test) @ silverpeas-kernel-test ---
14:49:02 [2026-10-20T12:49:02.356Z] [INFO]
14:49:02 [2026-10-20T12:49:02.356Z] [INFO] -------------------------------------------------------
14:49:02 [2026-10-20T12:49:02.356Z] [INFO] T E S T S
14:49:02 [2026-10-20T12:49:02.356Z] [INFO] -------------------------------------------------------
14:49:03 [2026-10-20T12:49:03.699Z] [INFO] Running org.silverpeas.kernel.test.extension.InjectFieldTest
14:49:03 [2026-10-20T12:49:03.699Z] [INFO] Tests run: 2, Failures: 0, Errors: 0, Skipped: 0, Time elapsed: 0.1 s - in org.silverpeas.kernel.test.extension.InjectFieldTest
14:49:03 [2026-10-20T12:49:03.699Z] [INFO] Running org.silverpeas.kernel.test.extension.ManagedBeanFieldTest
14:49:03 [2026-10-20T12:49:03.949Z] Mockito is currently self-attaching to enable the inline-mock-maker. This will no longer work in future releases of the JDK. Please add Mockito as an agent to your build as described in Mockito's documentation: https://javadoc.io/doc/org.mockito/mockito-core/latest/org.mockito/org/mockito/Mockito.html#0.3
14:49:03 [2026-10-20T12:49:03.949Z] java.lang.instrument.IllegalClassFormatException: Error while instrumenting com/sun/tools/attach/VirtualMachine with JaCoCo 0.8.8.202204050719/5dcf34a.
14:49:03 [2026-10-20T12:49:03.949Z] at org.jacoco.agent.rt.internal_b6258fc.CoverageTransformer.transform(CoverageTransformer.java:94)
14:49:03 [2026-10-20T12:49:03.949Z] at java.instrument/java.lang.instrument.ClassFileTransformer.transform(ClassFileTransformer.java:244)
14:49:03 [2026-10-20T12:49:03.949Z] at java.instrument/sun.instrument.TransformerManager.transform(TransformerManager.java:188)
14:49:03 [2026-10-20T12:49:03.949Z] at java.instrument/sun.instrument.InstrumentationImpl.transform(InstrumentationImpl.java:610)
14:49:03 [2026-10-20T12:49:03.949Z] at java.base/java.lang.ClassLoader.defineClass2(Native Method)
14:49:03 [2026-10-20T12:49:03.949Z] at java.base/java.lang.ClassLoader.defineClass(ClassLoader.java:1118)
14:49:03 [2026-10-20T12:49:03.949Z] at java.base/java.security.SecureClassLoader.defineClass(SecureClassLoader.java:182)
14:49:03 [2026-10-20T12:49:03.949Z] at java.base/jdk.internal.loader.BuiltinClassLoader.defineClass(BuiltinClassLoader.java:821)
14:49:03 [2026-10-20T12:49:03.949Z] at java.base/jdk.internal.loader.BuiltinClassLoader.findClassInModuleOrNull(BuiltinClassLoader.java:741)
14:49:03 [2026-10-20T12:49:03.949Z] at java.base/jdk.internal.loader.BuiltinClassLoader.loadClassOrNull(BuiltinClassLoader.java:665)
14:49:03 [2026-10-20T12:49:03.949Z] at java.base/jdk.internal.loader.BuiltinClassLoader.loadClass(BuiltinClassLoader.java:639)
14:49:03 [2026-10-20T12:49:03.949Z] at java.base/jdk.internal.loader.ClassLoaders$AppClassLoader.loadClass(ClassLoaders.java:188)
14:49:03 [2026-10-20T12:49:03.949Z] at java.base/java.lang.ClassLoader.loadClass(ClassLoader.java:526)
14:49:03 [2026-10-20T12:49:03.949Z] at java.base/java.lang.Class.forName0(Native Method)
14:49:03 [2026-10-20T12:49:03.949Z] at java.base/java.lang.Class.forName(Class.java:536)
14:49:03 [2026-10-20T12:49:03.949Z] at java.base/java.lang.Class.forName(Class.java:515)
14:49:03 [2026-10-20T12:49:03.950Z] at net.bytebuddy.agent.ByteBuddyAgent$AttachmentProvider$Accessor$Simple.of(ByteBuddyAgent.java:955)
14:49:03 [2026-10-20T12:49:03.950Z] at net.bytebuddy.agent.ByteBuddyAgent$AttachmentProvider$ForModularizedVm.attempt(ByteBuddyAgent.java:1079)
14:49:03 [2026-10-20T12:49:03.950Z] at net.bytebuddy.agent.ByteBuddyAgent$AttachmentProvider$Compound.attempt(ByteBuddyAgent.java:1259)
14:49:03 [2026-10-20T12:49:03.950Z] at net.bytebuddy.agent.ByteBuddyAgent.install(ByteBuddyAgent.java:593)
14:49:03 [2026-10-20T12:49:03.950Z] at net.bytebuddy.agent.ByteBuddyAgent.install(ByteBuddyAgent.java:579)
14:49:03 [2026-10-20T12:49:03.950Z] at net.bytebuddy.agent.ByteBuddyAgent.install(ByteBuddyAgent.java:531)
14:49:03 [2026-10-20T12:49:03.950Z] at net.bytebuddy.agent.ByteBuddyAgent.install(ByteBuddyAgent.java:508)
14:49:03 [2026-10-20T12:49:03.950Z] at org.mockito.internal.PremainAttachAccess.getInstrumentation(PremainAttachAccess.java:80)
14:49:03 [2026-10-20T12:49:03.950Z] at org.mockito.internal.creation.bytebuddy.InlineDelegateByteBuddyMockMaker.<clinit>(InlineDelegateByteBuddyMockMaker.java:138)
14:49:03 [2026-10-20T12:49:03.950Z] at org.mockito.internal.creation.bytebuddy.InlineByteBuddyMockMaker.<init>(InlineByteBuddyMockMaker.java:23)
14:49:03 [2026-10-20T12:49:03.950Z] at java.base/jdk.internal.reflect.DirectConstructorHandleAccessor.newInstance(DirectConstructorHandleAccessor.java:62)
14:49:03 [2026-10-20T12:49:03.950Z] at java.base/java.lang.reflect.Constructor.newInstanceWithCaller(Constructor.java:502)
14:49:03 [2026-10-20T12:49:03.950Z] at java.base/java.lang.reflect.Constructor.newInstance(Constructor.java:486)
14:49:03 [2026-10-20T12:49:03.950Z] at org.mockito.internal.configuration.plugins.DefaultMockitoPlugins.create(DefaultMockitoPlugins.java:103)
14:49:03 [2026-10-20T12:49:03.950Z] at org.mockito.internal.configuration.plugins.DefaultMockitoPlugins.getDefaultPlugin(DefaultMockitoPlugins.java:79)
14:49:03 [2026-10-20T12:49:03.950Z] at org.mockito.internal.configuration.plugins.PluginLoader.loadPlugin(PluginLoader.java:75)
14:49:03 [2026-10-20T12:49:03.950Z] at org.mockito.internal.configuration.plugins.PluginLoader.loadPlugin(PluginLoader.java:49)
14:49:03 [2026-10-20T12:49:03.950Z] at org.mockito.internal.configuration.plugins.PluginRegistry.<init>(PluginRegistry.java:29)
14:49:03 [2026-10-20T12:49:03.950Z] at org.mockito.internal.configuration.plugins.Plugins.<clinit>(Plugins.java:26)
14:49:03 [2026-10-20T12:49:03.950Z] at org.mockito.internal.util.MockUtil.<clinit>(MockUtil.java:32)
14:49:03 [2026-10-20T12:49:03.950Z] at org.silverpeas.kernel.test.extension.SilverTestEnv.registerInBeanContainer(SilverTestEnv.java:399)
14:49:03 [2026-10-20T12:49:03.950Z] at org.silverpeas.kernel.test.extension.SilverTestEnv.registerFieldBean(SilverTestEnv.java:357)
14:49:03 [2026-10-20T12:49:03.950Z] at org.silverpeas.kernel.test.extension.SilverTestEnv.setupTestInstanceField(SilverTestEnv.java:345)
14:49:03 [2026-10-20T12:49:03.950Z] at org.silverpeas.kernel.test.extension.SilverTestEnv.processTestManagedBeanAnnotation(SilverTestEnv.java:298)
14:49:03 [2026-10-20T12:49:03.950Z] at org.silverpeas.kernel.test.extension.SilverTestEnv.lambda$postProcessTestInstance$0(SilverTestEnv.java:176)
14:49:03 [2026-10-20T12:49:03.950Z] at org.silverpeas.kernel.test.util.Reflections.loopInheritance(Reflections.java:68)
14:49:03 [2026-10-20T12:49:03.950Z] at org.silverpeas.kernel.test.extension.SilverTestEnv.postProcessTestInstance(SilverTestEnv.java:172)
14:49:03 [2026-10-20T12:49:03.950Z] at org.junit.jupiter.engine.descriptor.ClassBasedTestDescriptor.lambda$invokeTestInstancePostProcessors$12(ClassBasedTestDescriptor.java:421)
14:49:03 [2026-10-20T12:49:03.950Z] at org.junit.jupiter.engine.descriptor.ClassBasedTestDescriptor.executeAndMaskThrowable(ClassBasedTestDescriptor.java:426)
14:49:03 [2026-10-20T12:49:03.950Z] at org.junit.jupiter.engine.descriptor.ClassBasedTestDescriptor.lambda$invokeTestInstancePostProcessors$13(ClassBasedTestDescriptor.java:420)
14:49:03 [2026-10-20T12:49:03.950Z] at java.base/java.util.stream.ForEachOps$ForEachOp$OfRef.accept(ForEachOps.java:184)
14:49:03 [2026-10-20T12:49:03.950Z] at java.base/java.util.stream.ReferencePipeline$3$1.accept(ReferencePipeline.java:197)
14:49:03 [2026-10-20T12:49:03.950Z] at java.base/java.util.stream.ReferencePipeline$2$1.accept(ReferencePipeline.java:179)
14:49:03 [2026-10-20T12:49:03.950Z] at java.base/java.util.stream.ReferencePipeline$3$1.accept(ReferencePipeline.java:197)
14:49:03 [2026-10-20T12:49:03.950Z] at java.base/java.util.ArrayList$ArrayListSpliterator.forEachRemaining(ArrayList.java:1708)
14:49:03 [2026-10-20T12:49:03.950Z] at java.base/java.util.stream.AbstractPipeline.copyInto(AbstractPipeline.java:509)
14:49:03 [2026-10-20T12:49:03.950Z] at java.base/java.util.stream.AbstractPipeline.wrapAndCopyInto(AbstractPipeline.java:499)
14:49:03 [2026-10-20T12:49:03.950Z] at java.base/java.util.stream.ForEachOps$ForEachOp.evaluateSequential(ForEachOps.java:151)
14:49:03 [2026-10-20T12:49:03.950Z] at java.base/java.util.stream.ForEachOps$ForEachOp$OfRef.evaluateSequential(ForEachOps.java:174)
14:49:03 [2026-10-20T12:49:03.950Z] at java.base/java.util.stream.AbstractPipeline.evaluate(AbstractPipeline.java:234)
14:49:03 [2026-10-20T12:49:03.950Z] at java.base/java.util.stream.ReferencePipeline.forEach(ReferencePipeline.java:596)
14:49:03 [2026-10-20T12:49:03.950Z] at org.junit.jupiter.engine.descriptor.ClassBasedTestDescriptor.invokeTestInstancePostProcessors(ClassBasedTestDescriptor.java:420)
14:49:03 [2026-10-20T12:49:03.950Z] at org.junit.jupiter.engine.descriptor.ClassBasedTestDescriptor.lambda$instantiateAndPostProcessTestInstance$8(ClassBasedTestDescriptor.java:331)
14:49:03 [2026-10-20T12:49:03.950Z] at org.junit.platform.engine.support.hierarchical.ThrowableCollector.execute(ThrowableCollector.java:73)
14:49:03 [2026-10-20T12:49:03.950Z] at org.junit.jupiter.engine.descriptor.ClassBasedTestDescriptor.instantiateAndPostProcessTestInstance(ClassBasedTestDescriptor.java:330)
14:49:03 [2026-10-20T12:49:03.950Z] at org.junit.jupiter.engine.descriptor.ClassBasedTestDescriptor.lambda$testInstancesProvider$6(ClassBasedTestDescriptor.java:319)
14:49:03 [2026-10-20T12:49:03.950Z] at java.base/java.util.Optional.orElseGet(Optional.java:364)
14:49:03 [2026-10-20T12:49:03.950Z] at org.junit.jupiter.engine.descriptor.ClassBasedTestDescriptor.lambda$testInstancesProvider$7(ClassBasedTestDescriptor.java:318)
14:49:03 [2026-10-20T12:49:03.950Z] at org.junit.jupiter.engine.execution.TestInstancesProvider.getTestInstances(TestInstancesProvider.java:27)
14:49:03 [2026-10-20T12:49:03.950Z] at org.junit.jupiter.engine.descriptor.TestMethodTestDescriptor.lambda$prepare$0(TestMethodTestDescriptor.java:129)
14:49:03 [2026-10-20T12:49:03.950Z] at org.junit.platform.engine.support.hierarchical.ThrowableCollector.execute(ThrowableCollector.java:73)
14:49:03 [2026-10-20T12:49:03.950Z] at org.junit.jupiter.engine.descriptor.TestMethodTestDescriptor.prepare(TestMethodTestDescriptor.java:128)
14:49:03 [2026-10-20T12:49:03.950Z] at org.junit.jupiter.engine.descriptor.TestMethodTestDescriptor.prepare(TestMethodTestDescriptor.java:70)
14:49:03 [2026-10-20T12:49:03.950Z] at org.junit.platform.engine.support.hierarchical.NodeTestTask.lambda$prepare$2(NodeTestTask.java:129)
14:49:03 [2026-10-20T12:49:03.950Z] at org.junit.platform.engine.support.hierarchical.ThrowableCollector.execute(ThrowableCollector.java:73)
14:49:03 [2026-10-20T12:49:03.950Z] at org.junit.platform.engine.support.hierarchical.NodeTestTask.prepare(NodeTestTask.java:129)
14:49:03 [2026-10-20T12:49:03.950Z] at org.junit.platform.engine.support.hierarchical.NodeTestTask.execute(NodeTestTask.java:96)
14:49:03 [2026-10-20T12:49:03.950Z] at org.junit.platform.engine.support.hierarchical.ForkJoinPoolHierarchicalTestExecutorService$ExclusiveTask.exec(ForkJoinPoolHierarchicalTestExecutorService.java:274)
14:49:03 [2026-10-20T12:49:03.950Z] at org.junit.platform.engine.support.hierarchical.ForkJoinPoolHierarchicalTestExecutorService$ExclusiveTask.execSync(ForkJoinPoolHierarchicalTestExecutorService.java:247)
14:49:03 [2026-10-20T12:49:03.950Z] at org.junit.platform.engine.support.hierarchical.ForkJoinPoolHierarchicalTestExecutorService.executeSync(ForkJoinPoolHierarchicalTestExecutorService.java:194)
14:49:03 [2026-10-20T12:49:03.950Z] at org.junit.platform.engine.support.hierarchical.ForkJoinPoolHierarchicalTestExecutorService.invokeAll(ForkJoinPoolHierarchicalTestExecutorService.java:166)
14:49:03 [2026-10-20T12:49:03.950Z] at org.junit.platform.engine.support.hierarchical.NodeTestTask.lambda$executeRecursively$6(NodeTestTask.java:161)
14:49:03 [2026-10-20T12:49:03.950Z] at org.junit.platform.engine.support.hierarchical.ThrowableCollector.execute(ThrowableCollector.java:73)
14:49:03 [2026-10-20T12:49:03.950Z] at org.junit.platform.engine.support.hierarchical.NodeTestTask.lambda$executeRecursively$8(NodeTestTask.java:147)
14:49:03 [2026-10-20T12:49:03.950Z] at org.junit.platform.engine.support.hierarchical.Node.around(Node.java:137)
14:49:03 [2026-10-20T12:49:03.950Z] at org.junit.platform.engine.support.hierarchical.NodeTestTask.lambda$executeRecursively$9(NodeTestTask.java:145)
14:49:03 [2026-10-20T12:49:03.950Z] at org.junit.platform.engine.support.hierarchical.ThrowableCollector.execute(ThrowableCollector.java:73)
14:49:03 [2026-10-20T12:49:03.950Z] at org.junit.platform.engine.support.hierarchical.NodeTestTask.executeRecursively(NodeTestTask.java:144)
14:49:03 [2026-10-20T12:49:03.950Z] at org.junit.platform.engine.support.hierarchical.NodeTestTask.execute(NodeTestTask.java:101)
14:49:03 [2026-10-20T12:49:03.950Z] at org.junit.platform.engine.support.hierarchical.ForkJoinPoolHierarchicalTestExecutorService$ExclusiveTask.exec(ForkJoinPoolHierarchicalTestExecutorService.java:274)
14:49:03 [2026-10-20T12:49:03.950Z] at org.junit.platform.engine.support.hierarchical.ForkJoinPoolHierarchicalTestExecutorService$ExclusiveTask.execSync(ForkJoinPoolHierarchicalTestExecutorService.java:247)
14:49:03 [2026-10-20T12:49:03.950Z] at org.junit.platform.engine.support.hierarchical.ForkJoinPoolHierarchicalTestExecutorService.executeSync(ForkJoinPoolHierarchicalTestExecutorService.java:194)
14:49:03 [2026-10-20T12:49:03.950Z] at org.junit.platform.engine.support.hierarchical.ForkJoinPoolHierarchicalTestExecutorService.invokeAll(ForkJoinPoolHierarchicalTestExecutorService.java:166)
14:49:03 [2026-10-20T12:49:03.950Z] at org.junit.platform.engine.support.hierarchical.NodeTestTask.lambda$executeRecursively$6(NodeTestTask.java:161)
14:49:03 [2026-10-20T12:49:03.950Z] at org.junit.platform.engine.support.hierarchical.ThrowableCollector.execute(ThrowableCollector.java:73)
14:49:03 [2026-10-20T12:49:03.950Z] at org.junit.platform.engine.support.hierarchical.NodeTestTask.lambda$executeRecursively$8(NodeTestTask.java:147)
14:49:03 [2026-10-20T12:49:03.950Z] at org.junit.platform.engine.support.hierarchical.Node.around(Node.java:137)
14:49:03 [2026-10-20T12:49:03.951Z] at org.junit.platform.engine.support.hierarchical.NodeTestTask.lambda$executeRecursively$9(NodeTestTask.java:145)
14:49:03 [2026-10-20T12:49:03.951Z] at org.junit.platform.engine.support.hierarchical.ThrowableCollector.execute(ThrowableCollector.java:73)
14:49:03 [2026-10-20T12:49:03.951Z] at org.junit.platform.engine.support.hierarchical.NodeTestTask.executeRecursively(NodeTestTask.java:144)
14:49:03 [2026-10-20T12:49:03.951Z] at org.junit.platform.engine.support.hierarchical.NodeTestTask.execute(NodeTestTask.java:101)
14:49:03 [2026-10-20T12:49:03.951Z] at org.junit.platform.engine.support.hierarchical.ForkJoinPoolHierarchicalTestExecutorService$ExclusiveTask.exec(ForkJoinPoolHierarchicalTestExecutorService.java:274)
14:49:03 [2026-10-20T12:49:03.951Z] at java.base/java.util.concurrent.ForkJoinTask.doExec(ForkJoinTask.java:387)
14:49:03 [2026-10-20T12:49:03.951Z] at java.base/java.util.concurrent.ForkJoinPool$WorkQueue.topLevelExec(ForkJoinPool.java:1312)
14:49:03 [2026-10-20T12:49:03.951Z] at java.base/java.util.concurrent.ForkJoinPool.scan(ForkJoinPool.java:1843)
14:49:03 [2026-10-20T12:49:03.951Z] at java.base/java.util.concurrent.ForkJoinPool.runWorker(ForkJoinPool.java:1808)
14:49:03 [2026-10-20T12:49:03.951Z] at java.base/java.util.concurrent.ForkJoinWorkerThread.run(ForkJoinWorkerThread.java:188)
14:49:03 [2026-10-20T12:49:03.951Z] Caused by: java.io.IOException: Error while instrumenting com/sun/tools/attach/VirtualMachine with JaCoCo 0.8.8.202204050719/5dcf34a.
14:49:03 [2026-10-20T12:49:03.951Z] at org.jacoco.agent.rt.internal_b6258fc.core.instr.Instrumenter.instrumentError(Instrumenter.java:161)
14:49:03 [2026-10-20T12:49:03.951Z] at org.jacoco.agent.rt.internal_b6258fc.core.instr.Instrumenter.instrument(Instrumenter.java:111)
14:49:03 [2026-10-20T12:49:03.951Z] at org.jacoco.agent.rt.internal_b6258fc.CoverageTransformer.transform(CoverageTransformer.java:92)
14:49:03 [2026-10-20T12:49:03.951Z] ... 102 more
14:49:03 [2026-10-20T12:49:03.951Z] Caused by: java.lang.IllegalArgumentException: Unsupported class file major version 65
14:49:03 [2026-10-20T12:49:03.951Z] at org.jacoco.agent.rt.internal_b6258fc.asm.ClassReader.<init>(ClassReader.java:199)
14:49:03 [2026-10-20T12:49:03.951Z] at org.jacoco.agent.rt.internal_b6258fc.asm.ClassReader.<init>(ClassReader.java:180)
14:49:03 [2026-10-20T12:49:03.951Z] at org.jacoco.agent.rt.internal_b6258fc.asm.ClassReader.<init>(ClassReader.java:166)
14:49:03 [2026-10-20T12:49:03.951Z] at org.jacoco.agent.rt.internal_b6258fc.core.internal.instr.InstrSupport.classReaderFor(InstrSupport.java:280)
14:49:03 [2026-10-20T12:49:03.951Z] at org.jacoco.agent.rt.internal_b6258fc.core.instr.Instrumenter.instrument(Instrumenter.java:77)
14:49:03 [2026-10-20T12:49:03.951Z] at org.jacoco.agent.rt.internal_b6258fc.core.instr.Instrumenter.instrument(Instrumenter.java:109)
14:49:03 [2026-10-20T12:49:03.951Z] ... 103 more
14:49:04 [2026-10-20T12:49:04.201Z] WARNING: A Java agent has been loaded dynamically (/home/silverbuild/.m2/repository/net/bytebuddy/byte-buddy-agent/1.17.7/byte-buddy-agent-1.17.7.jar)
14:49:04 [2026-10-20T12:49:04.201Z] WARNING: If a serviceability tool is in use, please run with -XX:+EnableDynamicAgentLoading to hide this warning
14:49:04 [2026-10-20T12:49:04.201Z] WARNING: If a serviceability tool is not in use, please run with -Djdk.instrument.traceUsage for more information
14:49:04 [2026-10-20T12:49:04.201Z] WARNING: Dynamic loading of agents will be disallowed by default in a future release
14:49:05 [2026-10-20T12:49:05.112Z] [INFO] Tests run: 2, Failures: 0, Errors: 0, Skipped: 0, Time elapsed: 1.209 s - in org.silverpeas.kernel.test.extension.ManagedBeanFieldTest
14:49:05 [2026-10-20T12:49:05.112Z] [INFO] Running org.silverpeas.kernel.test.extension.ManagedMockParameterTest
14:49:05 [2026-10-20T12:49:05.362Z] [INFO] Tests run: 2, Failures: 0, Errors: 0, Skipped: 0, Time elapsed: 0.336 s - in org.silverpeas.kernel.test.extension.ManagedMockParameterTest
14:49:05 [2026-10-20T12:49:05.362Z] [INFO] Running org.silverpeas.kernel.test.extension.ManagedMockFieldTest
14:49:05 [2026-10-20T12:49:05.613Z] [INFO] Tests run: 2, Failures: 0, Errors: 0, Skipped: 0, Time elapsed: 0.124 s - in org.silverpeas.kernel.test.extension.ManagedMockFieldTest
14:49:05 [2026-10-20T12:49:05.613Z] [INFO] Running org.silverpeas.kernel.test.extension.ManagedMocksTest
14:49:05 [2026-10-20T12:49:05.613Z] [INFO] Tests run: 4, Failures: 0, Errors: 0, Skipped: 0, Time elapsed: 0.056 s - in org.silverpeas.kernel.test.extension.ManagedMocksTest
14:49:05 [2026-10-20T12:49:05.613Z] [INFO] Running org.silverpeas.kernel.test.extension.ManagedBeanParameterTest
14:49:05 [2026-10-20T12:49:05.613Z] [INFO] Tests run: 2, Failures: 0, Errors: 0, Skipped: 0, Time elapsed: 0.013 s - in org.silverpeas.kernel.test.extension.ManagedBeanParameterTest
14:49:05 [2026-10-20T12:49:05.613Z] [INFO] Running org.silverpeas.kernel.test.extension.ManagedBeansTest
14:49:05 [2026-10-20T12:49:05.613Z] [INFO] Tests run: 4, Failures: 0, Errors: 0, Skipped: 0, Time elapsed: 0.016 s - in org.silverpeas.kernel.test.extension.ManagedBeansTest
14:49:05 [2026-10-20T12:49:05.613Z] [INFO] Running org.silverpeas.kernel.test.extension.ValuatedManagedBeanFieldTest
14:49:05 [2026-10-20T12:49:05.613Z] [INFO] Tests run: 2, Failures: 0, Errors: 0, Skipped: 0, Time elapsed: 0.008 s - in org.silverpeas.kernel.test.extension.ValuatedManagedBeanFieldTest
14:49:05 [2026-10-20T12:49:05.613Z] [INFO] Running org.silverpeas.kernel.test.extension.ManagedBeanMockFieldParameterTest
14:49:05 [2026-10-20T12:49:05.613Z] [INFO] Tests run: 3, Failures: 0, Errors: 0, Skipped: 0, Time elapsed: 0.016 s - in org.silverpeas.kernel.test.extension.ManagedBeanMockFieldParameterTest
14:49:05 [2026-10-20T12:49:05.613Z] [INFO] Running org.silverpeas.kernel.test.TestBeanContainerTest
14:49:05 [2026-10-20T12:49:05.613Z] [INFO] Tests run: 13, Failures: 0, Errors: 0, Skipped: 0, Time elapsed: 0.042 s - in org.silverpeas.kernel.test.TestBeanContainerTest
14:49:05 [2026-10-20T12:49:05.613Z] [INFO] Running org.silverpeas.kernel.test.DependencyResolverTest
14:49:05 [2026-10-20T12:49:05.863Z] java.lang.instrument.IllegalClassFormatException: Error while instrumenting org/silverpeas/kernel/test/MyBean$MockitoMock$sz7oczFT with JaCoCo 0.8.8.202204050719/5dcf34a.
14:49:05 [2026-10-20T12:49:05.863Z] at org.jacoco.agent.rt.internal_b6258fc.CoverageTransformer.transform(CoverageTransformer.java:94)
14:49:05 [2026-10-20T12:49:05.863Z] at java.instrument/java.lang.instrument.ClassFileTransformer.transform(ClassFileTransformer.java:244)
14:49:05 [2026-10-20T12:49:05.863Z] at java.instrument/sun.instrument.TransformerManager.transform(TransformerManager.java:188)
14:49:05 [2026-10-20T12:49:05.863Z] at java.instrument/sun.instrument.InstrumentationImpl.transform(InstrumentationImpl.java:610)
14:49:05 [2026-10-20T12:49:05.863Z] at java.base/java.lang.ClassLoader.defineClass0(Native Method)
14:49:05 [2026-10-20T12:49:05.863Z] at java.base/java.lang.System$2.defineClass(System.java:2395)
14:49:05 [2026-10-20T12:49:05.863Z] at java.base/java.lang.invoke.MethodHandles$Lookup$ClassDefiner.defineClass(MethodHandles.java:2505)
14:49:05 [2026-10-20T12:49:05.863Z] at java.base/java.lang.invoke.MethodHandles$Lookup$ClassDefiner.defineClass(MethodHandles.java:2480)
14:49:05 [2026-10-20T12:49:05.863Z] at java.base/java.lang.invoke.MethodHandles$Lookup.defineClass(MethodHandles.java:1865)
14:49:05 [2026-10-20T12:49:05.863Z] at java.base/jdk.internal.reflect.DirectMethodHandleAccessor.invoke(DirectMethodHandleAccessor.java:103)
14:49:05 [2026-10-20T12:49:05.863Z] at java.base/java.lang.reflect.Method.invoke(Method.java:580)
14:49:05 [2026-10-20T12:49:05.863Z] at net.bytebuddy.utility.Invoker$Dispatcher.invoke(Unknown Source)
14:49:05 [2026-10-20T12:49:05.863Z] at net.bytebuddy.utility.dispatcher.JavaDispatcher$Dispatcher$ForNonStaticMethod.invoke(JavaDispatcher.java:1033)
14:49:05 [2026-10-20T12:49:05.863Z] at net.bytebuddy.utility.dispatcher.JavaDispatcher$ProxiedInvocationHandler.invoke(JavaDispatcher.java:1163)
14:49:05 [2026-10-20T12:49:05.863Z] at jdk.proxy2/jdk.proxy2.$Proxy75.defineClass(Unknown Source)
14:49:05 [2026-10-20T12:49:05.863Z] at net.bytebuddy.dynamic.loading.ClassInjector$UsingLookup.injectRaw(ClassInjector.java:1686)
14:49:05 [2026-10-20T12:49:05.863Z] at net.bytebuddy.dynamic.loading.ClassInjector$AbstractBase.injectRaw(ClassInjector.java:167)
14:49:05 [2026-10-20T12:49:05.863Z] at net.bytebuddy.dynamic.loading.ClassInjector$AbstractBase.inject(ClassInjector.java:155)
14:49:05 [2026-10-20T12:49:05.863Z] at net.bytebuddy.dynamic.loading.ClassLoadingStrategy$UsingLookup.load(ClassLoadingStrategy.java:519)
14:49:05 [2026-10-20T12:49:05.863Z] at net.bytebuddy.dynamic.TypeResolutionStrategy$Passive.initialize(TypeResolutionStrategy.java:101)
14:49:05 [2026-10-20T12:49:05.863Z] at net.bytebuddy.dynamic.DynamicType$Default$Unloaded.load(DynamicType.java:6432)
14:49:05 [2026-10-20T12:49:05.863Z] at org.mockito.internal.creation.bytebuddy.SubclassBytecodeGenerator.mockClass(SubclassBytecodeGenerator.java:282)
14:49:05 [2026-10-20T12:49:05.863Z] at org.mockito.internal.creation.bytebuddy.TypeCachingBytecodeGenerator.lambda$mockClass$0(TypeCachingBytecodeGenerator.java:78)
14:49:05 [2026-10-20T12:49:05.863Z] at net.bytebuddy.TypeCache.findOrInsert(TypeCache.java:168)
14:49:05 [2026-10-20T12:49:05.863Z] at net.bytebuddy.TypeCache$WithInlineExpunction.findOrInsert(TypeCache.java:399)
14:49:05 [2026-10-20T12:49:05.863Z] at net.bytebuddy.TypeCache.findOrInsert(TypeCache.java:190)
14:49:05 [2026-10-20T12:49:05.863Z] at net.bytebuddy.TypeCache$WithInlineExpunction.findOrInsert(TypeCache.java:410)
14:49:05 [2026-10-20T12:49:05.863Z] at org.mockito.internal.creation.bytebuddy.TypeCachingBytecodeGenerator.mockClass(TypeCachingBytecodeGenerator.java:75)
14:49:05 [2026-10-20T12:49:05.863Z] at org.mockito.internal.creation.bytebuddy.InlineBytecodeGenerator.mockClass(InlineBytecodeGenerator.java:223)
14:49:05 [2026-10-20T12:49:05.863Z] at org.mockito.internal.creation.bytebuddy.TypeCachingBytecodeGenerator.lambda$mockClass$0(TypeCachingBytecodeGenerator.java:78)
14:49:05 [2026-10-20T12:49:05.863Z] at net.bytebuddy.TypeCache.findOrInsert(TypeCache.java:168)
14:49:05 [2026-10-20T12:49:05.863Z] at net.bytebuddy.TypeCache$WithInlineExpunction.findOrInsert(TypeCache.java:399)
14:49:05 [2026-10-20T12:49:05.863Z] at net.bytebuddy.TypeCache.findOrInsert(TypeCache.java:190)
14:49:05 [2026-10-20T12:49:05.863Z] at net.bytebuddy.TypeCache$WithInlineExpunction.findOrInsert(TypeCache.java:410)
14:49:05 [2026-10-20T12:49:05.863Z] at org.mockito.internal.creation.bytebuddy.TypeCachingBytecodeGenerator.mockClass(TypeCachingBytecodeGenerator.java:75)
14:49:05 [2026-10-20T12:49:05.863Z] at org.mockito.internal.creation.bytebuddy.InlineDelegateByteBuddyMockMaker.createMockType(InlineDelegateByteBuddyMockMaker.java:429)
14:49:05 [2026-10-20T12:49:05.863Z] at org.mockito.internal.creation.bytebuddy.InlineDelegateByteBuddyMockMaker.doCreateMock(InlineDelegateByteBuddyMockMaker.java:388)
14:49:05 [2026-10-20T12:49:05.863Z] at org.mockito.internal.creation.bytebuddy.InlineDelegateByteBuddyMockMaker.createMock(InlineDelegateByteBuddyMockMaker.java:367)
14:49:05 [2026-10-20T12:49:05.863Z] at org.mockito.internal.creation.bytebuddy.InlineByteBuddyMockMaker.createMock(InlineByteBuddyMockMaker.java:56)
14:49:05 [2026-10-20T12:49:05.863Z] at org.mockito.internal.util.MockUtil.createMock(MockUtil.java:99)
14:49:05 [2026-10-20T12:49:05.863Z] at org.mockito.internal.MockitoCore.mock(MockitoCore.java:84)
14:49:05 [2026-10-20T12:49:05.863Z] at org.mockito.Mockito.mock(Mockito.java:2198)
14:49:05 [2026-10-20T12:49:05.863Z] at org.mockito.Mockito.mock(Mockito.java:2113)
14:49:05 [2026-10-20T12:49:05.863Z] at org.silverpeas.kernel.test.DependencyResolver.resolveDependency(DependencyResolver.java:155)
14:49:05 [2026-10-20T12:49:05.863Z] at org.silverpeas.kernel.test.DependencyResolver.lambda$resolve$1(DependencyResolver.java:105)
14:49:05 [2026-10-20T12:49:05.863Z] at java.base/java.util.Optional.orElseGet(Optional.java:364)
14:49:05 [2026-10-20T12:49:05.863Z] at org.silverpeas.kernel.test.DependencyResolver.lambda$resolve$2(DependencyResolver.java:105)
14:49:05 [2026-10-20T12:49:05.863Z] at java.base/java.util.stream.ForEachOps$ForEachOp$OfRef.accept(ForEachOps.java:184)
14:49:05 [2026-10-20T12:49:05.863Z] at java.base/java.util.stream.ReferencePipeline$2$1.accept(ReferencePipeline.java:179)
14:49:05 [2026-10-20T12:49:05.863Z] at java.base/java.util.Spliterators$ArraySpliterator.forEachRemaining(Spliterators.java:1024)
14:49:05 [2026-10-20T12:49:05.863Z] at java.base/java.util.stream.AbstractPipeline.copyInto(AbstractPipeline.java:509)
14:49:05 [2026-10-20T12:49:05.863Z] at java.base/java.util.stream.AbstractPipeline.wrapAndCopyInto(AbstractPipeline.java:499)
14:49:05 [2026-10-20T12:49:05.863Z] at java.base/java.util.stream.ForEachOps$ForEachOp.evaluateSequential(ForEachOps.java:151)
14:49:05 [2026-10-20T12:49:05.863Z] at java.base/java.util.stream.ForEachOps$ForEachOp$OfRef.evaluateSequential(ForEachOps.java:174)
14:49:05 [2026-10-20T12:49:05.863Z] at java.base/java.util.stream.AbstractPipeline.evaluate(AbstractPipeline.java:234)
14:49:05 [2026-10-20T12:49:05.863Z] at java.base/java.util.stream.ReferencePipeline.forEach(ReferencePipeline.java:596)
14:49:05 [2026-10-20T12:49:05.863Z] at org.silverpeas.kernel.test.DependencyResolver.lambda$resolve$3(DependencyResolver.java:102)
14:49:05 [2026-10-20T12:49:05.863Z] at org.silverpeas.kernel.test.util.Reflections.loopInheritance(Reflections.java:68)
14:49:05 [2026-10-20T12:49:05.863Z] at org.silverpeas.kernel.test.DependencyResolver.resolve(DependencyResolver.java:98)
14:49:05 [2026-10-20T12:49:05.863Z] at org.silverpeas.kernel.test.DependencyResolverTest.genericInjectionIsMockedWhenNoManagedBeanIsAvailable(DependencyResolverTest.java:67)
14:49:05 [2026-10-20T12:49:05.863Z] at java.base/jdk.internal.reflect.DirectMethodHandleAccessor.invoke(DirectMethodHandleAccessor.java:103)
14:49:05 [2026-10-20T12:49:05.863Z] at java.base/java.lang.reflect.Method.invoke(Method.java:580)
14:49:05 [2026-10-20T12:49:05.863Z] at org.junit.platform.commons.util.ReflectionUtils.invokeMethod(ReflectionUtils.java:787)
14:49:05 [2026-10-20T12:49:05.863Z] at org.junit.platform.commons.support.ReflectionSupport.invokeMethod(ReflectionSupport.java:478)
14:49:05 [2026-10-20T12:49:05.863Z] at org.junit.jupiter.engine.execution.MethodInvocation.proceed(MethodInvocation.java:60)
14:49:05 [2026-10-20T12:49:05.864Z] at org.junit.jupiter.engine.execution.InvocationInterceptorChain$ValidatingInvocation.proceed(InvocationInterceptorChain.java:131)
14:49:05 [2026-10-20T12:49:05.864Z] at org.junit.jupiter.engine.extension.TimeoutExtension.intercept(TimeoutExtension.java:161)
14:49:05 [2026-10-20T12:49:05.864Z] at org.junit.jupiter.engine.extension.TimeoutExtension.interceptTestableMethod(TimeoutExtension.java:152)
14:49:05 [2026-10-20T12:49:05.864Z] at org.junit.jupiter.engine.extension.TimeoutExtension.interceptTestMethod(TimeoutExtension.java:91)
14:49:05 [2026-10-20T12:49:05.864Z] at org.junit.jupiter.engine.execution.InterceptingExecutableInvoker$ReflectiveInterceptorCall.lambda$ofVoidMethod$0(InterceptingExecutableInvoker.java:112)
14:49:05 [2026-10-20T12:49:05.864Z] at org.junit.jupiter.engine.execution.InterceptingExecutableInvoker.lambda$invoke$0(InterceptingExecutableInvoker.java:94)
14:49:05 [2026-10-20T12:49:05.864Z] at org.junit.jupiter.engine.execution.InvocationInterceptorChain$InterceptedInvocation.proceed(InvocationInterceptorChain.java:106)
14:49:05 [2026-10-20T12:49:05.864Z] at org.junit.jupiter.engine.execution.InvocationInterceptorChain.proceed(InvocationInterceptorChain.java:64)
14:49:05 [2026-10-20T12:49:05.864Z] at org.junit.jupiter.engine.execution.InvocationInterceptorChain.chainAndInvoke(InvocationInterceptorChain.java:45)
14:49:05 [2026-10-20T12:49:05.864Z] at org.junit.jupiter.engine.execution.InvocationInterceptorChain.invoke(InvocationInterceptorChain.java:37)
14:49:05 [2026-10-20T12:49:05.864Z] at org.junit.jupiter.engine.execution.InterceptingExecutableInvoker.invoke(InterceptingExecutableInvoker.java:93)
14:49:05 [2026-10-20T12:49:05.864Z] at org.junit.jupiter.engine.execution.InterceptingExecutableInvoker.invoke(InterceptingExecutableInvoker.java:87)
14:49:05 [2026-10-20T12:49:05.864Z] at org.junit.jupiter.engine.descriptor.TestMethodTestDescriptor.lambda$invokeTestMethod$4(TestMethodTestDescriptor.java:221)
14:49:05 [2026-10-20T12:49:05.864Z] at org.junit.platform.engine.support.hierarchical.ThrowableCollector.execute(ThrowableCollector.java:73)
14:49:05 [2026-10-20T12:49:05.864Z] at org.junit.jupiter.engine.descriptor.TestMethodTestDescriptor.invokeTestMethod(TestMethodTestDescriptor.java:217)
14:49:05 [2026-10-20T12:49:05.864Z] at org.junit.jupiter.engine.descriptor.TestMethodTestDescriptor.execute(TestMethodTestDescriptor.java:159)
14:49:05 [2026-10-20T12:49:05.864Z] at org.junit.jupiter.engine.descriptor.TestMethodTestDescriptor.execute(TestMethodTestDescriptor.java:70)
14:49:05 [2026-10-20T12:49:05.864Z] at org.junit.platform.engine.support.hierarchical.NodeTestTask.lambda$executeRecursively$6(NodeTestTask.java:157)
14:49:05 [2026-10-20T12:49:05.864Z] at org.junit.platform.engine.support.hierarchical.ThrowableCollector.execute(ThrowableCollector.java:73)
14:49:05 [2026-10-20T12:49:05.864Z] at org.junit.platform.engine.support.hierarchical.NodeTestTask.lambda$executeRecursively$8(NodeTestTask.java:147)
14:49:05 [2026-10-20T12:49:05.864Z] at org.junit.platform.engine.support.hierarchical.Node.around(Node.java:137)
14:49:05 [2026-10-20T12:49:05.864Z] at org.junit.platform.engine.support.hierarchical.NodeTestTask.lambda$executeRecursively$9(NodeTestTask.java:145)
14:49:05 [2026-10-20T12:49:05.864Z] at org.junit.platform.engine.support.hierarchical.ThrowableCollector.execute(ThrowableCollector.java:73)
14:49:05 [2026-10-20T12:49:05.864Z] at org.junit.platform.engine.support.hierarchical.NodeTestTask.executeRecursively(NodeTestTask.java:144)
14:49:05 [2026-10-20T12:49:05.864Z] at org.junit.platform.engine.support.hierarchical.NodeTestTask.execute(NodeTestTask.java:101)
14:49:05 [2026-10-20T12:49:05.864Z] at org.junit.platform.engine.support.hierarchical.ForkJoinPoolHierarchicalTestExecutorService$ExclusiveTask.exec(ForkJoinPoolHierarchicalTestExecutorService.java:274)
14:49:05 [2026-10-20T12:49:05.864Z] at org.junit.platform.engine.support.hierarchical.ForkJoinPoolHierarchicalTestExecutorService$ExclusiveTask.execSync(ForkJoinPoolHierarchicalTestExecutorService.java:247)
14:49:05 [2026-10-20T12:49:05.864Z] at org.junit.platform.engine.support.hierarchical.ForkJoinPoolHierarchicalTestExecutorService.executeSync(ForkJoinPoolHierarchicalTestExecutorService.java:194)
14:49:05 [2026-10-20T12:49:05.864Z] at org.junit.platform.engine.support.hierarchical.ForkJoinPoolHierarchicalTestExecutorService.invokeAll(ForkJoinPoolHierarchicalTestExecutorService.java:166)
14:49:05 [2026-10-20T12:49:05.864Z] at org.junit.platform.engine.support.hierarchical.NodeTestTask.lambda$executeRecursively$6(NodeTestTask.java:161)
14:49:05 [2026-10-20T12:49:05.864Z] at org.junit.platform.engine.support.hierarchical.ThrowableCollector.execute(ThrowableCollector.java:73)
14:49:05 [2026-10-20T12:49:05.864Z] at org.junit.platform.engine.support.hierarchical.NodeTestTask.lambda$executeRecursively$8(NodeTestTask.java:147)
14:49:05 [2026-10-20T12:49:05.864Z] at org.junit.platform.engine.support.hierarchical.Node.around(Node.java:137)
14:49:05 [2026-10-20T12:49:05.864Z] at org.junit.platform.engine.support.hierarchical.NodeTestTask.lambda$executeRecursively$9(NodeTestTask.java:145)
14:49:05 [2026-10-20T12:49:05.864Z] at org.junit.platform.engine.support.hierarchical.ThrowableCollector.execute(ThrowableCollector.java:73)
14:49:05 [2026-10-20T12:49:05.864Z] at org.junit.platform.engine.support.hierarchical.NodeTestTask.executeRecursively(NodeTestTask.java:144)
14:49:05 [2026-10-20T12:49:05.864Z] at org.junit.platform.engine.support.hierarchical.NodeTestTask.execute(NodeTestTask.java:101)
14:49:05 [2026-10-20T12:49:05.864Z] at org.junit.platform.engine.support.hierarchical.ForkJoinPoolHierarchicalTestExecutorService$ExclusiveTask.exec(ForkJoinPoolHierarchicalTestExecutorService.java:274)
14:49:05 [2026-10-20T12:49:05.864Z] at org.junit.platform.engine.support.hierarchical.ForkJoinPoolHierarchicalTestExecutorService$ExclusiveTask.execSync(ForkJoinPoolHierarchicalTestExecutorService.java:247)
14:49:05 [2026-10-20T12:49:05.864Z] at org.junit.platform.engine.support.hierarchical.ForkJoinPoolHierarchicalTestExecutorService.executeSync(ForkJoinPoolHierarchicalTestExecutorService.java:194)
14:49:05 [2026-10-20T12:49:05.864Z] at org.junit.platform.engine.support.hierarchical.ForkJoinPoolHierarchicalTestExecutorService.invokeAll(ForkJoinPoolHierarchicalTestExecutorService.java:166)
14:49:05 [2026-10-20T12:49:05.864Z] at org.junit.platform.engine.support.hierarchical.NodeTestTask.lambda$executeRecursively$6(NodeTestTask.java:161)
14:49:05 [2026-10-20T12:49:05.864Z] at org.junit.platform.engine.support.hierarchical.ThrowableCollector.execute(ThrowableCollector.java:73)
14:49:05 [2026-10-20T12:49:05.864Z] at org.junit.platform.engine.support.hierarchical.NodeTestTask.lambda$executeRecursively$8(NodeTestTask.java:147)
14:49:05 [2026-10-20T12:49:05.864Z] at org.junit.platform.engine.support.hierarchical.Node.around(Node.java:137)
14:49:05 [2026-10-20T12:49:05.864Z] at org.junit.platform.engine.support.hierarchical.NodeTestTask.lambda$executeRecursively$9(NodeTestTask.java:145)
14:49:05 [2026-10-20T12:49:05.864Z] at org.junit.platform.engine.support.hierarchical.ThrowableCollector.execute(ThrowableCollector.java:73)
14:49:05 [2026-10-20T12:49:05.864Z] at org.junit.platform.engine.support.hierarchical.NodeTestTask.executeRecursively(NodeTestTask.java:144)
14:49:05 [2026-10-20T12:49:05.864Z] at org.junit.platform.engine.support.hierarchical.NodeTestTask.execute(NodeTestTask.java:101)
14:49:05 [2026-10-20T12:49:05.864Z] at org.junit.platform.engine.support.hierarchical.ForkJoinPoolHierarchicalTestExecutorService$ExclusiveTask.exec(ForkJoinPoolHierarchicalTestExecutorService.java:274)
14:49:05 [2026-10-20T12:49:05.864Z] at java.base/java.util.concurrent.ForkJoinTask.doExec(ForkJoinTask.java:387)
14:49:05 [2026-10-20T12:49:05.864Z] at java.base/java.util.concurrent.ForkJoinPool$WorkQueue.topLevelExec(ForkJoinPool.java:1312)
14:49:05 [2026-10-20T12:49:05.864Z] at java.base/java.util.concurrent.ForkJoinPool.scan(ForkJoinPool.java:1843)
14:49:05 [2026-10-20T12:49:05.864Z] at java.base/java.util.concurrent.ForkJoinPool.runWorker(ForkJoinPool.java:1808)
14:49:05 [2026-10-20T12:49:05.864Z] at java.base/java.util.concurrent.ForkJoinWorkerThread.run(ForkJoinWorkerThread.java:188)
14:49:05 [2026-10-20T12:49:05.864Z] Caused by: java.io.IOException: Error while instrumenting org/silverpeas/kernel/test/MyBean$MockitoMock$sz7oczFT with JaCoCo 0.8.8.202204050719/5dcf34a.
14:49:05 [2026-10-20T12:49:05.864Z] at org.jacoco.agent.rt.internal_b6258fc.core.instr.Instrumenter.instrumentError(Instrumenter.java:161)
14:49:05 [2026-10-20T12:49:05.864Z] at org.jacoco.agent.rt.internal_b6258fc.core.instr.Instrumenter.instrument(Instrumenter.java:111)
14:49:05 [2026-10-20T12:49:05.864Z] at org.jacoco.agent.rt.internal_b6258fc.CoverageTransformer.transform(CoverageTransformer.java:92)
14:49:05 [2026-10-20T12:49:05.864Z] ... 119 more
14:49:05 [2026-10-20T12:49:05.864Z] Caused by: java.lang.IllegalArgumentException: Unsupported class file major version 65
14:49:05 [2026-10-20T12:49:05.864Z] at org.jacoco.agent.rt.internal_b6258fc.asm.ClassReader.<init>(ClassReader.java:199)
14:49:05 [2026-10-20T12:49:05.864Z] at org.jacoco.agent.rt.internal_b6258fc.asm.ClassReader.<init>(ClassReader.java:180)
14:49:05 [2026-10-20T12:49:05.864Z] at org.jacoco.agent.rt.internal_b6258fc.asm.ClassReader.<init>(ClassReader.java:166)
14:49:05 [2026-10-20T12:49:05.864Z] at org.jacoco.agent.rt.internal_b6258fc.core.internal.instr.InstrSupport.classReaderFor(InstrSupport.java:280)
14:49:05 [2026-10-20T12:49:05.864Z] at org.jacoco.agent.rt.internal_b6258fc.core.instr.Instrumenter.instrument(Instrumenter.java:77)
14:49:05 [2026-10-20T12:49:05.864Z] at org.jacoco.agent.rt.internal_b6258fc.core.instr.Instrumenter.instrument(Instrumenter.java:109)
14:49:05 [2026-10-20T12:49:05.864Z] ... 120 more
14:49:05 [2026-10-20T12:49:05.864Z] java.lang.instrument.IllegalClassFormatException: Error while instrumenting org/silverpeas/kernel/test/MyBean$MockitoMock$sz7oczFT$auxiliary$cUzHV5xh with JaCoCo 0.8.8.202204050719/5dcf34a.
14:49:05 [2026-10-20T12:49:05.864Z] at org.jacoco.agent.rt.internal_b6258fc.CoverageTransformer.transform(CoverageTransformer.java:94)
14:49:05 [2026-10-20T12:49:05.864Z] at java.instrument/java.lang.instrument.ClassFileTransformer.transform(ClassFileTransformer.java:244)
14:49:05 [2026-10-20T12:49:05.864Z] at java.instrument/sun.instrument.TransformerManager.transform(TransformerManager.java:188)
14:49:05 [2026-10-20T12:49:05.864Z] at java.instrument/sun.instrument.InstrumentationImpl.transform(InstrumentationImpl.java:610)
14:49:05 [2026-10-20T12:49:05.864Z] at java.base/java.lang.ClassLoader.defineClass0(Native Method)
14:49:05 [2026-10-20T12:49:05.864Z] at java.base/java.lang.System$2.defineClass(System.java:2395)
14:49:05 [2026-10-20T12:49:05.864Z] at java.base/java.lang.invoke.MethodHandles$Lookup$ClassDefiner.defineClass(MethodHandles.java:2505)
14:49:05 [2026-10-20T12:49:05.865Z] at java.base/java.lang.invoke.MethodHandles$Lookup$ClassDefiner.defineClass(MethodHandles.java:2480)
14:49:05 [2026-10-20T12:49:05.865Z] at java.base/java.lang.invoke.MethodHandles$Lookup.defineClass(MethodHandles.java:1865)
14:49:05 [2026-10-20T12:49:05.865Z] at java.base/jdk.internal.reflect.DirectMethodHandleAccessor.invoke(DirectMethodHandleAccessor.java:103)
14:49:05 [2026-10-20T12:49:05.865Z] at java.base/java.lang.reflect.Method.invoke(Method.java:580)
14:49:05 [2026-10-20T12:49:05.865Z] at net.bytebuddy.utility.Invoker$Dispatcher.invoke(Unknown Source)
14:49:05 [2026-10-20T12:49:05.865Z] at net.bytebuddy.utility.dispatcher.JavaDispatcher$Dispatcher$ForNonStaticMethod.invoke(JavaDispatcher.java:1033)
14:49:05 [2026-10-20T12:49:05.865Z] at net.bytebuddy.utility.dispatcher.JavaDispatcher$ProxiedInvocationHandler.invoke(JavaDispatcher.java:1163)
14:49:05 [2026-10-20T12:49:05.865Z] at jdk.proxy2/jdk.proxy2.$Proxy75.defineClass(Unknown Source)
14:49:05 [2026-10-20T12:49:05.865Z] at net.bytebuddy.dynamic.loading.ClassInjector$UsingLookup.injectRaw(ClassInjector.java:1686)
14:49:05 [2026-10-20T12:49:05.865Z] at net.bytebuddy.dynamic.loading.ClassInjector$AbstractBase.injectRaw(ClassInjector.java:167)
14:49:05 [2026-10-20T12:49:05.865Z] at net.bytebuddy.dynamic.loading.ClassInjector$AbstractBase.inject(ClassInjector.java:155)
14:49:05 [2026-10-20T12:49:05.865Z] at net.bytebuddy.dynamic.loading.ClassLoadingStrategy$UsingLookup.load(ClassLoadingStrategy.java:519)
14:49:05 [2026-10-20T12:49:05.865Z] at net.bytebuddy.dynamic.TypeResolutionStrategy$Passive.initialize(TypeResolutionStrategy.java:101)
14:49:05 [2026-10-20T12:49:05.865Z] at net.bytebuddy.dynamic.DynamicType$Default$Unloaded.load(DynamicType.java:6432)
14:49:05 [2026-10-20T12:49:05.865Z] at org.mockito.internal.creation.bytebuddy.SubclassBytecodeGenerator.mockClass(SubclassBytecodeGenerator.java:282)
14:49:05 [2026-10-20T12:49:05.865Z] at org.mockito.internal.creation.bytebuddy.TypeCachingBytecodeGenerator.lambda$mockClass$0(TypeCachingBytecodeGenerator.java:78)
14:49:05 [2026-10-20T12:49:05.865Z] at net.bytebuddy.TypeCache.findOrInsert(TypeCache.java:168)
14:49:05 [2026-10-20T12:49:05.865Z] at net.bytebuddy.TypeCache$WithInlineExpunction.findOrInsert(TypeCache.java:399)
14:49:05 [2026-10-20T12:49:05.865Z] at net.bytebuddy.TypeCache.findOrInsert(TypeCache.java:190)
14:49:05 [2026-10-20T12:49:05.865Z] at net.bytebuddy.TypeCache$WithInlineExpunction.findOrInsert(TypeCache.java:410)
14:49:05 [2026-10-20T12:49:05.865Z] at org.mockito.internal.creation.bytebuddy.TypeCachingBytecodeGenerator.mockClass(TypeCachingBytecodeGenerator.java:75)
14:49:05 [2026-10-20T12:49:05.865Z] at org.mockito.internal.creation.bytebuddy.InlineBytecodeGenerator.mockClass(InlineBytecodeGenerator.java:223)
14:49:05 [2026-10-20T12:49:05.865Z] at org.mockito.internal.creation.bytebuddy.TypeCachingBytecodeGenerator.lambda$mockClass$0(TypeCachingBytecodeGenerator.java:78)
14:49:05 [2026-10-20T12:49:05.865Z] at net.bytebuddy.TypeCache.findOrInsert(TypeCache.java:168)
14:49:05 [2026-10-20T12:49:05.865Z] at net.bytebuddy.TypeCache$WithInlineExpunction.findOrInsert(TypeCache.java:399)
14:49:05 [2026-10-20T12:49:05.865Z] at net.bytebuddy.TypeCache.findOrInsert(TypeCache.java:190)
14:49:05 [2026-10-20T12:49:05.865Z] at net.bytebuddy.TypeCache$WithInlineExpunction.findOrInsert(TypeCache.java:410)
14:49:05 [2026-10-20T12:49:05.865Z] at org.mockito.internal.creation.bytebuddy.TypeCachingBytecodeGenerator.mockClass(TypeCachingBytecodeGenerator.java:75)
14:49:05 [2026-10-20T12:49:05.865Z] at org.mockito.internal.creation.bytebuddy.InlineDelegateByteBuddyMockMaker.createMockType(InlineDelegateByteBuddyMockMaker.java:429)
14:49:05 [2026-10-20T12:49:05.865Z] at org.mockito.internal.creation.bytebuddy.InlineDelegateByteBuddyMockMaker.doCreateMock(InlineDelegateByteBuddyMockMaker.java:388)
14:49:05 [2026-10-20T12:49:05.865Z] at org.mockito.internal.creation.bytebuddy.InlineDelegateByteBuddyMockMaker.createMock(InlineDelegateByteBuddyMockMaker.java:367)
14:49:05 [2026-10-20T12:49:05.865Z] at org.mockito.internal.creation.bytebuddy.InlineByteBuddyMockMaker.createMock(InlineByteBuddyMockMaker.java:56)
14:49:05 [2026-10-20T12:49:05.865Z] at org.mockito.internal.util.MockUtil.createMock(MockUtil.java:99)
14:49:05 [2026-10-20T12:49:05.865Z] at org.mockito.internal.MockitoCore.mock(MockitoCore.java:84)
14:49:05 [2026-10-20T12:49:05.865Z] at org.mockito.Mockito.mock(Mockito.java:2198)
14:49:05 [2026-10-20T12:49:05.865Z] at org.mockito.Mockito.mock(Mockito.java:2113)
14:49:05 [2026-10-20T12:49:05.865Z] at org.silverpeas.kernel.test.DependencyResolver.resolveDependency(DependencyResolver.java:155)
14:49:05 [2026-10-20T12:49:05.865Z] at org.silverpeas.kernel.test.DependencyResolver.lambda$resolve$1(DependencyResolver.java:105)
14:49:05 [2026-10-20T12:49:05.865Z] at java.base/java.util.Optional.orElseGet(Optional.java:364)
14:49:05 [2026-10-20T12:49:05.865Z] at org.silverpeas.kernel.test.DependencyResolver.lambda$resolve$2(DependencyResolver.java:105)
14:49:05 [2026-10-20T12:49:05.865Z] at java.base/java.util.stream.ForEachOps$ForEachOp$OfRef.accept(ForEachOps.java:184)
14:49:05 [2026-10-20T12:49:05.865Z] at java.base/java.util.stream.ReferencePipeline$2$1.accept(ReferencePipeline.java:179)
14:49:05 [2026-10-20T12:49:05.865Z] at java.base/java.util.Spliterators$ArraySpliterator.forEachRemaining(Spliterators.java:1024)
14:49:05 [2026-10-20T12:49:05.865Z] at java.base/java.util.stream.AbstractPipeline.copyInto(AbstractPipeline.java:509)
14:49:05 [2026-10-20T12:49:05.865Z] at java.base/java.util.stream.AbstractPipeline.wrapAndCopyInto(AbstractPipeline.java:499)
14:49:05 [2026-10-20T12:49:05.865Z] at java.base/java.util.stream.ForEachOps$ForEachOp.evaluateSequential(ForEachOps.java:151)
14:49:05 [2026-10-20T12:49:05.865Z] at java.base/java.util.stream.ForEachOps$ForEachOp$OfRef.evaluateSequential(ForEachOps.java:174)
14:49:05 [2026-10-20T12:49:05.865Z] at java.base/java.util.stream.AbstractPipeline.evaluate(AbstractPipeline.java:234)
14:49:05 [2026-10-20T12:49:05.865Z] at java.base/java.util.stream.ReferencePipeline.forEach(ReferencePipeline.java:596)
14:49:05 [2026-10-20T12:49:05.865Z] at org.silverpeas.kernel.test.DependencyResolver.lambda$resolve$3(DependencyResolver.java:102)
14:49:05 [2026-10-20T12:49:05.865Z] at org.silverpeas.kernel.test.util.Reflections.loopInheritance(Reflections.java:68)
14:49:05 [2026-10-20T12:49:05.865Z] at org.silverpeas.kernel.test.DependencyResolver.resolve(DependencyResolver.java:98)
14:49:05 [2026-10-20T12:49:05.865Z] at org.silverpeas.kernel.test.DependencyResolverTest.genericInjectionIsMockedWhenNoManagedBeanIsAvailable(DependencyResolverTest.java:67)
14:49:05 [2026-10-20T12:49:05.865Z] at java.base/jdk.internal.reflect.DirectMethodHandleAccessor.invoke(DirectMethodHandleAccessor.java:103)
14:49:05 [2026-10-20T12:49:05.865Z] at java.base/java.lang.reflect.Method.invoke(Method.java:580)
14:49:05 [2026-10-20T12:49:05.865Z] at org.junit.platform.commons.util.ReflectionUtils.invokeMethod(ReflectionUtils.java:787)
14:49:05 [2026-10-20T12:49:05.865Z] at org.junit.platform.commons.support.ReflectionSupport.invokeMethod(ReflectionSupport.java:478)
14:49:05 [2026-10-20T12:49:05.865Z] at org.junit.jupiter.engine.execution.MethodInvocation.proceed(MethodInvocation.java:60)
14:49:05 [2026-10-20T12:49:05.865Z] at org.junit.jupiter.engine.execution.InvocationInterceptorChain$ValidatingInvocation.proceed(InvocationInterceptorChain.java:131)
14:49:05 [2026-10-20T12:49:05.865Z] at org.junit.jupiter.engine.extension.TimeoutExtension.intercept(TimeoutExtension.java:161)
14:49:05 [2026-10-20T12:49:05.865Z] at org.junit.jupiter.engine.extension.TimeoutExtension.interceptTestableMethod(TimeoutExtension.java:152)
14:49:05 [2026-10-20T12:49:05.865Z] at org.junit.jupiter.engine.extension.TimeoutExtension.interceptTestMethod(TimeoutExtension.java:91)
14:49:05 [2026-10-20T12:49:05.865Z] at org.junit.jupiter.engine.execution.InterceptingExecutableInvoker$ReflectiveInterceptorCall.lambda$ofVoidMethod$0(InterceptingExecutableInvoker.java:112)
14:49:05 [2026-10-20T12:49:05.865Z] at org.junit.jupiter.engine.execution.InterceptingExecutableInvoker.lambda$invoke$0(InterceptingExecutableInvoker.java:94)
14:49:05 [2026-10-20T12:49:05.865Z] at org.junit.jupiter.engine.execution.InvocationInterceptorChain$InterceptedInvocation.proceed(InvocationInterceptorChain.java:106)
14:49:05 [2026-10-20T12:49:05.865Z] at org.junit.jupiter.engine.execution.InvocationInterceptorChain.proceed(InvocationInterceptorChain.java:64)
14:49:05 [2026-10-20T12:49:05.865Z] at org.junit.jupiter.engine.execution.InvocationInterceptorChain.chainAndInvoke(InvocationInterceptorChain.java:45)
14:49:05 [2026-10-20T12:49:05.865Z] at org.junit.jupiter.engine.execution.InvocationInterceptorChain.invoke(InvocationInterceptorChain.java:37)
14:49:05 [2026-10-20T12:49:05.865Z] at org.junit.jupiter.engine.execution.InterceptingExecutableInvoker.invoke(InterceptingExecutableInvoker.java:93)
14:49:05 [2026-10-20T12:49:05.865Z] at org.junit.jupiter.engine.execution.InterceptingExecutableInvoker.invoke(InterceptingExecutableInvoker.java:87)
14:49:05 [2026-10-20T12:49:05.865Z] at org.junit.jupiter.engine.descriptor.TestMethodTestDescriptor.lambda$invokeTestMethod$4(TestMethodTestDescriptor.java:221)
14:49:05 [2026-10-20T12:49:05.865Z] at org.junit.platform.engine.support.hierarchical.ThrowableCollector.execute(ThrowableCollector.java:73)
14:49:05 [2026-10-20T12:49:05.865Z] at org.junit.jupiter.engine.descriptor.TestMethodTestDescriptor.invokeTestMethod(TestMethodTestDescriptor.java:217)
14:49:05 [2026-10-20T12:49:05.865Z] at org.junit.jupiter.engine.descriptor.TestMethodTestDescriptor.execute(TestMethodTestDescriptor.java:159)
14:49:05 [2026-10-20T12:49:05.865Z] at org.junit.jupiter.engine.descriptor.TestMethodTestDescriptor.execute(TestMethodTestDescriptor.java:70)
14:49:05 [2026-10-20T12:49:05.865Z] at org.junit.platform.engine.support.hierarchical.NodeTestTask.lambda$executeRecursively$6(NodeTestTask.java:157)
14:49:05 [2026-10-20T12:49:05.865Z] at org.junit.platform.engine.support.hierarchical.ThrowableCollector.execute(ThrowableCollector.java:73)
14:49:05 [2026-10-20T12:49:05.865Z] at org.junit.platform.engine.support.hierarchical.NodeTestTask.lambda$executeRecursively$8(NodeTestTask.java:147)
14:49:05 [2026-10-20T12:49:05.865Z] at org.junit.platform.engine.support.hierarchical.Node.around(Node.java:137)
14:49:05 [2026-10-20T12:49:05.865Z] at org.junit.platform.engine.support.hierarchical.NodeTestTask.lambda$executeRecursively$9(NodeTestTask.java:145)
14:49:05 [2026-10-20T12:49:05.865Z] at org.junit.platform.engine.support.hierarchical.ThrowableCollector.execute(ThrowableCollector.java:73)
14:49:05 [2026-10-20T12:49:05.865Z] at org.junit.platform.engine.support.hierarchical.NodeTestTask.executeRecursively(NodeTestTask.java:144)
14:49:05 [2026-10-20T12:49:05.865Z] at org.junit.platform.engine.support.hierarchical.NodeTestTask.execute(NodeTestTask.java:101)
14:49:05 [2026-10-20T12:49:05.865Z] at org.junit.platform.engine.support.hierarchical.ForkJoinPoolHierarchicalTestExecutorService$ExclusiveTask.exec(ForkJoinPoolHierarchicalTestExecutorService.java:274)
14:49:05 [2026-10-20T12:49:05.865Z] at org.junit.platform.engine.support.hierarchical.ForkJoinPoolHierarchicalTestExecutorService$ExclusiveTask.execSync(ForkJoinPoolHierarchicalTestExecutorService.java:247)
14:49:05 [2026-10-20T12:49:05.866Z] at org.junit.platform.engine.support.hierarchical.ForkJoinPoolHierarchicalTestExecutorService.executeSync(ForkJoinPoolHierarchicalTestExecutorService.java:194)
14:49:05 [2026-10-20T12:49:05.866Z] at org.junit.platform.engine.support.hierarchical.ForkJoinPoolHierarchicalTestExecutorService.invokeAll(ForkJoinPoolHierarchicalTestExecutorService.java:166)
14:49:05 [2026-10-20T12:49:05.866Z] at org.junit.platform.engine.support.hierarchical.NodeTestTask.lambda$executeRecursively$6(NodeTestTask.java:161)
14:49:05 [2026-10-20T12:49:05.866Z] at org.junit.platform.engine.support.hierarchical.ThrowableCollector.execute(ThrowableCollector.java:73)
14:49:05 [2026-10-20T12:49:05.866Z] at org.junit.platform.engine.support.hierarchical.NodeTestTask.lambda$executeRecursively$8(NodeTestTask.java:147)
14:49:05 [2026-10-20T12:49:05.866Z] at org.junit.platform.engine.support.hierarchical.Node.around(Node.java:137)
14:49:05 [2026-10-20T12:49:05.866Z] at org.junit.platform.engine.support.hierarchical.NodeTestTask.lambda$executeRecursively$9(NodeTestTask.java:145)
14:49:05 [2026-10-20T12:49:05.866Z] at org.junit.platform.engine.support.hierarchical.ThrowableCollector.execute(ThrowableCollector.java:73)
14:49:05 [2026-10-20T12:49:05.866Z] at org.junit.platform.engine.support.hierarchical.NodeTestTask.executeRecursively(NodeTestTask.java:144)
14:49:05 [2026-10-20T12:49:05.866Z] at org.junit.platform.engine.support.hierarchical.NodeTestTask.execute(NodeTestTask.java:101)
14:49:05 [2026-10-20T12:49:05.866Z] at org.junit.platform.engine.support.hierarchical.ForkJoinPoolHierarchicalTestExecutorService$ExclusiveTask.exec(ForkJoinPoolHierarchicalTestExecutorService.java:274)
14:49:05 [2026-10-20T12:49:05.866Z] at org.junit.platform.engine.support.hierarchical.ForkJoinPoolHierarchicalTestExecutorService$ExclusiveTask.execSync(ForkJoinPoolHierarchicalTestExecutorService.java:247)
14:49:05 [2026-10-20T12:49:05.866Z] at org.junit.platform.engine.support.hierarchical.ForkJoinPoolHierarchicalTestExecutorService.executeSync(ForkJoinPoolHierarchicalTestExecutorService.java:194)
14:49:05 [2026-10-20T12:49:05.866Z] at org.junit.platform.engine.support.hierarchical.ForkJoinPoolHierarchicalTestExecutorService.invokeAll(ForkJoinPoolHierarchicalTestExecutorService.java:166)
14:49:05 [2026-10-20T12:49:05.866Z] at org.junit.platform.engine.support.hierarchical.NodeTestTask.lambda$executeRecursively$6(NodeTestTask.java:161)
14:49:05 [2026-10-20T12:49:05.866Z] at org.junit.platform.engine.support.hierarchical.ThrowableCollector.execute(ThrowableCollector.java:73)
14:49:05 [2026-10-20T12:49:05.866Z] at org.junit.platform.engine.support.hierarchical.NodeTestTask.lambda$executeRecursively$8(NodeTestTask.java:147)
14:49:05 [2026-10-20T12:49:05.866Z] at org.junit.platform.engine.support.hierarchical.Node.around(Node.java:137)
14:49:05 [2026-10-20T12:49:05.866Z] at org.junit.platform.engine.support.hierarchical.NodeTestTask.lambda$executeRecursively$9(NodeTestTask.java:145)
14:49:05 [2026-10-20T12:49:05.866Z] at org.junit.platform.engine.support.hierarchical.ThrowableCollector.execute(ThrowableCollector.java:73)
14:49:05 [2026-10-20T12:49:05.866Z] at org.junit.platform.engine.support.hierarchical.NodeTestTask.executeRecursively(NodeTestTask.java:144)
14:49:05 [2026-10-20T12:49:05.866Z] at org.junit.platform.engine.support.hierarchical.NodeTestTask.execute(NodeTestTask.java:101)
14:49:05 [2026-10-20T12:49:05.866Z] at org.junit.platform.engine.support.hierarchical.ForkJoinPoolHierarchicalTestExecutorService$ExclusiveTask.exec(ForkJoinPoolHierarchicalTestExecutorService.java:274)
14:49:05 [2026-10-20T12:49:05.866Z] at java.base/java.util.concurrent.ForkJoinTask.doExec(ForkJoinTask.java:387)
14:49:05 [2026-10-20T12:49:05.866Z] at java.base/java.util.concurrent.ForkJoinPool$WorkQueue.topLevelExec(ForkJoinPool.java:1312)
14:49:05 [2026-10-20T12:49:05.866Z] at java.base/java.util.concurrent.ForkJoinPool.scan(ForkJoinPool.java:1843)
14:49:05 [2026-10-20T12:49:05.866Z] at java.base/java.util.concurrent.ForkJoinPool.runWorker(ForkJoinPool.java:1808)
14:49:05 [2026-10-20T12:49:05.866Z] at java.base/java.util.concurrent.ForkJoinWorkerThread.run(ForkJoinWorkerThread.java:188)
14:49:05 [2026-10-20T12:49:05.866Z] Caused by: java.io.IOException: Error while instrumenting org/silverpeas/kernel/test/MyBean$MockitoMock$sz7oczFT$auxiliary$cUzHV5xh with JaCoCo 0.8.8.202204050719/5dcf34a.
14:49:05 [2026-10-20T12:49:05.866Z] at org.jacoco.agent.rt.internal_b6258fc.core.instr.Instrumenter.instrumentError(Instrumenter.java:161)
14:49:05 [2026-10-20T12:49:05.866Z] at org.jacoco.agent.rt.internal_b6258fc.core.instr.Instrumenter.instrument(Instrumenter.java:111)
14:49:05 [2026-10-20T12:49:05.866Z] at org.jacoco.agent.rt.internal_b6258fc.CoverageTransformer.transform(CoverageTransformer.java:92)
14:49:05 [2026-10-20T12:49:05.866Z] ... 119 more
14:49:05 [2026-10-20T12:49:05.866Z] Caused by: java.lang.IllegalArgumentException: Unsupported class file major version 65
14:49:05 [2026-10-20T12:49:05.866Z] at org.jacoco.agent.rt.internal_b6258fc.asm.ClassReader.<init>(ClassReader.java:199)
14:49:05 [2026-10-20T12:49:05.866Z] at org.jacoco.agent.rt.internal_b6258fc.asm.ClassReader.<init>(ClassReader.java:180)
14:49:05 [2026-10-20T12:49:05.866Z] at org.jacoco.agent.rt.internal_b6258fc.asm.ClassReader.<init>(ClassReader.java:166)
14:49:05 [2026-10-20T12:49:05.866Z] at org.jacoco.agent.rt.internal_b6258fc.core.internal.instr.InstrSupport.classReaderFor(InstrSupport.java:280)
14:49:05 [2026-10-20T12:49:05.866Z] at org.jacoco.agent.rt.internal_b6258fc.core.instr.Instrumenter.instrument(Instrumenter.java:77)
14:49:05 [2026-10-20T12:49:05.866Z] at org.jacoco.agent.rt.internal_b6258fc.core.instr.Instrumenter.instrument(Instrumenter.java:109)
14:49:05 [2026-10-20T12:49:05.866Z] ... 120 more
14:49:05 [2026-10-20T12:49:05.866Z] java.lang.instrument.IllegalClassFormatException: Error while instrumenting org/silverpeas/kernel/test/MyBean$MockitoMock$sz7oczFT$auxiliary$3jGvzUKg with JaCoCo 0.8.8.202204050719/5dcf34a.
14:49:05 [2026-10-20T12:49:05.866Z] at org.jacoco.agent.rt.internal_b6258fc.CoverageTransformer.transform(CoverageTransformer.java:94)
14:49:05 [2026-10-20T12:49:05.866Z] at java.instrument/java.lang.instrument.ClassFileTransformer.transform(ClassFileTransformer.java:244)
14:49:05 [2026-10-20T12:49:05.866Z] at java.instrument/sun.instrument.TransformerManager.transform(TransformerManager.java:188)
14:49:05 [2026-10-20T12:49:05.866Z] at java.instrument/sun.instrument.InstrumentationImpl.transform(InstrumentationImpl.java:610)
14:49:05 [2026-10-20T12:49:05.866Z] at java.base/java.lang.ClassLoader.defineClass0(Native Method)
14:49:05 [2026-10-20T12:49:05.866Z] at java.base/java.lang.System$2.defineClass(System.java:2395)
14:49:05 [2026-10-20T12:49:05.866Z] at java.base/java.lang.invoke.MethodHandles$Lookup$ClassDefiner.defineClass(MethodHandles.java:2505)
14:49:05 [2026-10-20T12:49:05.866Z] at java.base/java.lang.invoke.MethodHandles$Lookup$ClassDefiner.defineClass(MethodHandles.java:2480)
14:49:05 [2026-10-20T12:49:05.866Z] at java.base/java.lang.invoke.MethodHandles$Lookup.defineClass(MethodHandles.java:1865)
14:49:05 [2026-10-20T12:49:05.866Z] at java.base/jdk.internal.reflect.DirectMethodHandleAccessor.invoke(DirectMethodHandleAccessor.java:103)
14:49:05 [2026-10-20T12:49:05.866Z] at java.base/java.lang.reflect.Method.invoke(Method.java:580)
14:49:05 [2026-10-20T12:49:05.866Z] at net.bytebuddy.utility.Invoker$Dispatcher.invoke(Unknown Source)
14:49:05 [2026-10-20T12:49:05.866Z] at net.bytebuddy.utility.dispatcher.JavaDispatcher$Dispatcher$ForNonStaticMethod.invoke(JavaDispatcher.java:1033)
14:49:05 [2026-10-20T12:49:05.866Z] at net.bytebuddy.utility.dispatcher.JavaDispatcher$ProxiedInvocationHandler.invoke(JavaDispatcher.java:1163)
14:49:05 [2026-10-20T12:49:05.866Z] at jdk.proxy2/jdk.proxy2.$Proxy75.defineClass(Unknown Source)
14:49:05 [2026-10-20T12:49:05.866Z] at net.bytebuddy.dynamic.loading.ClassInjector$UsingLookup.injectRaw(ClassInjector.java:1686)
14:49:05 [2026-10-20T12:49:05.866Z] at net.bytebuddy.dynamic.loading.ClassInjector$AbstractBase.injectRaw(ClassInjector.java:167)
14:49:05 [2026-10-20T12:49:05.866Z] at net.bytebuddy.dynamic.loading.ClassInjector$AbstractBase.inject(ClassInjector.java:155)
14:49:05 [2026-10-20T12:49:05.866Z] at net.bytebuddy.dynamic.loading.ClassLoadingStrategy$UsingLookup.load(ClassLoadingStrategy.java:519)
14:49:05 [2026-10-20T12:49:05.866Z] at net.bytebuddy.dynamic.TypeResolutionStrategy$Passive.initialize(TypeResolutionStrategy.java:101)
14:49:05 [2026-10-20T12:49:05.866Z] at net.bytebuddy.dynamic.DynamicType$Default$Unloaded.load(DynamicType.java:6432)
14:49:05 [2026-10-20T12:49:05.866Z] at org.mockito.internal.creation.bytebuddy.SubclassBytecodeGenerator.mockClass(SubclassBytecodeGenerator.java:282)
14:49:05 [2026-10-20T12:49:05.866Z] at org.mockito.internal.creation.bytebuddy.TypeCachingBytecodeGenerator.lambda$mockClass$0(TypeCachingBytecodeGenerator.java:78)
14:49:05 [2026-10-20T12:49:05.866Z] at net.bytebuddy.TypeCache.findOrInsert(TypeCache.java:168)
14:49:05 [2026-10-20T12:49:05.866Z] at net.bytebuddy.TypeCache$WithInlineExpunction.findOrInsert(TypeCache.java:399)
14:49:05 [2026-10-20T12:49:05.866Z] at net.bytebuddy.TypeCache.findOrInsert(TypeCache.java:190)
14:49:05 [2026-10-20T12:49:05.866Z] at net.bytebuddy.TypeCache$WithInlineExpunction.findOrInsert(TypeCache.java:410)
14:49:05 [2026-10-20T12:49:05.866Z] at org.mockito.internal.creation.bytebuddy.TypeCachingBytecodeGenerator.mockClass(TypeCachingBytecodeGenerator.java:75)
14:49:05 [2026-10-20T12:49:05.866Z] at org.mockito.internal.creation.bytebuddy.InlineBytecodeGenerator.mockClass(InlineBytecodeGenerator.java:223)
14:49:05 [2026-10-20T12:49:05.866Z] at org.mockito.internal.creation.bytebuddy.TypeCachingBytecodeGenerator.lambda$mockClass$0(TypeCachingBytecodeGenerator.java:78)
14:49:05 [2026-10-20T12:49:05.866Z] at net.bytebuddy.TypeCache.findOrInsert(TypeCache.java:168)
14:49:05 [2026-10-20T12:49:05.866Z] at net.bytebuddy.TypeCache$WithInlineExpunction.findOrInsert(TypeCache.java:399)
14:49:05 [2026-10-20T12:49:05.866Z] at net.bytebuddy.TypeCache.findOrInsert(TypeCache.java:190)
14:49:05 [2026-10-20T12:49:05.866Z] at net.bytebuddy.TypeCache$WithInlineExpunction.findOrInsert(TypeCache.java:410)
14:49:05 [2026-10-20T12:49:05.866Z] at org.mockito.internal.creation.bytebuddy.TypeCachingBytecodeGenerator.mockClass(TypeCachingBytecodeGenerator.java:75)
14:49:05 [2026-10-20T12:49:05.866Z] at org.mockito.internal.creation.bytebuddy.InlineDelegateByteBuddyMockMaker.createMockType(InlineDelegateByteBuddyMockMaker.java:429)
14:49:05 [2026-10-20T12:49:05.866Z] at org.mockito.internal.creation.bytebuddy.InlineDelegateByteBuddyMockMaker.doCreateMock(InlineDelegateByteBuddyMockMaker.java:388)
14:49:05 [2026-10-20T12:49:05.866Z] at org.mockito.internal.creation.bytebuddy.InlineDelegateByteBuddyMockMaker.createMock(InlineDelegateByteBuddyMockMaker.java:367)
14:49:05 [2026-10-20T12:49:05.866Z] at org.mockito.internal.creation.bytebuddy.InlineByteBuddyMockMaker.createMock(InlineByteBuddyMockMaker.java:56)
14:49:05 [2026-10-20T12:49:05.866Z] at org.mockito.internal.util.MockUtil.createMock(MockUtil.java:99)
14:49:05 [2026-10-20T12:49:05.866Z] at org.mockito.internal.MockitoCore.mock(MockitoCore.java:84)
14:49:05 [2026-10-20T12:49:05.867Z] at org.mockito.Mockito.mock(Mockito.java:2198)
14:49:05 [2026-10-20T12:49:05.867Z] at org.mockito.Mockito.mock(Mockito.java:2113)
14:49:05 [2026-10-20T12:49:05.867Z] at org.silverpeas.kernel.test.DependencyResolver.resolveDependency(DependencyResolver.java:155)
14:49:05 [2026-10-20T12:49:05.867Z] at org.silverpeas.kernel.test.DependencyResolver.lambda$resolve$1(DependencyResolver.java:105)
14:49:05 [2026-10-20T12:49:05.867Z] at java.base/java.util.Optional.orElseGet(Optional.java:364)
14:49:05 [2026-10-20T12:49:05.867Z] at org.silverpeas.kernel.test.DependencyResolver.lambda$resolve$2(DependencyResolver.java:105)
14:49:05 [2026-10-20T12:49:05.867Z] at java.base/java.util.stream.ForEachOps$ForEachOp$OfRef.accept(ForEachOps.java:184)
14:49:05 [2026-10-20T12:49:05.867Z] at java.base/java.util.stream.ReferencePipeline$2$1.accept(ReferencePipeline.java:179)
14:49:05 [2026-10-20T12:49:05.867Z] at java.base/java.util.Spliterators$ArraySpliterator.forEachRemaining(Spliterators.java:1024)
14:49:05 [2026-10-20T12:49:05.867Z] at java.base/java.util.stream.AbstractPipeline.copyInto(AbstractPipeline.java:509)
14:49:05 [2026-10-20T12:49:05.867Z] at java.base/java.util.stream.AbstractPipeline.wrapAndCopyInto(AbstractPipeline.java:499)
14:49:05 [2026-10-20T12:49:05.867Z] at java.base/java.util.stream.ForEachOps$ForEachOp.evaluateSequential(ForEachOps.java:151)
14:49:05 [2026-10-20T12:49:05.867Z] at java.base/java.util.stream.ForEachOps$ForEachOp$OfRef.evaluateSequential(ForEachOps.java:174)
14:49:05 [2026-10-20T12:49:05.867Z] at java.base/java.util.stream.AbstractPipeline.evaluate(AbstractPipeline.java:234)
14:49:05 [2026-10-20T12:49:05.867Z] at java.base/java.util.stream.ReferencePipeline.forEach(ReferencePipeline.java:596)
14:49:05 [2026-10-20T12:49:05.867Z] at org.silverpeas.kernel.test.DependencyResolver.lambda$resolve$3(DependencyResolver.java:102)
14:49:05 [2026-10-20T12:49:05.867Z] at org.silverpeas.kernel.test.util.Reflections.loopInheritance(Reflections.java:68)
14:49:05 [2026-10-20T12:49:05.867Z] at org.silverpeas.kernel.test.DependencyResolver.resolve(DependencyResolver.java:98)
14:49:05 [2026-10-20T12:49:05.867Z] at org.silverpeas.kernel.test.DependencyResolverTest.genericInjectionIsMockedWhenNoManagedBeanIsAvailable(DependencyResolverTest.java:67)
14:49:05 [2026-10-20T12:49:05.867Z] at java.base/jdk.internal.reflect.DirectMethodHandleAccessor.invoke(DirectMethodHandleAccessor.java:103)
14:49:05 [2026-10-20T12:49:05.867Z] at java.base/java.lang.reflect.Method.invoke(Method.java:580)
14:49:05 [2026-10-20T12:49:05.867Z] at org.junit.platform.commons.util.ReflectionUtils.invokeMethod(ReflectionUtils.java:787)
14:49:05 [2026-10-20T12:49:05.867Z] at org.junit.platform.commons.support.ReflectionSupport.invokeMethod(ReflectionSupport.java:478)
14:49:05 [2026-10-20T12:49:05.867Z] at org.junit.jupiter.engine.execution.MethodInvocation.proceed(MethodInvocation.java:60)
14:49:05 [2026-10-20T12:49:05.867Z] at org.junit.jupiter.engine.execution.InvocationInterceptorChain$ValidatingInvocation.proceed(InvocationInterceptorChain.java:131)
14:49:05 [2026-10-20T12:49:05.867Z] at org.junit.jupiter.engine.extension.TimeoutExtension.intercept(TimeoutExtension.java:161)
14:49:05 [2026-10-20T12:49:05.867Z] at org.junit.jupiter.engine.extension.TimeoutExtension.interceptTestableMethod(TimeoutExtension.java:152)
14:49:05 [2026-10-20T12:49:05.867Z] at org.junit.jupiter.engine.extension.TimeoutExtension.interceptTestMethod(TimeoutExtension.java:91)
14:49:05 [2026-10-20T12:49:05.867Z] at org.junit.jupiter.engine.execution.InterceptingExecutableInvoker$ReflectiveInterceptorCall.lambda$ofVoidMethod$0(InterceptingExecutableInvoker.java:112)
14:49:05 [2026-10-20T12:49:05.867Z] at org.junit.jupiter.engine.execution.InterceptingExecutableInvoker.lambda$invoke$0(InterceptingExecutableInvoker.java:94)
14:49:05 [2026-10-20T12:49:05.867Z] at org.junit.jupiter.engine.execution.InvocationInterceptorChain$InterceptedInvocation.proceed(InvocationInterceptorChain.java:106)
14:49:05 [2026-10-20T12:49:05.867Z] at org.junit.jupiter.engine.execution.InvocationInterceptorChain.proceed(InvocationInterceptorChain.java:64)
14:49:05 [2026-10-20T12:49:05.867Z] at org.junit.jupiter.engine.execution.InvocationInterceptorChain.chainAndInvoke(InvocationInterceptorChain.java:45)
14:49:05 [2026-10-20T12:49:05.867Z] at org.junit.jupiter.engine.execution.InvocationInterceptorChain.invoke(InvocationInterceptorChain.java:37)
14:49:05 [2026-10-20T12:49:05.867Z] at org.junit.jupiter.engine.execution.InterceptingExecutableInvoker.invoke(InterceptingExecutableInvoker.java:93)
14:49:05 [2026-10-20T12:49:05.867Z] at org.junit.jupiter.engine.execution.InterceptingExecutableInvoker.invoke(InterceptingExecutableInvoker.java:87)
14:49:05 [2026-10-20T12:49:05.867Z] at org.junit.jupiter.engine.descriptor.TestMethodTestDescriptor.lambda$invokeTestMethod$4(TestMethodTestDescriptor.java:221)
14:49:05 [2026-10-20T12:49:05.867Z] at org.junit.platform.engine.support.hierarchical.ThrowableCollector.execute(ThrowableCollector.java:73)
14:49:05 [2026-10-20T12:49:05.867Z] at org.junit.jupiter.engine.descriptor.TestMethodTestDescriptor.invokeTestMethod(TestMethodTestDescriptor.java:217)
14:49:05 [2026-10-20T12:49:05.867Z] at org.junit.jupiter.engine.descriptor.TestMethodTestDescriptor.execute(TestMethodTestDescriptor.java:159)
14:49:05 [2026-10-20T12:49:05.867Z] at org.junit.jupiter.engine.descriptor.TestMethodTestDescriptor.execute(TestMethodTestDescriptor.java:70)
14:49:05 [2026-10-20T12:49:05.867Z] at org.junit.platform.engine.support.hierarchical.NodeTestTask.lambda$executeRecursively$6(NodeTestTask.java:157)
14:49:05 [2026-10-20T12:49:05.867Z] at org.junit.platform.engine.support.hierarchical.ThrowableCollector.execute(ThrowableCollector.java:73)
14:49:05 [2026-10-20T12:49:05.867Z] at org.junit.platform.engine.support.hierarchical.NodeTestTask.lambda$executeRecursively$8(NodeTestTask.java:147)
14:49:05 [2026-10-20T12:49:05.867Z] at org.junit.platform.engine.support.hierarchical.Node.around(Node.java:137)
14:49:05 [2026-10-20T12:49:05.867Z] at org.junit.platform.engine.support.hierarchical.NodeTestTask.lambda$executeRecursively$9(NodeTestTask.java:145)
14:49:05 [2026-10-20T12:49:05.867Z] at org.junit.platform.engine.support.hierarchical.ThrowableCollector.execute(ThrowableCollector.java:73)
14:49:05 [2026-10-20T12:49:05.867Z] at org.junit.platform.engine.support.hierarchical.NodeTestTask.executeRecursively(NodeTestTask.java:144)
14:49:05 [2026-10-20T12:49:05.867Z] at org.junit.platform.engine.support.hierarchical.NodeTestTask.execute(NodeTestTask.java:101)
14:49:05 [2026-10-20T12:49:05.867Z] at org.junit.platform.engine.support.hierarchical.ForkJoinPoolHierarchicalTestExecutorService$ExclusiveTask.exec(ForkJoinPoolHierarchicalTestExecutorService.java:274)
14:49:05 [2026-10-20T12:49:05.867Z] at org.junit.platform.engine.support.hierarchical.ForkJoinPoolHierarchicalTestExecutorService$ExclusiveTask.execSync(ForkJoinPoolHierarchicalTestExecutorService.java:247)
14:49:05 [2026-10-20T12:49:05.867Z] at org.junit.platform.engine.support.hierarchical.ForkJoinPoolHierarchicalTestExecutorService.executeSync(ForkJoinPoolHierarchicalTestExecutorService.java:194)
14:49:05 [2026-10-20T12:49:05.867Z] at org.junit.platform.engine.support.hierarchical.ForkJoinPoolHierarchicalTestExecutorService.invokeAll(ForkJoinPoolHierarchicalTestExecutorService.java:166)
14:49:05 [2026-10-20T12:49:05.867Z] at org.junit.platform.engine.support.hierarchical.NodeTestTask.lambda$executeRecursively$6(NodeTestTask.java:161)
14:49:05 [2026-10-20T12:49:05.867Z] at org.junit.platform.engine.support.hierarchical.ThrowableCollector.execute(ThrowableCollector.java:73)
14:49:05 [2026-10-20T12:49:05.867Z] at org.junit.platform.engine.support.hierarchical.NodeTestTask.lambda$executeRecursively$8(NodeTestTask.java:147)
14:49:05 [2026-10-20T12:49:05.867Z] at org.junit.platform.engine.support.hierarchical.Node.around(Node.java:137)
14:49:05 [2026-10-20T12:49:05.867Z] at org.junit.platform.engine.support.hierarchical.NodeTestTask.lambda$executeRecursively$9(NodeTestTask.java:145)
14:49:05 [2026-10-20T12:49:05.867Z] at org.junit.platform.engine.support.hierarchical.ThrowableCollector.execute(ThrowableCollector.java:73)
14:49:05 [2026-10-20T12:49:05.867Z] at org.junit.platform.engine.support.hierarchical.NodeTestTask.executeRecursively(NodeTestTask.java:144)
14:49:05 [2026-10-20T12:49:05.867Z] at org.junit.platform.engine.support.hierarchical.NodeTestTask.execute(NodeTestTask.java:101)
14:49:05 [2026-10-20T12:49:05.867Z] at org.junit.platform.engine.support.hierarchical.ForkJoinPoolHierarchicalTestExecutorService$ExclusiveTask.exec(ForkJoinPoolHierarchicalTestExecutorService.java:274)
14:49:05 [2026-10-20T12:49:05.867Z] at org.junit.platform.engine.support.hierarchical.ForkJoinPoolHierarchicalTestExecutorService$ExclusiveTask.execSync(ForkJoinPoolHierarchicalTestExecutorService.java:247)
14:49:05 [2026-10-20T12:49:05.867Z] at org.junit.platform.engine.support.hierarchical.ForkJoinPoolHierarchicalTestExecutorService.executeSync(ForkJoinPoolHierarchicalTestExecutorService.java:194)
14:49:05 [2026-10-20T12:49:05.867Z] at org.junit.platform.engine.support.hierarchical.ForkJoinPoolHierarchicalTestExecutorService.invokeAll(ForkJoinPoolHierarchicalTestExecutorService.java:166)
14:49:05 [2026-10-20T12:49:05.867Z] at org.junit.platform.engine.support.hierarchical.NodeTestTask.lambda$executeRecursively$6(NodeTestTask.java:161)
14:49:05 [2026-10-20T12:49:05.867Z] at org.junit.platform.engine.support.hierarchical.ThrowableCollector.execute(ThrowableCollector.java:73)
14:49:05 [2026-10-20T12:49:05.867Z] at org.junit.platform.engine.support.hierarchical.NodeTestTask.lambda$executeRecursively$8(NodeTestTask.java:147)
14:49:05 [2026-10-20T12:49:05.867Z] at org.junit.platform.engine.support.hierarchical.Node.around(Node.java:137)
14:49:05 [2026-10-20T12:49:05.867Z] at org.junit.platform.engine.support.hierarchical.NodeTestTask.lambda$executeRecursively$9(NodeTestTask.java:145)
14:49:05 [2026-10-20T12:49:05.867Z] at org.junit.platform.engine.support.hierarchical.ThrowableCollector.execute(ThrowableCollector.java:73)
14:49:05 [2026-10-20T12:49:05.867Z] at org.junit.platform.engine.support.hierarchical.NodeTestTask.executeRecursively(NodeTestTask.java:144)
14:49:05 [2026-10-20T12:49:05.867Z] at org.junit.platform.engine.support.hierarchical.NodeTestTask.execute(NodeTestTask.java:101)
14:49:05 [2026-10-20T12:49:05.867Z] at org.junit.platform.engine.support.hierarchical.ForkJoinPoolHierarchicalTestExecutorService$ExclusiveTask.exec(ForkJoinPoolHierarchicalTestExecutorService.java:274)
14:49:05 [2026-10-20T12:49:05.867Z] at java.base/java.util.concurrent.ForkJoinTask.doExec(ForkJoinTask.java:387)
14:49:05 [2026-10-20T12:49:05.867Z] at java.base/java.util.concurrent.ForkJoinPool$WorkQueue.topLevelExec(ForkJoinPool.java:1312)
14:49:05 [2026-10-20T12:49:05.867Z] at java.base/java.util.concurrent.ForkJoinPool.scan(ForkJoinPool.java:1843)
14:49:05 [2026-10-20T12:49:05.867Z] at java.base/java.util.concurrent.ForkJoinPool.runWorker(ForkJoinPool.java:1808)
14:49:05 [2026-10-20T12:49:05.868Z] at java.base/java.util.concurrent.ForkJoinWorkerThread.run(ForkJoinWorkerThread.java:188)
14:49:05 [2026-10-20T12:49:05.868Z] Caused by: java.io.IOException: Error while instrumenting org/silverpeas/kernel/test/MyBean$MockitoMock$sz7oczFT$auxiliary$3jGvzUKg with JaCoCo 0.8.8.202204050719/5dcf34a.
14:49:05 [2026-10-20T12:49:05.868Z] at org.jacoco.agent.rt.internal_b6258fc.core.instr.Instrumenter.instrumentError(Instrumenter.java:161)
14:49:05 [2026-10-20T12:49:05.868Z] at org.jacoco.agent.rt.internal_b6258fc.core.instr.Instrumenter.instrument(Instrumenter.java:111)
14:49:05 [2026-10-20T12:49:05.868Z] at org.jacoco.agent.rt.internal_b6258fc.CoverageTransformer.transform(CoverageTransformer.java:92)
14:49:05 [2026-10-20T12:49:05.868Z] ... 119 more
14:49:05 [2026-10-20T12:49:05.868Z] Caused by: java.lang.IllegalArgumentException: Unsupported class file major version 65
14:49:05 [2026-10-20T12:49:05.868Z] at org.jacoco.agent.rt.internal_b6258fc.asm.ClassReader.<init>(ClassReader.java:199)
14:49:05 [2026-10-20T12:49:05.868Z] at org.jacoco.agent.rt.internal_b6258fc.asm.ClassReader.<init>(ClassReader.java:180)
14:49:05 [2026-10-20T12:49:05.868Z] at org.jacoco.agent.rt.internal_b6258fc.asm.ClassReader.<init>(ClassReader.java:166)
14:49:05 [2026-10-20T12:49:05.868Z] at org.jacoco.agent.rt.internal_b6258fc.core.internal.instr.InstrSupport.classReaderFor(InstrSupport.java:280)
14:49:05 [2026-10-20T12:49:05.868Z] at org.jacoco.agent.rt.internal_b6258fc.core.instr.Instrumenter.instrument(Instrumenter.java:77)
14:49:05 [2026-10-20T12:49:05.868Z] at org.jacoco.agent.rt.internal_b6258fc.core.instr.Instrumenter.instrument(Instrumenter.java:109)
14:49:05 [2026-10-20T12:49:05.868Z] ... 120 more
14:49:05 [2026-10-20T12:49:05.868Z] [INFO] Tests run: 5, Failures: 0, Errors: 0, Skipped: 0, Time elapsed: 0.199 s - in org.silverpeas.kernel.test.DependencyResolverTest
14:49:06 [2026-10-20T12:49:06.118Z] [INFO]
14:49:06 [2026-10-20T12:49:06.118Z] [INFO] Results:
14:49:06 [2026-10-20T12:49:06.118Z] [INFO]
14:49:06 [2026-10-20T12:49:06.118Z] [INFO] Tests run: 41, Failures: 0, Errors: 0, Skipped: 0
14:49:06 [2026-10-20T12:49:06.118Z] [INFO]
14:49:06 [2026-10-20T12:49:06.118Z] [INFO]
14:49:06 [2026-10-20T12:49:06.118Z] [INFO] --- jar:3.3.0:jar (default-jar) @ silverpeas-kernel-test ---
14:49:06 [2026-10-20T12:49:06.369Z] [INFO] Building jar: /var/lib/jenkins/workspace/Silverpeas_Kernel_AutoDeploy/kernel-test/target/silverpeas-kernel-test-2.0-build261020.jar
14:49:06 [2026-10-20T12:49:06.369Z] [INFO]
14:49:06 [2026-10-20T12:49:06.369Z] [INFO] --- site:3.12.1:attach-descriptor (attach-descriptor) @ silverpeas-kernel-test ---
14:49:06 [2026-10-20T12:49:06.369Z] [INFO] Skipping because packaging 'jar' is not pom.
14:49:06 [2026-10-20T12:49:06.369Z] [INFO]
14:49:06 [2026-10-20T12:49:06.369Z] [INFO] --- source:3.2.1:jar-no-fork (bundle-source) @ silverpeas-kernel-test ---
14:49:06 [2026-10-20T12:49:06.369Z] [INFO] Building jar: /var/lib/jenkins/workspace/Silverpeas_Kernel_AutoDeploy/kernel-test/target/silverpeas-kernel-test-2.0-build261020-sources.jar
14:49:06 [2026-10-20T12:49:06.369Z] [INFO]
14:49:06 [2026-10-20T12:49:06.369Z] [INFO] --- javadoc:3.4.1:jar (attach-javadocs) @ silverpeas-kernel-test ---
14:49:06 [2026-10-20T12:49:06.369Z] [INFO] No previous run data found, generating javadoc.
14:49:08 [2026-10-20T12:49:08.851Z] [ERROR] MavenReportException: Error while generating Javadoc:
14:49:08 [2026-10-20T12:49:08.851Z] Exit code: 1 - warning: unknown enum constant When.ALWAYS
14:49:08 [2026-10-20T12:49:08.851Z] reason: class file for javax.annotation.meta.When not found
14:49:08 [2026-10-20T12:49:08.851Z] warning: unknown enum constant When.UNKNOWN
14:49:08 [2026-10-20T12:49:08.851Z] /var/lib/jenkins/workspace/Silverpeas_Kernel_AutoDeploy/kernel-test/src/main/java/org/silverpeas/kernel/test/DependencyResolver.java:57: warning: use of default constructor, which does not provide a comment
14:49:08 [2026-10-20T12:49:08.851Z] public class DependencyResolver {
14:49:08 [2026-10-20T12:49:08.851Z] ^
14:49:08 [2026-10-20T12:49:08.851Z] /var/lib/jenkins/workspace/Silverpeas_Kernel_AutoDeploy/kernel-test/src/main/java/org/silverpeas/kernel/test/extension/LocalizationBundleStub.java:79: warning: no comment
14:49:08 [2026-10-20T12:49:08.851Z] public LocalizationBundleStub(final String bundleName, String ...languages) {
14:49:08 [2026-10-20T12:49:08.851Z] ^
14:49:08 [2026-10-20T12:49:08.851Z] /var/lib/jenkins/workspace/Silverpeas_Kernel_AutoDeploy/kernel-test/src/main/java/org/silverpeas/kernel/test/extension/LocalizationBundleStub.java:139: warning: no comment
14:49:08 [2026-10-20T12:49:08.851Z] protected void clear() {
14:49:08 [2026-10-20T12:49:08.851Z] ^
14:49:08 [2026-10-20T12:49:08.851Z] /var/lib/jenkins/workspace/Silverpeas_Kernel_AutoDeploy/kernel-test/src/main/java/org/silverpeas/kernel/test/extension/LoggerExtension.java:44: warning: use of default constructor, which does not provide a comment
14:49:08 [2026-10-20T12:49:08.851Z] public class LoggerExtension implements BeforeEachCallback {
14:49:08 [2026-10-20T12:49:08.851Z] ^
14:49:08 [2026-10-20T12:49:08.851Z] /var/lib/jenkins/workspace/Silverpeas_Kernel_AutoDeploy/kernel-test/src/main/java/org/silverpeas/kernel/test/extension/LoggerLevel.java:46: warning: no comment
14:49:08 [2026-10-20T12:49:08.851Z] Level value();
14:49:08 [2026-10-20T12:49:08.851Z] ^
14:49:08 [2026-10-20T12:49:08.851Z] /var/lib/jenkins/workspace/Silverpeas_Kernel_AutoDeploy/kernel-test/src/main/java/org/silverpeas/kernel/test/util/Reflections.java:255: warning: no comment
14:49:08 [2026-10-20T12:49:08.851Z] void consume(final Class<?> type) throws ReflectiveOperationException;
14:49:08 [2026-10-20T12:49:08.851Z] ^
14:49:08 [2026-10-20T12:49:08.851Z] /var/lib/jenkins/workspace/Silverpeas_Kernel_AutoDeploy/kernel-test/src/main/java/org/silverpeas/kernel/test/extension/SettingBundleStub.java:64: warning: no main description
14:49:08 [2026-10-20T12:49:08.851Z] * @param cls the static class containing the setting attribute.
14:49:08 [2026-10-20T12:49:08.851Z] ^
14:49:08 [2026-10-20T12:49:08.852Z] /var/lib/jenkins/workspace/Silverpeas_Kernel_AutoDeploy/kernel-test/src/main/java/org/silverpeas/kernel/test/extension/SettingBundleStub.java:153: warning: no comment
14:49:08 [2026-10-20T12:49:08.852Z] protected void clear() throws IllegalAccessException {
14:49:08 [2026-10-20T12:49:08.852Z] ^
14:49:08 [2026-10-20T12:49:08.852Z] /var/lib/jenkins/workspace/Silverpeas_Kernel_AutoDeploy/kernel-test/src/main/java/org/silverpeas/kernel/test/util/SilverpeasReflectionException.java:34: warning: no comment
14:49:08 [2026-10-20T12:49:08.852Z] public SilverpeasReflectionException(String message) {
14:49:08 [2026-10-20T12:49:08.852Z] ^
14:49:08 [2026-10-20T12:49:08.852Z] /var/lib/jenkins/workspace/Silverpeas_Kernel_AutoDeploy/kernel-test/src/main/java/org/silverpeas/kernel/test/util/SilverpeasReflectionException.java:38: warning: no comment
14:49:08 [2026-10-20T12:49:08.852Z] public SilverpeasReflectionException(String message, Throwable cause) {
14:49:08 [2026-10-20T12:49:08.852Z] ^
14:49:08 [2026-10-20T12:49:08.852Z] /var/lib/jenkins/workspace/Silverpeas_Kernel_AutoDeploy/kernel-test/src/main/java/org/silverpeas/kernel/test/util/SilverpeasReflectionException.java:42: warning: no comment
14:49:08 [2026-10-20T12:49:08.852Z] public SilverpeasReflectionException(Throwable t) {
14:49:08 [2026-10-20T12:49:08.852Z] ^
14:49:08 [2026-10-20T12:49:08.852Z] /var/lib/jenkins/workspace/Silverpeas_Kernel_AutoDeploy/kernel-test/src/main/java/org/silverpeas/kernel/test/extension/SilverTestEnv.java:133: error: unexpected end tag: </p>
14:49:08 [2026-10-20T12:49:08.852Z] * </p>
14:49:08 [2026-10-20T12:49:08.852Z] ^
14:49:08 [2026-10-20T12:49:08.852Z] /var/lib/jenkins/workspace/Silverpeas_Kernel_AutoDeploy/kernel-test/src/main/java/org/silverpeas/kernel/test/extension/SilverTestEnv.java:89: warning: use of default constructor, which does not provide a comment
14:49:08 [2026-10-20T12:49:08.852Z] public class SilverTestEnv
14:49:08 [2026-10-20T12:49:08.852Z] ^
14:49:08 [2026-10-20T12:49:08.852Z] /var/lib/jenkins/workspace/Silverpeas_Kernel_AutoDeploy/kernel-test/src/main/java/org/silverpeas/kernel/test/extension/SilverTestEnvContext.java:42: warning: use of default constructor, which does not provide a comment
14:49:08 [2026-10-20T12:49:08.852Z] public abstract class SilverTestEnvContext {
14:49:08 [2026-10-20T12:49:08.852Z] ^
14:49:08 [2026-10-20T12:49:08.852Z] /var/lib/jenkins/workspace/Silverpeas_Kernel_AutoDeploy/kernel-test/src/main/java/org/silverpeas/kernel/test/annotations/SystemProperties.java:42: warning: no comment
14:49:08 [2026-10-20T12:49:08.852Z] SystemProperty[] value();
14:49:08 [2026-10-20T12:49:08.852Z] ^
14:49:08 [2026-10-20T12:49:08.852Z] /var/lib/jenkins/workspace/Silverpeas_Kernel_AutoDeploy/kernel-test/src/main/java/org/silverpeas/kernel/test/annotations/SystemProperty.java:43: warning: no comment
14:49:08 [2026-10-20T12:49:08.852Z] String key();
14:49:08 [2026-10-20T12:49:08.852Z] ^
14:49:08 [2026-10-20T12:49:08.852Z] /var/lib/jenkins/workspace/Silverpeas_Kernel_AutoDeploy/kernel-test/src/main/java/org/silverpeas/kernel/test/annotations/SystemProperty.java:45: warning: no comment
14:49:08 [2026-10-20T12:49:08.852Z] String value();
14:49:08 [2026-10-20T12:49:08.852Z] ^
14:49:08 [2026-10-20T12:49:08.852Z] /var/lib/jenkins/workspace/Silverpeas_Kernel_AutoDeploy/kernel-test/src/main/java/org/silverpeas/kernel/test/TestBeanContainer.java:164: warning: no @param for <T>
14:49:08 [2026-10-20T12:49:08.852Z] public <T> void putBean(Class<T> beanType, Class<? super T> type, Annotation... qualifiers) {
14:49:08 [2026-10-20T12:49:08.852Z] ^
14:49:08 [2026-10-20T12:49:08.852Z] /var/lib/jenkins/workspace/Silverpeas_Kernel_AutoDeploy/kernel-test/src/main/java/org/silverpeas/kernel/test/TestBeanContainer.java:74: warning: use of default constructor, which does not provide a comment
14:49:08 [2026-10-20T12:49:08.852Z] public class TestBeanContainer implements BeanContainer {
14:49:08 [2026-10-20T12:49:08.852Z] ^
14:49:08 [2026-10-20T12:49:08.852Z] /var/lib/jenkins/workspace/Silverpeas_Kernel_AutoDeploy/kernel-test/src/main/java/org/silverpeas/kernel/test/TestContext.java:45: warning: no comment
14:49:08 [2026-10-20T12:49:08.852Z] public static TestContext getInstance() {
14:49:08 [2026-10-20T12:49:08.852Z] ^
14:49:08 [2026-10-20T12:49:08.852Z] /var/lib/jenkins/workspace/Silverpeas_Kernel_AutoDeploy/kernel-test/src/main/java/org/silverpeas/kernel/TestManagedBeanFeeder.java:42: warning: use of default constructor, which does not provide a comment
14:49:08 [2026-10-20T12:49:08.852Z] public final class TestManagedBeanFeeder {
14:49:08 [2026-10-20T12:49:08.852Z] ^
14:49:08 [2026-10-20T12:49:08.852Z] /var/lib/jenkins/workspace/Silverpeas_Kernel_AutoDeploy/kernel-test/src/main/java/org/silverpeas/kernel/test/annotations/TestManagedBeans.java:43: warning: no comment
14:49:08 [2026-10-20T12:49:08.852Z] Class<?>[] value();
14:49:08 [2026-10-20T12:49:08.852Z] ^
14:49:08 [2026-10-20T12:49:08.852Z] /var/lib/jenkins/workspace/Silverpeas_Kernel_AutoDeploy/kernel-test/src/main/java/org/silverpeas/kernel/test/annotations/TestManagedMock.java:65: warning: no @return
14:49:08 [2026-10-20T12:49:08.852Z] boolean stubbed() default true;
14:49:08 [2026-10-20T12:49:08.852Z] ^
14:49:08 [2026-10-20T12:49:08.852Z] /var/lib/jenkins/workspace/Silverpeas_Kernel_AutoDeploy/kernel-test/src/main/java/org/silverpeas/kernel/test/annotations/TestManagedMocks.java:43: warning: no comment
14:49:08 [2026-10-20T12:49:08.852Z] Class<?>[] value();
14:49:08 [2026-10-20T12:49:08.852Z] ^
14:49:08 [2026-10-20T12:49:08.852Z] /var/lib/jenkins/workspace/Silverpeas_Kernel_AutoDeploy/kernel-test/src/main/java/org/silverpeas/kernel/test/TestResourcesLocation.java:39: warning: use of default constructor, which does not provide a comment
14:49:08 [2026-10-20T12:49:08.852Z] public class TestResourcesLocation implements SilverpeasResourcesLocation {
14:49:08 [2026-10-20T12:49:08.852Z] ^
14:49:08 [2026-10-20T12:49:08.852Z] /var/lib/jenkins/workspace/Silverpeas_Kernel_AutoDeploy/kernel-test/src/main/java/org/silverpeas/kernel/test/TestSystemWrapper.java:45: warning: no comment
14:49:08 [2026-10-20T12:49:08.852Z] public TestSystemWrapper() {
14:49:08 [2026-10-20T12:49:08.852Z] ^
14:49:08 [2026-10-20T12:49:08.852Z] 1 error
14:49:08 [2026-10-20T12:49:08.852Z] 27 warnings
14:49:08 [2026-10-20T12:49:08.852Z]
14:49:08 [2026-10-20T12:49:08.852Z] Command line was: /usr/lib/jvm/java-21-openjdk-amd64/bin/javadoc @options @packages
14:49:08 [2026-10-20T12:49:08.852Z]
14:49:08 [2026-10-20T12:49:08.852Z] Refer to the generated Javadoc files in '/var/lib/jenkins/workspace/Silverpeas_Kernel_AutoDeploy/kernel-test/target/apidocs' dir.
14:49:08 [2026-10-20T12:49:08.852Z]
14:49:08 [2026-10-20T12:49:08.852Z] org.apache.maven.reporting.MavenReportException:
14:49:08 [2026-10-20T12:49:08.852Z] Exit code: 1 - warning: unknown enum constant When.ALWAYS
14:49:08 [2026-10-20T12:49:08.852Z] reason: class file for javax.annotation.meta.When not found
14:49:08 [2026-10-20T12:49:08.852Z] warning: unknown enum constant When.UNKNOWN
14:49:08 [2026-10-20T12:49:08.852Z] /var/lib/jenkins/workspace/Silverpeas_Kernel_AutoDeploy/kernel-test/src/main/java/org/silverpeas/kernel/test/DependencyResolver.java:57: warning: use of default constructor, which does not provide a comment
14:49:08 [2026-10-20T12:49:08.852Z] public class DependencyResolver {
14:49:08 [2026-10-20T12:49:08.852Z] ^
14:49:08 [2026-10-20T12:49:08.852Z] /var/lib/jenkins/workspace/Silverpeas_Kernel_AutoDeploy/kernel-test/src/main/java/org/silverpeas/kernel/test/extension/LocalizationBundleStub.java:79: warning: no comment
14:49:08 [2026-10-20T12:49:08.852Z] public LocalizationBundleStub(final String bundleName, String ...languages) {
14:49:08 [2026-10-20T12:49:08.852Z] ^
14:49:08 [2026-10-20T12:49:08.852Z] /var/lib/jenkins/workspace/Silverpeas_Kernel_AutoDeploy/kernel-test/src/main/java/org/silverpeas/kernel/test/extension/LocalizationBundleStub.java:139: warning: no comment
14:49:08 [2026-10-20T12:49:08.852Z] protected void clear() {
14:49:08 [2026-10-20T12:49:08.852Z] ^
14:49:08 [2026-10-20T12:49:08.852Z] /var/lib/jenkins/workspace/Silverpeas_Kernel_AutoDeploy/kernel-test/src/main/java/org/silverpeas/kernel/test/extension/LoggerExtension.java:44: warning: use of default constructor, which does not provide a comment
14:49:08 [2026-10-20T12:49:08.852Z] public class LoggerExtension implements BeforeEachCallback {
14:49:08 [2026-10-20T12:49:08.852Z] ^
14:49:08 [2026-10-20T12:49:08.852Z] /var/lib/jenkins/workspace/Silverpeas_Kernel_AutoDeploy/kernel-test/src/main/java/org/silverpeas/kernel/test/extension/LoggerLevel.java:46: warning: no comment
14:49:08 [2026-10-20T12:49:08.852Z] Level value();
14:49:08 [2026-10-20T12:49:08.852Z] ^
14:49:08 [2026-10-20T12:49:08.852Z] /var/lib/jenkins/workspace/Silverpeas_Kernel_AutoDeploy/kernel-test/src/main/java/org/silverpeas/kernel/test/util/Reflections.java:255: warning: no comment
14:49:08 [2026-10-20T12:49:08.852Z] void consume(final Class<?> type) throws ReflectiveOperationException;
14:49:08 [2026-10-20T12:49:08.852Z] ^
14:49:08 [2026-10-20T12:49:08.852Z] /var/lib/jenkins/workspace/Silverpeas_Kernel_AutoDeploy/kernel-test/src/main/java/org/silverpeas/kernel/test/extension/SettingBundleStub.java:64: warning: no main description
14:49:08 [2026-10-20T12:49:08.852Z] * @param cls the static class containing the setting attribute.
14:49:08 [2026-10-20T12:49:08.852Z] ^
14:49:08 [2026-10-20T12:49:08.852Z] /var/lib/jenkins/workspace/Silverpeas_Kernel_AutoDeploy/kernel-test/src/main/java/org/silverpeas/kernel/test/extension/SettingBundleStub.java:153: warning: no comment
14:49:08 [2026-10-20T12:49:08.852Z] protected void clear() throws IllegalAccessException {
14:49:08 [2026-10-20T12:49:08.852Z] ^
14:49:08 [2026-10-20T12:49:08.852Z] /var/lib/jenkins/workspace/Silverpeas_Kernel_AutoDeploy/kernel-test/src/main/java/org/silverpeas/kernel/test/util/SilverpeasReflectionException.java:34: warning: no comment
14:49:08 [2026-10-20T12:49:08.852Z] public SilverpeasReflectionException(String message) {
14:49:08 [2026-10-20T12:49:08.852Z] ^
14:49:08 [2026-10-20T12:49:08.852Z] /var/lib/jenkins/workspace/Silverpeas_Kernel_AutoDeploy/kernel-test/src/main/java/org/silverpeas/kernel/test/util/SilverpeasReflectionException.java:38: warning: no comment
14:49:08 [2026-10-20T12:49:08.852Z] public SilverpeasReflectionException(String message, Throwable cause) {
14:49:08 [2026-10-20T12:49:08.852Z] ^
14:49:08 [2026-10-20T12:49:08.852Z] /var/lib/jenkins/workspace/Silverpeas_Kernel_AutoDeploy/kernel-test/src/main/java/org/silverpeas/kernel/test/util/SilverpeasReflectionException.java:42: warning: no comment
14:49:08 [2026-10-20T12:49:08.852Z] public SilverpeasReflectionException(Throwable t) {
14:49:08 [2026-10-20T12:49:08.852Z] ^
14:49:08 [2026-10-20T12:49:08.852Z] /var/lib/jenkins/workspace/Silverpeas_Kernel_AutoDeploy/kernel-test/src/main/java/org/silverpeas/kernel/test/extension/SilverTestEnv.java:133: error: unexpected end tag: </p>
14:49:08 [2026-10-20T12:49:08.852Z] * </p>
14:49:08 [2026-10-20T12:49:08.852Z] ^
14:49:08 [2026-10-20T12:49:08.853Z] /var/lib/jenkins/workspace/Silverpeas_Kernel_AutoDeploy/kernel-test/src/main/java/org/silverpeas/kernel/test/extension/SilverTestEnv.java:89: warning: use of default constructor, which does not provide a comment
14:49:08 [2026-10-20T12:49:08.853Z] public class SilverTestEnv
14:49:08 [2026-10-20T12:49:08.853Z] ^
14:49:08 [2026-10-20T12:49:08.853Z] /var/lib/jenkins/workspace/Silverpeas_Kernel_AutoDeploy/kernel-test/src/main/java/org/silverpeas/kernel/test/extension/SilverTestEnvContext.java:42: warning: use of default constructor, which does not provide a comment
14:49:08 [2026-10-20T12:49:08.853Z] public abstract class SilverTestEnvContext {
14:49:08 [2026-10-20T12:49:08.853Z] ^
14:49:08 [2026-10-20T12:49:08.853Z] /var/lib/jenkins/workspace/Silverpeas_Kernel_AutoDeploy/kernel-test/src/main/java/org/silverpeas/kernel/test/annotations/SystemProperties.java:42: warning: no comment
14:49:08 [2026-10-20T12:49:08.853Z] SystemProperty[] value();
14:49:08 [2026-10-20T12:49:08.853Z] ^
14:49:08 [2026-10-20T12:49:08.853Z] /var/lib/jenkins/workspace/Silverpeas_Kernel_AutoDeploy/kernel-test/src/main/java/org/silverpeas/kernel/test/annotations/SystemProperty.java:43: warning: no comment
14:49:08 [2026-10-20T12:49:08.853Z] String key();
14:49:08 [2026-10-20T12:49:08.853Z] ^
14:49:08 [2026-10-20T12:49:08.853Z] /var/lib/jenkins/workspace/Silverpeas_Kernel_AutoDeploy/kernel-test/src/main/java/org/silverpeas/kernel/test/annotations/SystemProperty.java:45: warning: no comment
14:49:08 [2026-10-20T12:49:08.853Z] String value();
14:49:08 [2026-10-20T12:49:08.853Z] ^
14:49:08 [2026-10-20T12:49:08.853Z] /var/lib/jenkins/workspace/Silverpeas_Kernel_AutoDeploy/kernel-test/src/main/java/org/silverpeas/kernel/test/TestBeanContainer.java:164: warning: no @param for <T>
14:49:08 [2026-10-20T12:49:08.853Z] public <T> void putBean(Class<T> beanType, Class<? super T> type, Annotation... qualifiers) {
14:49:08 [2026-10-20T12:49:08.853Z] ^
14:49:08 [2026-10-20T12:49:08.853Z] /var/lib/jenkins/workspace/Silverpeas_Kernel_AutoDeploy/kernel-test/src/main/java/org/silverpeas/kernel/test/TestBeanContainer.java:74: warning: use of default constructor, which does not provide a comment
14:49:08 [2026-10-20T12:49:08.853Z] public class TestBeanContainer implements BeanContainer {
14:49:08 [2026-10-20T12:49:08.853Z] ^
14:49:08 [2026-10-20T12:49:08.853Z] /var/lib/jenkins/workspace/Silverpeas_Kernel_AutoDeploy/kernel-test/src/main/java/org/silverpeas/kernel/test/TestContext.java:45: warning: no comment
14:49:08 [2026-10-20T12:49:08.853Z] public static TestContext getInstance() {
14:49:08 [2026-10-20T12:49:08.853Z] ^
14:49:08 [2026-10-20T12:49:08.853Z] /var/lib/jenkins/workspace/Silverpeas_Kernel_AutoDeploy/kernel-test/src/main/java/org/silverpeas/kernel/TestManagedBeanFeeder.java:42: warning: use of default constructor, which does not provide a comment
14:49:08 [2026-10-20T12:49:08.853Z] public final class TestManagedBeanFeeder {
14:49:08 [2026-10-20T12:49:08.853Z] ^
14:49:08 [2026-10-20T12:49:08.853Z] /var/lib/jenkins/workspace/Silverpeas_Kernel_AutoDeploy/kernel-test/src/main/java/org/silverpeas/kernel/test/annotations/TestManagedBeans.java:43: warning: no comment
14:49:08 [2026-10-20T12:49:08.853Z] Class<?>[] value();
14:49:08 [2026-10-20T12:49:08.853Z] ^
14:49:08 [2026-10-20T12:49:08.853Z] /var/lib/jenkins/workspace/Silverpeas_Kernel_AutoDeploy/kernel-test/src/main/java/org/silverpeas/kernel/test/annotations/TestManagedMock.java:65: warning: no @return
14:49:08 [2026-10-20T12:49:08.853Z] boolean stubbed() default true;
14:49:08 [2026-10-20T12:49:08.853Z] ^
14:49:08 [2026-10-20T12:49:08.853Z] /var/lib/jenkins/workspace/Silverpeas_Kernel_AutoDeploy/kernel-test/src/main/java/org/silverpeas/kernel/test/annotations/TestManagedMocks.java:43: warning: no comment
14:49:08 [2026-10-20T12:49:08.853Z] Class<?>[] value();
14:49:08 [2026-10-20T12:49:08.853Z] ^
14:49:08 [2026-10-20T12:49:08.853Z] /var/lib/jenkins/workspace/Silverpeas_Kernel_AutoDeploy/kernel-test/src/main/java/org/silverpeas/kernel/test/TestResourcesLocation.java:39: warning: use of default constructor, which does not provide a comment
14:49:08 [2026-10-20T12:49:08.853Z] public class TestResourcesLocation implements SilverpeasResourcesLocation {
14:49:08 [2026-10-20T12:49:08.853Z] ^
14:49:08 [2026-10-20T12:49:08.853Z] /var/lib/jenkins/workspace/Silverpeas_Kernel_AutoDeploy/kernel-test/src/main/java/org/silverpeas/kernel/test/TestSystemWrapper.java:45: warning: no comment
14:49:08 [2026-10-20T12:49:08.853Z] public TestSystemWrapper() {
14:49:08 [2026-10-20T12:49:08.853Z] ^
14:49:08 [2026-10-20T12:49:08.853Z] 1 error
14:49:08 [2026-10-20T12:49:08.853Z] 27 warnings
14:49:08 [2026-10-20T12:49:08.853Z]
14:49:08 [2026-10-20T12:49:08.853Z] Command line was: /usr/lib/jvm/java-21-openjdk-amd64/bin/javadoc @options @packages
14:49:08 [2026-10-20T12:49:08.853Z]
14:49:08 [2026-10-20T12:49:08.853Z] Refer to the generated Javadoc files in '/var/lib/jenkins/workspace/Silverpeas_Kernel_AutoDeploy/kernel-test/target/apidocs' dir.
14:49:08 [2026-10-20T12:49:08.853Z]
14:49:08 [2026-10-20T12:49:08.853Z] at org.apache.maven.plugins.javadoc.AbstractJavadocMojo.doExecuteJavadocCommandLine (AbstractJavadocMojo.java:6092)
14:49:08 [2026-10-20T12:49:08.853Z] at org.apache.maven.plugins.javadoc.AbstractJavadocMojo.executeJavadocCommandLine (AbstractJavadocMojo.java:5968)
14:49:08 [2026-10-20T12:49:08.853Z] at org.apache.maven.plugins.javadoc.AbstractJavadocMojo.executeReport (AbstractJavadocMojo.java:2277)
14:49:08 [2026-10-20T12:49:08.853Z] at org.apache.maven.plugins.javadoc.JavadocJar.doExecute (JavadocJar.java:189)
14:49:08 [2026-10-20T12:49:08.853Z] at org.apache.maven.plugins.javadoc.AbstractJavadocMojo.execute (AbstractJavadocMojo.java:2034)
14:49:08 [2026-10-20T12:49:08.853Z] at org.apache.maven.plugin.DefaultBuildPluginManager.executeMojo (DefaultBuildPluginManager.java:126)
14:49:08 [2026-10-20T12:49:08.853Z] at org.apache.maven.lifecycle.internal.MojoExecutor.doExecute2 (MojoExecutor.java:328)
14:49:08 [2026-10-20T12:49:08.853Z] at org.apache.maven.lifecycle.internal.MojoExecutor.doExecute (MojoExecutor.java:316)
14:49:08 [2026-10-20T12:49:08.853Z] at org.apache.maven.lifecycle.internal.MojoExecutor.execute (MojoExecutor.java:212)
14:49:08 [2026-10-20T12:49:08.853Z] at org.apache.maven.lifecycle.internal.MojoExecutor.execute (MojoExecutor.java:174)
14:49:08 [2026-10-20T12:49:08.853Z] at org.apache.maven.lifecycle.internal.MojoExecutor.access$000 (MojoExecutor.java:75)
14:49:08 [2026-10-20T12:49:08.853Z] at org.apache.maven.lifecycle.internal.MojoExecutor$1.run (MojoExecutor.java:162)
14:49:08 [2026-10-20T12:49:08.853Z] at org.apache.maven.plugin.DefaultMojosExecutionStrategy.execute (DefaultMojosExecutionStrategy.java:39)
14:49:08 [2026-10-20T12:49:08.853Z] at org.apache.maven.lifecycle.internal.MojoExecutor.execute (MojoExecutor.java:159)
14:49:08 [2026-10-20T12:49:08.853Z] at org.apache.maven.lifecycle.internal.LifecycleModuleBuilder.buildProject (LifecycleModuleBuilder.java:105)
14:49:08 [2026-10-20T12:49:08.853Z] at org.apache.maven.lifecycle.internal.LifecycleModuleBuilder.buildProject (LifecycleModuleBuilder.java:73)
14:49:08 [2026-10-20T12:49:08.853Z] at org.apache.maven.lifecycle.internal.builder.singlethreaded.SingleThreadedBuilder.build (SingleThreadedBuilder.java:53)
14:49:08 [2026-10-20T12:49:08.853Z] at org.apache.maven.lifecycle.internal.LifecycleStarter.execute (LifecycleStarter.java:118)
14:49:08 [2026-10-20T12:49:08.853Z] at org.apache.maven.DefaultMaven.doExecute (DefaultMaven.java:261)
14:49:08 [2026-10-20T12:49:08.853Z] at org.apache.maven.DefaultMaven.doExecute (DefaultMaven.java:173)
14:49:08 [2026-10-20T12:49:08.853Z] at org.apache.maven.DefaultMaven.execute (DefaultMaven.java:101)
14:49:08 [2026-10-20T12:49:08.853Z] at org.apache.maven.cli.MavenCli.execute (MavenCli.java:919)
14:49:08 [2026-10-20T12:49:08.853Z] at org.apache.maven.cli.MavenCli.doMain (MavenCli.java:285)
14:49:08 [2026-10-20T12:49:08.853Z] at org.apache.maven.cli.MavenCli.main (MavenCli.java:207)
14:49:08 [2026-10-20T12:49:08.853Z] at jdk.internal.reflect.DirectMethodHandleAccessor.invoke (DirectMethodHandleAccessor.java:103)
14:49:08 [2026-10-20T12:49:08.853Z] at java.lang.reflect.Method.invoke (Method.java:580)
14:49:08 [2026-10-20T12:49:08.853Z] at org.codehaus.plexus.classworlds.launcher.Launcher.launchEnhanced (Launcher.java:255)
14:49:08 [2026-10-20T12:49:08.853Z] at org.codehaus.plexus.classworlds.launcher.Launcher.launch (Launcher.java:201)
14:49:08 [2026-10-20T12:49:08.853Z] at org.codehaus.plexus.classworlds.launcher.Launcher.mainWithExitCode (Launcher.java:362)
14:49:08 [2026-10-20T12:49:08.853Z] at org.codehaus.plexus.classworlds.launcher.Launcher.main (Launcher.java:314)
14:49:08 [2026-10-20T12:49:08.853Z] [INFO] Building jar: /var/lib/jenkins/workspace/Silverpeas_Kernel_AutoDeploy/kernel-test/target/silverpeas-kernel-test-2.0-build261020-javadoc.jar
14:49:08 [2026-10-20T12:49:08.853Z] [INFO]
14:49:08 [2026-10-20T12:49:08.853Z] [INFO] --- jacoco:0.8.8:report (tests-coverage) @ silverpeas-kernel-test ---
14:49:08 [2026-10-20T12:49:08.853Z] [INFO] Loading execution data file /var/lib/jenkins/workspace/Silverpeas_Kernel_AutoDeploy/kernel-test/target/jacoco.exec
14:49:08 [2026-10-20T12:49:08.853Z] [INFO] Analyzed bundle 'Silverpeas Kernel Test Library' with 19 classes
14:49:08 [2026-10-20T12:49:08.853Z] [INFO]
14:49:08 [2026-10-20T12:49:08.853Z] [INFO] --- install:3.0.1:install (default-install) @ silverpeas-kernel-test ---
14:49:08 [2026-10-20T12:49:08.853Z] [INFO] Installing /var/lib/jenkins/workspace/Silverpeas_Kernel_AutoDeploy/kernel-test/pom.xml to /home/silverbuild/.m2/repository/org/silverpeas/kernel/silverpeas-kernel-test/2.0-build261020/silverpeas-kernel-test-2.0-build261020.pom
14:49:08 [2026-10-20T12:49:08.853Z] [INFO] Installing /var/lib/jenkins/workspace/Silverpeas_Kernel_AutoDeploy/kernel-test/target/silverpeas-kernel-test-2.0-build261020.jar to /home/silverbuild/.m2/repository/org/silverpeas/kernel/silverpeas-kernel-test/2.0-build261020/silverpeas-kernel-test-2.0-build261020.jar
14:49:08 [2026-10-20T12:49:08.853Z] [INFO] Installing /var/lib/jenkins/workspace/Silverpeas_Kernel_AutoDeploy/kernel-test/target/silverpeas-kernel-test-2.0-build261020-sources.jar to /home/silverbuild/.m2/repository/org/silverpeas/kernel/silverpeas-kernel-test/2.0-build261020/silverpeas-kernel-test-2.0-build261020-sources.jar
14:49:08 [2026-10-20T12:49:08.853Z] [INFO] Installing /var/lib/jenkins/workspace/Silverpeas_Kernel_AutoDeploy/kernel-test/target/silverpeas-kernel-test-2.0-build261020-javadoc.jar to /home/silverbuild/.m2/repository/org/silverpeas/kernel/silverpeas-kernel-test/2.0-build261020/silverpeas-kernel-test-2.0-build261020-javadoc.jar
14:49:08 [2026-10-20T12:49:08.853Z] [INFO] ------------------------------------------------------------------------
14:49:08 [2026-10-20T12:49:08.854Z] [INFO] Reactor Summary for Silverpeas Kernel 2.0-build261020:
14:49:08 [2026-10-20T12:49:08.854Z] [INFO]
14:49:08 [2026-10-20T12:49:08.854Z] [INFO] Silverpeas Kernel .................................. SUCCESS [ 22.332 s]
14:49:08 [2026-10-20T12:49:08.854Z] [INFO] Silverpeas Kernel Library .......................... SUCCESS [ 20.340 s]
14:49:08 [2026-10-20T12:49:08.854Z] [INFO] Silverpeas Kernel Test Library ..................... SUCCESS [ 8.508 s]
14:49:08 [2026-10-20T12:49:08.854Z] [INFO] ------------------------------------------------------------------------
14:49:08 [2026-10-20T12:49:08.854Z] [INFO] BUILD SUCCESS
14:49:08 [2026-10-20T12:49:08.854Z] [INFO] ------------------------------------------------------------------------
14:49:08 [2026-10-20T12:49:08.854Z] [INFO] Total time: 51.492 s
14:49:08 [2026-10-20T12:49:08.854Z] [INFO] Finished at: 2026-10-20T14:49:08+02:00
14:49:08 [2026-10-20T12:49:08.854Z] [INFO] ------------------------------------------------------------------------